myfaces-commits mailing list archives

Site index · List index
Message view « Date » · « Thread »
Top « Date » · « Thread »
From Apache Jenkins Server <jenk...@builds.apache.org>
Subject Build failed in Jenkins: tobago-1.5.x-deploy #10
Date Thu, 21 Jun 2012 02:58:10 GMT
See <https://builds.apache.org/job/tobago-1.5.x-deploy/10/changes>

Changes:

[lofwyr] TOBAGO-1154: Show a warning, if there is no JavaScript activated.
spelling

[bommel] Merged from trunk
(TOBAGO-1157)
Missing minimum height for selectManyShuttle [from revision 1351942]

[lofwyr] TOBAGO-1154: Show a warning, if there is no JavaScript activated.
there is no type attribute

[lofwyr] TOBAGO-1154: Show a warning, if there is no JavaScript activated.

[lofwyr] wrong case while rendering

[lofwyr] TOBAGO-1154: Show a warning, if there is no JavaScript activated.

[bommel] Merged from trunk
TOBAGO-1147
Avoid prepareRenderer call for unrendered Components during Ajax Call [from revision 1344633]

[lofwyr] TOBAGO-1134: Theme properties does not work with [markup] extension when there is
no default. [from revision 1349356]
Merged from trunk

[lofwyr] TOBAGO-1151: Define default values for preferredWidth
- merged

[lofwyr] TOBAGO-1148: Skip Layout processing for unrendered LayoutContainer [from revision
1349294] 
Merged from trunk

[lofwyr] Merged from trunk
TOBAGO-1151: Define default values for preferredWidth
- fixing the tests:
  - changed default
  - wrong escaping in JSPX files
 [from revision 1347997]

[lofwyr] TOBAGO-1151: Define default values for preferredWidth
- merged

[lofwyr] TOBAGO-1151: Define default values for preferredWidth
- merged

[lofwyr] TOBAGO-1151: Define default values for preferredWidth
- merged

[lofwyr] Merged from trunk
TOBAGO-1151: Define default values for preferredWidth
- tc:in
- tc:date
- tc:textarea [from revision 1347963]

[lofwyr] TOBAGO-1151: Define default values for preferredWidth
- merged

[lofwyr] Merged from trunk
TOBAGO-1151: Define default values for preferredWidth for tc:selectOneChoice [from revision
1347002]

[lofwyr] Merged from trunk
TOBAGO-1151: Define default values for preferredWidth for tc:selectOneChoice has been successfully
created. [from revision 1346957]

[lofwyr] TOBAGO-1152: The "var" attribute must not be a ValueExpression [from revision 1347914]
Merged from trunk

[lofwyr] Merged from trunk
add deprecated since version [from revision 1346273]

[lofwyr] Merged from trunk
checkstyle [from revision 1343799]

[lofwyr] Merged from trunk
checkstyle [from revision 1343791]

[lofwyr] Merged from trunk
spelling [from revision 1343719]

[lofwyr] Merged from trunk (Part 2)
Cleanup: Using correct type values for buttons. [from revision 1342533]

[lofwyr] Merged from trunk
Cleanup: Using correct type values for buttons. [from revision 1342533]

[lofwyr] Merged from trunk
Logging: Print a stack trace, if the closing tag name is not the estimated.
(This error is rare but important to see) [from revision 1342182]

------------------------------------------
[...truncated 35279 lines...]
[INFO] META-INF/LICENSE already added, skipping
[INFO] META-INF/DEPENDENCIES already added, skipping
[INFO] META-INF/NOTICE already added, skipping
[INFO] [assembly:single {execution: source-release-assembly}]
[INFO] Skipping the assembly in this project because it's not the Execution Root
[INFO] [install:install {execution: default-install}]
[INFO] Installing <https://builds.apache.org/job/tobago-1.5.x-deploy/ws/trunk-1.5.x-deploy/tobago-example/tobago-example-demo/target/tobago-example-demo.war>
to /export/home/hudson/hudson-slave/maven-repositories/0/org/apache/myfaces/tobago/tobago-example-demo/1.5.7-SNAPSHOT/tobago-example-demo-1.5.7-SNAPSHOT.war
[INFO] Installing <https://builds.apache.org/job/tobago-1.5.x-deploy/ws/trunk-1.5.x-deploy/tobago-example/tobago-example-demo/target/tobago-example-demo-javadoc.jar>
to /export/home/hudson/hudson-slave/maven-repositories/0/org/apache/myfaces/tobago/tobago-example-demo/1.5.7-SNAPSHOT/tobago-example-demo-1.5.7-SNAPSHOT-javadoc.jar
[INFO] Installing <https://builds.apache.org/job/tobago-1.5.x-deploy/ws/trunk-1.5.x-deploy/tobago-example/tobago-example-demo/target/tobago-example-demo-sources.jar>
to /export/home/hudson/hudson-slave/maven-repositories/0/org/apache/myfaces/tobago/tobago-example-demo/1.5.7-SNAPSHOT/tobago-example-demo-1.5.7-SNAPSHOT-sources.jar
[INFO] [deploy:deploy {execution: default-deploy}]
[INFO] Retrieving previous build number from apache.snapshots.https
[WARNING] *** CHECKSUM FAILED - Checksum failed on download: local = '9dba8b94cb2aef4954433589faf189d0eff9607e';
remote = 'e7f0dc88312a83b5450e923b6ce2aaa696556cbb' - RETRYING
[WARNING] *** CHECKSUM FAILED - Checksum failed on download: local = '9dba8b94cb2aef4954433589faf189d0eff9607e';
remote = 'e7f0dc88312a83b5450e923b6ce2aaa696556cbb' - IGNORING
Uploading: https://repository.apache.org/content/repositories/snapshots/org/apache/myfaces/tobago/tobago-example-demo/1.5.7-SNAPSHOT/tobago-example-demo-1.5.7-SNAPSHOT.war
7521K uploaded  (tobago-example-demo-1.5.7-SNAPSHOT.war)
[INFO] Retrieving previous metadata from apache.snapshots.https
[INFO] Uploading repository metadata for: 'artifact org.apache.myfaces.tobago:tobago-example-demo'
[INFO] Retrieving previous metadata from apache.snapshots.https
[WARNING] *** CHECKSUM FAILED - Checksum failed on download: local = '9dba8b94cb2aef4954433589faf189d0eff9607e';
remote = 'e7f0dc88312a83b5450e923b6ce2aaa696556cbb' - RETRYING
[WARNING] *** CHECKSUM FAILED - Checksum failed on download: local = '9dba8b94cb2aef4954433589faf189d0eff9607e';
remote = 'e7f0dc88312a83b5450e923b6ce2aaa696556cbb' - IGNORING
[INFO] Uploading repository metadata for: 'snapshot org.apache.myfaces.tobago:tobago-example-demo:1.5.7-SNAPSHOT'
[INFO] Uploading project information for tobago-example-demo 1.5.7-SNAPSHOT
[INFO] Retrieving previous build number from apache.snapshots.https
Uploading: https://repository.apache.org/content/repositories/snapshots/org/apache/myfaces/tobago/tobago-example-demo/1.5.7-SNAPSHOT/tobago-example-demo-1.5.7-SNAPSHOT-javadoc.jar
363K uploaded  (tobago-example-demo-1.5.7-SNAPSHOT-javadoc.jar)
[INFO] Retrieving previous build number from apache.snapshots.https
Uploading: https://repository.apache.org/content/repositories/snapshots/org/apache/myfaces/tobago/tobago-example-demo/1.5.7-SNAPSHOT/tobago-example-demo-1.5.7-SNAPSHOT-sources.jar
73K uploaded  (tobago-example-demo-1.5.7-SNAPSHOT-sources.jar)
[JENKINS] Archiving <https://builds.apache.org/job/tobago-1.5.x-deploy/ws/trunk-1.5.x-deploy/tobago-example/tobago-example-demo/target/tobago-example-demo-sources.jar>
to /home/hudson/hudson/jobs/tobago-1.5.x-deploy/modules/org.apache.myfaces.tobago$tobago-example-demo/builds/2012-06-21_00-27-45/archive/org.apache.myfaces.tobago/tobago-example-demo/1.5.7-SNAPSHOT/tobago-example-demo-1.5.7-SNAPSHOT-sources.jar
[INFO] ------------------------------------------------------------------------
[INFO] Building Tobago Example Non-Faces-Request
[INFO]    task-segment: [clean, animal-sniffer:check, deploy]
[INFO] ------------------------------------------------------------------------
[JENKINS] Recording test results
[INFO] [clean:clean {execution: default-clean}]
[INFO] [animal-sniffer:check {execution: default-cli}]
[INFO] Checking unresolved references to org.codehaus.mojo.signature:java15:1.0
[INFO] [enforcer:enforce {execution: enforce}]
[INFO] [buildnumber:create {execution: default}]
[INFO] [remote-resources:process {execution: default}]
[debug] execute contextualize
[INFO] [resources:resources {execution: default-resources}]
[INFO] Using 'UTF-8' encoding to copy filtered resources.
[INFO] skip non existing resourceDirectory <https://builds.apache.org/job/tobago-1.5.x-deploy/ws/trunk-1.5.x-deploy/tobago-example/tobago-example-nonfacesrequest/src/main/resources>
[INFO] Copying 3 resources
[INFO] [build-helper:add-source {execution: default}]
[INFO] Source directory: <https://builds.apache.org/job/tobago-1.5.x-deploy/ws/trunk-1.5.x-deploy/tobago-example/tobago-example-nonfacesrequest/src/main/java-jsf-1.2>
added.
[INFO] [compiler:compile {execution: default-compile}]
[INFO] Compiling 2 source files to <https://builds.apache.org/job/tobago-1.5.x-deploy/ws/trunk-1.5.x-deploy/tobago-example/tobago-example-nonfacesrequest/target/classes>
[debug] execute contextualize
[INFO] [resources:testResources {execution: default-testResources}]
[INFO] Using 'UTF-8' encoding to copy filtered resources.
[INFO] skip non existing resourceDirectory <https://builds.apache.org/job/tobago-1.5.x-deploy/ws/trunk-1.5.x-deploy/tobago-example/tobago-example-nonfacesrequest/src/test/resources>
[INFO] Copying 3 resources
[INFO] [compiler:testCompile {execution: default-testCompile}]
[INFO] No sources to compile
[INFO] [surefire:test {execution: default-test}]
[INFO] Surefire report directory: <https://builds.apache.org/job/tobago-1.5.x-deploy/ws/trunk-1.5.x-deploy/tobago-example/tobago-example-nonfacesrequest/target/surefire-reports>

-------------------------------------------------------
 T E S T S
-------------------------------------------------------
[JENKINS] Archiving <https://builds.apache.org/job/tobago-1.5.x-deploy/ws/trunk-1.5.x-deploy/tobago-example/tobago-example-nonfacesrequest/pom.xml>
to /home/hudson/hudson/jobs/tobago-1.5.x-deploy/modules/org.apache.myfaces.tobago$tobago-example-nonfacesrequest/builds/2012-06-21_00-27-45/archive/org.apache.myfaces.tobago/tobago-example-nonfacesrequest/1.5.7-SNAPSHOT/tobago-example-nonfacesrequest-1.5.7-SNAPSHOT.pom
Results :

Tests run: 0, Failures: 0, Errors: 0, Skipped: 0


[INFO] [war:war {execution: default-war}]
[INFO] Packaging webapp
[INFO] Assembling webapp [tobago-example-nonfacesrequest] in [<https://builds.apache.org/job/tobago-1.5.x-deploy/ws/trunk-1.5.x-deploy/tobago-example/tobago-example-nonfacesrequest/target/tobago-example-nonfacesrequest]>
[INFO] Processing war project
[INFO] Copying webapp resources [<https://builds.apache.org/job/tobago-1.5.x-deploy/ws/trunk-1.5.x-deploy/tobago-example/tobago-example-nonfacesrequest/src/main/webapp]>
[INFO] Webapp assembled in [106 msecs]
[INFO] Building war: <https://builds.apache.org/job/tobago-1.5.x-deploy/ws/trunk-1.5.x-deploy/tobago-example/tobago-example-nonfacesrequest/target/tobago-example-nonfacesrequest.war>
[INFO] WEB-INF/web.xml already added, skipping
[INFO] [javadoc:jar {execution: attach-javadoc}]
[JENKINS] Archiving <https://builds.apache.org/job/tobago-1.5.x-deploy/ws/trunk-1.5.x-deploy/tobago-example/tobago-example-nonfacesrequest/target/tobago-example-nonfacesrequest.war>
to /home/hudson/hudson/jobs/tobago-1.5.x-deploy/modules/org.apache.myfaces.tobago$tobago-example-nonfacesrequest/builds/2012-06-21_00-27-45/archive/org.apache.myfaces.tobago/tobago-example-nonfacesrequest/1.5.7-SNAPSHOT/tobago-example-nonfacesrequest-1.5.7-SNAPSHOT.war
[INFO] 
DroidDoc took 5 sec. to write docs to <https://builds.apache.org/job/tobago-1.5.x-deploy/ws/trunk-1.5.x-deploy/tobago-example/tobago-example-nonfacesrequest/target/apidocs>
[INFO] Building jar: <https://builds.apache.org/job/tobago-1.5.x-deploy/ws/trunk-1.5.x-deploy/tobago-example/tobago-example-nonfacesrequest/target/tobago-example-nonfacesrequest-javadoc.jar>
[INFO] Preparing source:jar
[WARNING] Removing: jar from forked lifecycle, to prevent recursive invocation.
[JENKINS] Archiving <https://builds.apache.org/job/tobago-1.5.x-deploy/ws/trunk-1.5.x-deploy/tobago-example/tobago-example-nonfacesrequest/target/tobago-example-nonfacesrequest-javadoc.jar>
to /home/hudson/hudson/jobs/tobago-1.5.x-deploy/modules/org.apache.myfaces.tobago$tobago-example-nonfacesrequest/builds/2012-06-21_00-27-45/archive/org.apache.myfaces.tobago/tobago-example-nonfacesrequest/1.5.7-SNAPSHOT/tobago-example-nonfacesrequest-1.5.7-SNAPSHOT-javadoc.jar
[INFO] [enforcer:enforce {execution: enforce}]
[INFO] [buildnumber:create {execution: default}]
[INFO] [source:jar {execution: attach-source}]
[INFO] META-INF already added, skipping
[INFO] META-INF/NOTICE already added, skipping
[INFO] META-INF/DEPENDENCIES already added, skipping
[INFO] META-INF/LICENSE already added, skipping
[INFO] Building jar: <https://builds.apache.org/job/tobago-1.5.x-deploy/ws/trunk-1.5.x-deploy/tobago-example/tobago-example-nonfacesrequest/target/tobago-example-nonfacesrequest-sources.jar>
[INFO] META-INF already added, skipping
[INFO] META-INF/NOTICE already added, skipping
[INFO] META-INF/DEPENDENCIES already added, skipping
[INFO] META-INF/LICENSE already added, skipping
[INFO] [assembly:single {execution: source-release-assembly}]
[INFO] Skipping the assembly in this project because it's not the Execution Root
[INFO] [install:install {execution: default-install}]
[INFO] Installing <https://builds.apache.org/job/tobago-1.5.x-deploy/ws/trunk-1.5.x-deploy/tobago-example/tobago-example-nonfacesrequest/target/tobago-example-nonfacesrequest.war>
to /export/home/hudson/hudson-slave/maven-repositories/0/org/apache/myfaces/tobago/tobago-example-nonfacesrequest/1.5.7-SNAPSHOT/tobago-example-nonfacesrequest-1.5.7-SNAPSHOT.war
[INFO] Installing <https://builds.apache.org/job/tobago-1.5.x-deploy/ws/trunk-1.5.x-deploy/tobago-example/tobago-example-nonfacesrequest/target/tobago-example-nonfacesrequest-javadoc.jar>
to /export/home/hudson/hudson-slave/maven-repositories/0/org/apache/myfaces/tobago/tobago-example-nonfacesrequest/1.5.7-SNAPSHOT/tobago-example-nonfacesrequest-1.5.7-SNAPSHOT-javadoc.jar
[INFO] Installing <https://builds.apache.org/job/tobago-1.5.x-deploy/ws/trunk-1.5.x-deploy/tobago-example/tobago-example-nonfacesrequest/target/tobago-example-nonfacesrequest-sources.jar>
to /export/home/hudson/hudson-slave/maven-repositories/0/org/apache/myfaces/tobago/tobago-example-nonfacesrequest/1.5.7-SNAPSHOT/tobago-example-nonfacesrequest-1.5.7-SNAPSHOT-sources.jar
[INFO] [deploy:deploy {execution: default-deploy}]
[INFO] Retrieving previous build number from apache.snapshots.https
[WARNING] *** CHECKSUM FAILED - Checksum failed on download: local = '13584ba80bc446a7711b4fa9819ee54ae5bd1da4';
remote = '35fae27f854da0aa6ef8de35ec44ccfc3a3c0f2d' - RETRYING
[WARNING] *** CHECKSUM FAILED - Checksum failed on download: local = '13584ba80bc446a7711b4fa9819ee54ae5bd1da4';
remote = '35fae27f854da0aa6ef8de35ec44ccfc3a3c0f2d' - IGNORING
Uploading: https://repository.apache.org/content/repositories/snapshots/org/apache/myfaces/tobago/tobago-example-nonfacesrequest/1.5.7-SNAPSHOT/tobago-example-nonfacesrequest-1.5.7-SNAPSHOT.war
4223K uploaded  (tobago-example-nonfacesrequest-1.5.7-SNAPSHOT.war)
[INFO] Retrieving previous metadata from apache.snapshots.https
[WARNING] *** CHECKSUM FAILED - Checksum failed on download: local = '13584ba80bc446a7711b4fa9819ee54ae5bd1da4';
remote = '35fae27f854da0aa6ef8de35ec44ccfc3a3c0f2d' - RETRYING
[WARNING] *** CHECKSUM FAILED - Checksum failed on download: local = '13584ba80bc446a7711b4fa9819ee54ae5bd1da4';
remote = '35fae27f854da0aa6ef8de35ec44ccfc3a3c0f2d' - IGNORING
[INFO] Uploading repository metadata for: 'snapshot org.apache.myfaces.tobago:tobago-example-nonfacesrequest:1.5.7-SNAPSHOT'
[INFO] Uploading project information for tobago-example-nonfacesrequest 1.5.7-SNAPSHOT
[INFO] Retrieving previous metadata from apache.snapshots.https
[INFO] Uploading repository metadata for: 'artifact org.apache.myfaces.tobago:tobago-example-nonfacesrequest'
[INFO] Retrieving previous build number from apache.snapshots.https
Uploading: https://repository.apache.org/content/repositories/snapshots/org/apache/myfaces/tobago/tobago-example-nonfacesrequest/1.5.7-SNAPSHOT/tobago-example-nonfacesrequest-1.5.7-SNAPSHOT-javadoc.jar
119K uploaded  (tobago-example-nonfacesrequest-1.5.7-SNAPSHOT-javadoc.jar)
[INFO] Retrieving previous build number from apache.snapshots.https
Uploading: https://repository.apache.org/content/repositories/snapshots/org/apache/myfaces/tobago/tobago-example-nonfacesrequest/1.5.7-SNAPSHOT/tobago-example-nonfacesrequest-1.5.7-SNAPSHOT-sources.jar
8K uploaded  (tobago-example-nonfacesrequest-1.5.7-SNAPSHOT-sources.jar)
[JENKINS] Archiving <https://builds.apache.org/job/tobago-1.5.x-deploy/ws/trunk-1.5.x-deploy/tobago-example/tobago-example-nonfacesrequest/target/tobago-example-nonfacesrequest-sources.jar>
to /home/hudson/hudson/jobs/tobago-1.5.x-deploy/modules/org.apache.myfaces.tobago$tobago-example-nonfacesrequest/builds/2012-06-21_00-27-45/archive/org.apache.myfaces.tobago/tobago-example-nonfacesrequest/1.5.7-SNAPSHOT/tobago-example-nonfacesrequest-1.5.7-SNAPSHOT-sources.jar
[INFO] ------------------------------------------------------------------------
[INFO] Building Tobago Example Experimental
[INFO]    task-segment: [clean, animal-sniffer:check, deploy]
[INFO] ------------------------------------------------------------------------
[JENKINS] Recording test results
[INFO] [clean:clean {execution: default-clean}]
[INFO] [animal-sniffer:check {execution: default-cli}]
[INFO] Checking unresolved references to org.codehaus.mojo.signature:java15:1.0
[INFO] [enforcer:enforce {execution: enforce}]
[INFO] [buildnumber:create {execution: default}]
[INFO] [remote-resources:process {execution: default}]
[debug] execute contextualize
[INFO] [resources:resources {execution: default-resources}]
[INFO] Using 'UTF-8' encoding to copy filtered resources.
[INFO] skip non existing resourceDirectory <https://builds.apache.org/job/tobago-1.5.x-deploy/ws/trunk-1.5.x-deploy/tobago-example/tobago-example-experimental/src/main/resources>
[INFO] Copying 3 resources
[INFO] [build-helper:add-source {execution: default}]
[INFO] Source directory: <https://builds.apache.org/job/tobago-1.5.x-deploy/ws/trunk-1.5.x-deploy/tobago-example/tobago-example-experimental/src/main/java-jsf-1.2>
added.
[INFO] [compiler:compile {execution: default-compile}]
[INFO] Compiling 10 source files to <https://builds.apache.org/job/tobago-1.5.x-deploy/ws/trunk-1.5.x-deploy/tobago-example/tobago-example-experimental/target/classes>
[debug] execute contextualize
[INFO] [resources:testResources {execution: default-testResources}]
[INFO] Using 'UTF-8' encoding to copy filtered resources.
[INFO] skip non existing resourceDirectory <https://builds.apache.org/job/tobago-1.5.x-deploy/ws/trunk-1.5.x-deploy/tobago-example/tobago-example-experimental/src/test/resources>
[INFO] Copying 3 resources
[INFO] [compiler:testCompile {execution: default-testCompile}]
[INFO] No sources to compile
[INFO] [surefire:test {execution: default-test}]
[INFO] Surefire report directory: <https://builds.apache.org/job/tobago-1.5.x-deploy/ws/trunk-1.5.x-deploy/tobago-example/tobago-example-experimental/target/surefire-reports>

-------------------------------------------------------
 T E S T S
-------------------------------------------------------

Results :

Tests run: 0, Failures: 0, Errors: 0, Skipped: 0

[INFO] [war:war {execution: default-war}]
[INFO] Packaging webapp
[INFO] Assembling webapp [tobago-example-experimental] in [<https://builds.apache.org/job/tobago-1.5.x-deploy/ws/trunk-1.5.x-deploy/tobago-example/tobago-example-experimental/target/tobago-example-experimental]>
[INFO] Processing war project
[INFO] Copying webapp resources [<https://builds.apache.org/job/tobago-1.5.x-deploy/ws/trunk-1.5.x-deploy/tobago-example/tobago-example-experimental/src/main/webapp]>
[INFO] Webapp assembled in [2283 msecs]
[INFO] Building war: <https://builds.apache.org/job/tobago-1.5.x-deploy/ws/trunk-1.5.x-deploy/tobago-example/tobago-example-experimental/target/tobago-example-experimental.war>
[JENKINS] Archiving <https://builds.apache.org/job/tobago-1.5.x-deploy/ws/trunk-1.5.x-deploy/tobago-example/tobago-example-experimental/pom.xml>
to /home/hudson/hudson/jobs/tobago-1.5.x-deploy/modules/org.apache.myfaces.tobago$tobago-example-experimental/builds/2012-06-21_00-27-46/archive/org.apache.myfaces.tobago/tobago-example-experimental/1.5.7-SNAPSHOT/tobago-example-experimental-1.5.7-SNAPSHOT.pom
[INFO] WEB-INF/web.xml already added, skipping
[INFO] [javadoc:jar {execution: attach-javadoc}]
[JENKINS] Archiving <https://builds.apache.org/job/tobago-1.5.x-deploy/ws/trunk-1.5.x-deploy/tobago-example/tobago-example-experimental/target/tobago-example-experimental.war>
to /home/hudson/hudson/jobs/tobago-1.5.x-deploy/modules/org.apache.myfaces.tobago$tobago-example-experimental/builds/2012-06-21_00-27-46/archive/org.apache.myfaces.tobago/tobago-example-experimental/1.5.7-SNAPSHOT/tobago-example-experimental-1.5.7-SNAPSHOT.war
[INFO] 
DroidDoc took 6 sec. to write docs to <https://builds.apache.org/job/tobago-1.5.x-deploy/ws/trunk-1.5.x-deploy/tobago-example/tobago-example-experimental/target/apidocs>
[INFO] Building jar: <https://builds.apache.org/job/tobago-1.5.x-deploy/ws/trunk-1.5.x-deploy/tobago-example/tobago-example-experimental/target/tobago-example-experimental-javadoc.jar>
[INFO] Preparing source:jar
[WARNING] Removing: jar from forked lifecycle, to prevent recursive invocation.
[JENKINS] Archiving <https://builds.apache.org/job/tobago-1.5.x-deploy/ws/trunk-1.5.x-deploy/tobago-example/tobago-example-experimental/target/tobago-example-experimental-javadoc.jar>
to /home/hudson/hudson/jobs/tobago-1.5.x-deploy/modules/org.apache.myfaces.tobago$tobago-example-experimental/builds/2012-06-21_00-27-46/archive/org.apache.myfaces.tobago/tobago-example-experimental/1.5.7-SNAPSHOT/tobago-example-experimental-1.5.7-SNAPSHOT-javadoc.jar
[INFO] [enforcer:enforce {execution: enforce}]
[INFO] [buildnumber:create {execution: default}]
Build timed out (after 150 minutes). Marking the build as failed.
Sending e-mails to: commits@myfaces.apache.org
[INFO] ------------------------------------------------------------------------
[ERROR] FATAL ERROR
[INFO] ------------------------------------------------------------------------
channel stopped
[INFO] hudson.remoting.RequestAbortedException: hudson.remoting.Channel$OrderlyShutdown
[INFO] ------------------------------------------------------------------------
[INFO] Trace
hudson.remoting.RequestAbortedException: hudson.remoting.RequestAbortedException: hudson.remoting.Channel$OrderlyShutdown
	at hudson.remoting.Request.call(Request.java:149)
	at hudson.remoting.Channel.call(Channel.java:646)
	at hudson.remoting.RemoteInvocationHandler.invoke(RemoteInvocationHandler.java:158)
	at $Proxy2.isArchivingDisabled(Unknown Source)
	at hudson.maven.MavenBuildProxy$Filter.isArchivingDisabled(MavenBuildProxy.java:227)
	at hudson.maven.reporters.MavenArtifact.archive(MavenArtifact.java:223)
	at hudson.maven.reporters.MavenArtifactArchiver.postBuild(MavenArtifactArchiver.java:108)
	at hudson.maven.Maven2Builder.postModule(Maven2Builder.java:127)
	at hudson.maven.MavenBuilder$Adapter.fireLeaveModule(MavenBuilder.java:327)
	at hudson.maven.MavenBuilder$Adapter.postBuild(MavenBuilder.java:285)
	at org.apache.maven.lifecycle.LifecycleExecutorInterceptor.execute(LifecycleExecutorInterceptor.java:68)
	at org.apache.maven.DefaultMaven.doExecute(DefaultMaven.java:328)
	at org.apache.maven.DefaultMaven.execute(DefaultMaven.java:138)
	at org.apache.maven.cli.MavenCli.main(MavenCli.java:362)
	at sun.reflect.NativeMethodAccessorImpl.invoke0(Native Method)
	at sun.reflect.NativeMethodAccessorImpl.invoke(NativeMethodAccessorImpl.java:39)
	at sun.reflect.DelegatingMethodAccessorImpl.invoke(DelegatingMethodAccessorImpl.java:25)
	at java.lang.reflect.Method.invoke(Method.java:597)
	at org.codehaus.classworlds.Launcher.launchEnhanced(Launcher.java:315)
	at org.codehaus.classworlds.Launcher.launch(Launcher.java:255)
	at hudson.maven.agent.Main.launch(Main.java:185)
	at hudson.maven.MavenBuilder.call(MavenBuilder.java:151)
	at hudson.maven.Maven2Builder.call(Maven2Builder.java:77)
	at hudson.maven.Maven2Builder.call(Maven2Builder.java:53)
	at hudson.remoting.UserRequest.perform(UserRequest.java:118)
	at hudson.remoting.UserRequest.perform(UserRequest.java:48)
	at hudson.remoting.Request$2.run(Request.java:287)
	at hudson.remoting.InterceptingExecutorService$1.call(InterceptingExecutorService.java:72)
	at java.util.concurrent.FutureTask$Sync.innerRun(FutureTask.java:303)
	at java.util.concurrent.FutureTask.run(FutureTask.java:138)
	at java.util.concurrent.ThreadPoolExecutor$Worker.runTask(ThreadPoolExecutor.java:886)
	at java.util.concurrent.ThreadPoolExecutor$Worker.run(ThreadPoolExecutor.java:908)
	at java.lang.Thread.run(Thread.java:662)
Caused by: hudson.remoting.RequestAbortedException: hudson.remoting.Channel$OrderlyShutdown
	at hudson.remoting.Request.abort(Request.java:273)
	at hudson.remoting.Channel.terminate(Channel.java:702)
	at hudson.remoting.Channel$CloseCommand.execute(Channel.java:818)
	at hudson.remoting.Channel$1.handle(Channel.java:416)
	at hudson.remoting.SynchronousCommandTransport$ReaderThread.run(SynchronousCommandTransport.java:60)
Caused by: hudson.remoting.Channel$OrderlyShutdown
	... 3 more
Caused by: Command close created at
	at hudson.remoting.Command.<init>(Command.java:54)
	at hudson.remoting.Channel$CloseCommand.<init>(Channel.java:812)
	at hudson.remoting.Channel$CloseCommand.<init>(Channel.java:810)
	at hudson.remoting.Channel.close(Channel.java:877)
	at hudson.remoting.Channel.close(Channel.java:860)
	at hudson.slaves.Channels$1.close(Channels.java:91)
	at hudson.maven.ProcessCache$MavenProcess.discard(ProcessCache.java:145)
	at hudson.maven.MavenModuleSetBuild$MavenModuleSetBuildExecution.doRun(MavenModuleSetBuild.java:796)
	at hudson.model.AbstractBuild$AbstractBuildExecution.run(AbstractBuild.java:499)
	at hudson.model.Run.execute(Run.java:1460)
	at hudson.maven.MavenModuleSetBuild.run(MavenModuleSetBuild.java:477)
	at hudson.model.ResourceController.execute(ResourceController.java:88)
	at hudson.model.Executor.run(Executor.java:239)
[INFO] ------------------------------------------------------------------------
[INFO] Total time: 143 minutes 26 seconds
[INFO] Finished at: Thu Jun 21 02:57:37 GMT+00:00 2012
[INFO] Final Memory: 164M/501M
[INFO] ------------------------------------------------------------------------

Mime
View raw message