myfaces-commits mailing list archives

Site index · List index
Message view « Date » · « Thread »
Top « Date » · « Thread »
From Apache Jenkins Server <jenk...@builds.apache.org>
Subject Build failed in Jenkins: myfaces-maven-achetypes #116
Date Sun, 01 Jul 2012 00:32:43 GMT
See <https://builds.apache.org/job/myfaces-maven-achetypes/116/>

------------------------------------------
[...truncated 1366 lines...]
[INFO] Installing <https://builds.apache.org/job/myfaces-maven-achetypes/ws/maven2-archetypes/myfaces-archetype-codi-jsf12/pom.xml>
to /home/hudson/hudson-slave/maven-repositories/1/org/apache/myfaces/buildtools/myfaces-archetype-codi-jsf12/1.0.5-SNAPSHOT/myfaces-archetype-codi-jsf12-1.0.5-SNAPSHOT.pom

[INFO] 
[INFO] --- maven-install-plugin:2.3.1:install (default-install) @ myfaces-archetype-codi-jsf12
---
mojoSucceeded org.apache.maven.plugins:maven-install-plugin:2.3.1(default-install)
projectSucceeded org.apache.myfaces.buildtools:myfaces-archetype-codi-jsf12:1.0.5-SNAPSHOT
projectStarted org.apache.myfaces.buildtools:myfaces-archetype-codi-jsf20:1.0.5-SNAPSHOT
[INFO]                                                                         
[INFO] ------------------------------------------------------------------------
[INFO] Building MyFaces CODI Archetype for JSF 2.0 1.0.5-SNAPSHOT
[INFO] ------------------------------------------------------------------------
mojoStarted org.apache.maven.plugins:maven-remote-resources-plugin:1.2.1(default)
[INFO] 
[INFO] --- maven-remote-resources-plugin:1.2.1:process (default) @ myfaces-archetype-codi-jsf20
---
mojoSucceeded org.apache.maven.plugins:maven-remote-resources-plugin:1.2.1(default)
mojoStarted org.apache.maven.plugins:maven-resources-plugin:2.5(default-resources)[debug]
execute contextualize
[INFO] Using 'UTF-8' encoding to copy filtered resources.
[INFO] Copying 0 resource to META-INF
[INFO] Copying 13 resources
[INFO] Copying 3 resources

[INFO] 
[INFO] --- maven-resources-plugin:2.5:resources (default-resources) @ myfaces-archetype-codi-jsf20
---
mojoSucceeded org.apache.maven.plugins:maven-resources-plugin:2.5(default-resources)
mojoStarted org.apache.maven.plugins:maven-compiler-plugin:2.3.2(default-compile)[INFO] No
sources to compile

[INFO] 
[INFO] --- maven-compiler-plugin:2.3.2:compile (default-compile) @ myfaces-archetype-codi-jsf20
---
mojoSucceeded org.apache.maven.plugins:maven-compiler-plugin:2.3.2(default-compile)
[debug] execute contextualize
mojoStarted org.apache.maven.plugins:maven-resources-plugin:2.5(default-testResources)[INFO]
Using 'UTF-8' encoding to copy filtered resources.
[INFO] skip non existing resourceDirectory <https://builds.apache.org/job/myfaces-maven-achetypes/ws/maven2-archetypes/myfaces-archetype-codi-jsf20/src/test/resources>
[INFO] Copying 3 resources

[INFO] 
[INFO] --- maven-resources-plugin:2.5:testResources (default-testResources) @ myfaces-archetype-codi-jsf20
---
mojoSucceeded org.apache.maven.plugins:maven-resources-plugin:2.5(default-testResources)
mojoStarted org.apache.maven.plugins:maven-compiler-plugin:2.3.2(default-testCompile)[INFO]
No sources to compile

[INFO] 
[INFO] --- maven-compiler-plugin:2.3.2:testCompile (default-testCompile) @ myfaces-archetype-codi-jsf20
---
mojoSucceeded org.apache.maven.plugins:maven-compiler-plugin:2.3.2(default-testCompile)
mojoStarted org.apache.maven.plugins:maven-surefire-plugin:2.9(default-test)[INFO] Surefire
report directory: <https://builds.apache.org/job/myfaces-maven-achetypes/ws/maven2-archetypes/myfaces-archetype-codi-jsf20/target/surefire-reports>

-------------------------------------------------------
 T E S T S
-------------------------------------------------------

[INFO] 
[INFO] --- maven-surefire-plugin:2.9:test (default-test) @ myfaces-archetype-codi-jsf20 ---

Results :

Tests run: 0, Failures: 0, Errors: 0, Skipped: 0

mojoSucceeded org.apache.maven.plugins:maven-surefire-plugin:2.9(default-test)
[JENKINS] Recording test results
mojoStarted org.apache.maven.plugins:maven-jar-plugin:2.3.2(default-jar)
[INFO] [INFO] Building jar: <https://builds.apache.org/job/myfaces-maven-achetypes/ws/maven2-archetypes/myfaces-archetype-codi-jsf20/target/myfaces-archetype-codi-jsf20-1.0.5-SNAPSHOT.jar>

[INFO] --- maven-jar-plugin:2.3.2:jar (default-jar) @ myfaces-archetype-codi-jsf20 ---
mojoSucceeded org.apache.maven.plugins:maven-jar-plugin:2.3.2(default-jar)
mojoStarted org.apache.maven.plugins:maven-site-plugin:3.0(attach-descriptor)
[INFO] 
[INFO] --- maven-site-plugin:3.0:attach-descriptor (attach-descriptor) @ myfaces-archetype-codi-jsf20
---
mojoSucceeded org.apache.maven.plugins:maven-site-plugin:3.0(attach-descriptor)
mojoStarted org.apache.maven.plugins:maven-checkstyle-plugin:2.7(verify-style)
[INFO] 
[INFO] --- maven-checkstyle-plugin:2.7:check (verify-style) @ myfaces-archetype-codi-jsf20
---
[INFO] 
mojoSucceeded org.apache.maven.plugins:maven-checkstyle-plugin:2.7(verify-style)
mojoStarted org.apache.maven.plugins:maven-install-plugin:2.3.1(default-install)[INFO] Installing
<https://builds.apache.org/job/myfaces-maven-achetypes/ws/maven2-archetypes/myfaces-archetype-codi-jsf20/target/myfaces-archetype-codi-jsf20-1.0.5-SNAPSHOT.jar>
to /home/hudson/hudson-slave/maven-repositories/1/org/apache/myfaces/buildtools/myfaces-archetype-codi-jsf20/1.0.5-SNAPSHOT/myfaces-archetype-codi-jsf20-1.0.5-SNAPSHOT.jar
[INFO] Installing <https://builds.apache.org/job/myfaces-maven-achetypes/ws/maven2-archetypes/myfaces-archetype-codi-jsf20/pom.xml>
to /home/hudson/hudson-slave/maven-repositories/1/org/apache/myfaces/buildtools/myfaces-archetype-codi-jsf20/1.0.5-SNAPSHOT/myfaces-archetype-codi-jsf20-1.0.5-SNAPSHOT.pom

[INFO] 
[INFO] --- maven-install-plugin:2.3.1:install (default-install) @ myfaces-archetype-codi-jsf20
---
mojoSucceeded org.apache.maven.plugins:maven-install-plugin:2.3.1(default-install)
projectSucceeded org.apache.myfaces.buildtools:myfaces-archetype-codi-jsf20:1.0.5-SNAPSHOT
projectStarted org.apache.myfaces.buildtools:myfaces-archetype-core-integration-test:1.0.5-SNAPSHOT
[INFO]                                                                         
[INFO] ------------------------------------------------------------------------
[INFO] Building MyFaces Core Integration Test Archetype 1.0.5-SNAPSHOT
[INFO] ------------------------------------------------------------------------
mojoStarted org.apache.maven.plugins:maven-remote-resources-plugin:1.2.1(default)
[INFO] 
[INFO] --- maven-remote-resources-plugin:1.2.1:process (default) @ myfaces-archetype-core-integration-test
---
mojoSucceeded org.apache.maven.plugins:maven-remote-resources-plugin:1.2.1(default)
[debug] execute contextualize
mojoStarted org.apache.maven.plugins:maven-resources-plugin:2.5(default-resources)[INFO] Using
'UTF-8' encoding to copy filtered resources.
[INFO] Copying 0 resource to META-INF
[INFO] Copying 8 resources
[INFO] Copying 3 resources

[INFO] 
[INFO] --- maven-resources-plugin:2.5:resources (default-resources) @ myfaces-archetype-core-integration-test
---
mojoSucceeded org.apache.maven.plugins:maven-resources-plugin:2.5(default-resources)
mojoStarted org.apache.maven.plugins:maven-compiler-plugin:2.3.2(default-compile)[INFO] No
sources to compile

[INFO] 
[INFO] --- maven-compiler-plugin:2.3.2:compile (default-compile) @ myfaces-archetype-core-integration-test
---
mojoSucceeded org.apache.maven.plugins:maven-compiler-plugin:2.3.2(default-compile)
[debug] execute contextualize
mojoStarted org.apache.maven.plugins:maven-resources-plugin:2.5(default-testResources)[INFO]
Using 'UTF-8' encoding to copy filtered resources.
[INFO] skip non existing resourceDirectory <https://builds.apache.org/job/myfaces-maven-achetypes/ws/maven2-archetypes/myfaces-archetype-core-integration-test/src/test/resources>
[INFO] Copying 3 resources

[INFO] 
[INFO] --- maven-resources-plugin:2.5:testResources (default-testResources) @ myfaces-archetype-core-integration-test
---
mojoSucceeded org.apache.maven.plugins:maven-resources-plugin:2.5(default-testResources)
mojoStarted org.apache.maven.plugins:maven-compiler-plugin:2.3.2(default-testCompile)[INFO]
No sources to compile

[INFO] 
[INFO] --- maven-compiler-plugin:2.3.2:testCompile (default-testCompile) @ myfaces-archetype-core-integration-test
---
mojoSucceeded org.apache.maven.plugins:maven-compiler-plugin:2.3.2(default-testCompile)
mojoStarted org.apache.maven.plugins:maven-surefire-plugin:2.9(default-test)[INFO] Surefire
report directory: <https://builds.apache.org/job/myfaces-maven-achetypes/ws/maven2-archetypes/myfaces-archetype-core-integration-test/target/surefire-reports>

-------------------------------------------------------
 T E S T S
-------------------------------------------------------

[INFO] 
[INFO] --- maven-surefire-plugin:2.9:test (default-test) @ myfaces-archetype-core-integration-test
---

Results :

Tests run: 0, Failures: 0, Errors: 0, Skipped: 0

mojoSucceeded org.apache.maven.plugins:maven-surefire-plugin:2.9(default-test)
[JENKINS] Recording test results
mojoStarted org.apache.maven.plugins:maven-jar-plugin:2.3.2(default-jar)
[INFO] [INFO] Building jar: <https://builds.apache.org/job/myfaces-maven-achetypes/ws/maven2-archetypes/myfaces-archetype-core-integration-test/target/myfaces-archetype-core-integration-test-1.0.5-SNAPSHOT.jar>

[INFO] --- maven-jar-plugin:2.3.2:jar (default-jar) @ myfaces-archetype-core-integration-test
---
mojoSucceeded org.apache.maven.plugins:maven-jar-plugin:2.3.2(default-jar)
mojoStarted org.apache.maven.plugins:maven-site-plugin:3.0(attach-descriptor)
[INFO] 
[INFO] --- maven-site-plugin:3.0:attach-descriptor (attach-descriptor) @ myfaces-archetype-core-integration-test
---
mojoSucceeded org.apache.maven.plugins:maven-site-plugin:3.0(attach-descriptor)
mojoStarted org.apache.maven.plugins:maven-checkstyle-plugin:2.7(verify-style)
[INFO] 
[INFO] --- maven-checkstyle-plugin:2.7:check (verify-style) @ myfaces-archetype-core-integration-test
---
[INFO] 
mojoSucceeded org.apache.maven.plugins:maven-checkstyle-plugin:2.7(verify-style)
mojoStarted org.apache.maven.plugins:maven-install-plugin:2.3.1(default-install)[INFO] Installing
<https://builds.apache.org/job/myfaces-maven-achetypes/ws/maven2-archetypes/myfaces-archetype-core-integration-test/target/myfaces-archetype-core-integration-test-1.0.5-SNAPSHOT.jar>
to /home/hudson/hudson-slave/maven-repositories/1/org/apache/myfaces/buildtools/myfaces-archetype-core-integration-test/1.0.5-SNAPSHOT/myfaces-archetype-core-integration-test-1.0.5-SNAPSHOT.jar
[INFO] Installing <https://builds.apache.org/job/myfaces-maven-achetypes/ws/maven2-archetypes/myfaces-archetype-core-integration-test/pom.xml>
to /home/hudson/hudson-slave/maven-repositories/1/org/apache/myfaces/buildtools/myfaces-archetype-core-integration-test/1.0.5-SNAPSHOT/myfaces-archetype-core-integration-test-1.0.5-SNAPSHOT.pom

[INFO] 
[INFO] --- maven-install-plugin:2.3.1:install (default-install) @ myfaces-archetype-core-integration-test
---
mojoSucceeded org.apache.maven.plugins:maven-install-plugin:2.3.1(default-install)
projectSucceeded org.apache.myfaces.buildtools:myfaces-archetype-core-integration-test:1.0.5-SNAPSHOT
sessionEnded
[INFO] ------------------------------------------------------------------------
[INFO] Reactor Summary:
[INFO] 
[INFO] Apache MyFaces Buildtools Maven2 Archetype Parent . SUCCESS [18.809s]
[INFO] MyFaces Basic Archetype ........................... SUCCESS [3.317s]
[INFO] MyFaces 2.0 Basic Archetype ....................... SUCCESS [1.685s]
[INFO] MyFaces 2.0 Basic Debug Archetype ................. SUCCESS [1.835s]
[INFO] MyFaces 2.0 and OWB Basic Archetype ............... SUCCESS [2.822s]
[INFO] MyFaces Facelets Archetype ........................ SUCCESS [1.893s]
[INFO] MyFaces Portlet Archetype ......................... SUCCESS [1.729s]
[INFO] MyFaces Trinidad Archetype ........................ SUCCESS [1.667s]
[INFO] MyFaces Trinidad 2.0 Archetype .................... SUCCESS [1.684s]
[INFO] JSF Component Library Archetype ................... SUCCESS [1.814s]
[INFO] JSF Component Library Archetype For JSF 2.0 ....... SUCCESS [1.940s]
[INFO] MyFaces CODI Archetype for JSF 1.2 ................ SUCCESS [1.672s]
[INFO] MyFaces CODI Archetype for JSF 2.0 ................ SUCCESS [1.689s]
[INFO] MyFaces Core Integration Test Archetype ........... SUCCESS [1.692s]
[INFO] ------------------------------------------------------------------------
[INFO] BUILD SUCCESS
[INFO] ------------------------------------------------------------------------
[INFO] Total time: 48.065s
[INFO] Finished at: Sun Jul 01 00:32:30 UTC 2012
[INFO] Final Memory: 16M/76M
[INFO] ------------------------------------------------------------------------
Projects to build: [MavenProject: org.apache.myfaces.buildtools:myfaces-archetype-parent:1.0.5-SNAPSHOT
@ <https://builds.apache.org/job/myfaces-maven-achetypes/ws/maven2-archetypes/pom.xml,>
MavenProject: org.apache.myfaces.buildtools:myfaces-archetype-helloworld:1.0.5-SNAPSHOT @
<https://builds.apache.org/job/myfaces-maven-achetypes/ws/maven2-archetypes/myfaces-archetype-helloworld/pom.xml,>
MavenProject: org.apache.myfaces.buildtools:myfaces-archetype-helloworld20:1.0.5-SNAPSHOT
@ <https://builds.apache.org/job/myfaces-maven-achetypes/ws/maven2-archetypes/myfaces-archetype-helloworld20/pom.xml,>
MavenProject: org.apache.myfaces.buildtools:myfaces-archetype-helloworld20-debug:1.0.5-SNAPSHOT
@ <https://builds.apache.org/job/myfaces-maven-achetypes/ws/maven2-archetypes/myfaces-archetype-helloworld20-debug/pom.xml,>
MavenProject: org.apache.myfaces.buildtools:myfaces-archetype-helloworld20-owb:1.0.5-SNAPSHOT
@ <https://builds.apache.org/job/myfaces-maven-achetypes/ws/maven2-archetypes/myfaces-archetype-helloworld20-owb/pom.xml,>
MavenProject: org.apache.myfaces.buildtools:myfaces-archetype-helloworld-facelets:1.0.5-SNAPSHOT
@ <https://builds.apache.org/job/myfaces-maven-achetypes/ws/maven2-archetypes/myfaces-archetype-helloworld-facelets/pom.xml,>
MavenProject: org.apache.myfaces.buildtools:myfaces-archetype-helloworld-portlets:1.0.5-SNAPSHOT
@ <https://builds.apache.org/job/myfaces-maven-achetypes/ws/maven2-archetypes/myfaces-archetype-helloworld-portlets/pom.xml,>
MavenProject: org.apache.myfaces.buildtools:myfaces-archetype-trinidad:1.0.5-SNAPSHOT @ <https://builds.apache.org/job/myfaces-maven-achetypes/ws/maven2-archetypes/myfaces-archetype-trinidad/pom.xml,>
MavenProject: org.apache.myfaces.buildtools:myfaces-archetype-trinidad20:1.0.5-SNAPSHOT @
<https://builds.apache.org/job/myfaces-maven-achetypes/ws/maven2-archetypes/myfaces-archetype-trinidad20/pom.xml,>
MavenProject: org.apache.myfaces.buildtools:myfaces-archetype-jsfcomponents:1.0.5-SNAPSHOT
@ <https://builds.apache.org/job/myfaces-maven-achetypes/ws/maven2-archetypes/myfaces-archetype-jsfcomponents/pom.xml,>
MavenProject: org.apache.myfaces.buildtools:myfaces-archetype-jsfcomponents20:1.0.5-SNAPSHOT
@ <https://builds.apache.org/job/myfaces-maven-achetypes/ws/maven2-archetypes/myfaces-archetype-jsfcomponents20/pom.xml,>
MavenProject: org.apache.myfaces.buildtools:myfaces-archetype-codi-jsf12:1.0.5-SNAPSHOT @
<https://builds.apache.org/job/myfaces-maven-achetypes/ws/maven2-archetypes/myfaces-archetype-codi-jsf12/pom.xml,>
MavenProject: org.apache.myfaces.buildtools:myfaces-archetype-codi-jsf20:1.0.5-SNAPSHOT @
<https://builds.apache.org/job/myfaces-maven-achetypes/ws/maven2-archetypes/myfaces-archetype-codi-jsf20/pom.xml,>
MavenProject: org.apache.myfaces.buildtools:myfaces-archetype-core-integration-test:1.0.5-SNAPSHOT
@ <https://builds.apache.org/job/myfaces-maven-achetypes/ws/maven2-archetypes/myfaces-archetype-core-integration-test/pom.xml]>
[JENKINS] Archiving <https://builds.apache.org/job/myfaces-maven-achetypes/ws/maven2-archetypes/myfaces-archetype-helloworld20/pom.xml>
to /home/hudson/hudson/jobs/myfaces-maven-achetypes/modules/org.apache.myfaces.buildtools$myfaces-archetype-helloworld20/builds/2012-07-01_00-31-27/archive/org.apache.myfaces.buildtools/myfaces-archetype-helloworld20/1.0.5-SNAPSHOT/myfaces-archetype-helloworld20-1.0.5-SNAPSHOT.pom
[JENKINS] Archiving <https://builds.apache.org/job/myfaces-maven-achetypes/ws/maven2-archetypes/myfaces-archetype-helloworld20/target/myfaces-archetype-helloworld20-1.0.5-SNAPSHOT.jar>
to /home/hudson/hudson/jobs/myfaces-maven-achetypes/modules/org.apache.myfaces.buildtools$myfaces-archetype-helloworld20/builds/2012-07-01_00-31-27/archive/org.apache.myfaces.buildtools/myfaces-archetype-helloworld20/1.0.5-SNAPSHOT/myfaces-archetype-helloworld20-1.0.5-SNAPSHOT.jar
[JENKINS] Archiving <https://builds.apache.org/job/myfaces-maven-achetypes/ws/maven2-archetypes/myfaces-archetype-helloworld/pom.xml>
to /home/hudson/hudson/jobs/myfaces-maven-achetypes/modules/org.apache.myfaces.buildtools$myfaces-archetype-helloworld/builds/2012-07-01_00-31-27/archive/org.apache.myfaces.buildtools/myfaces-archetype-helloworld/1.0.5-SNAPSHOT/myfaces-archetype-helloworld-1.0.5-SNAPSHOT.pom
[JENKINS] Archiving <https://builds.apache.org/job/myfaces-maven-achetypes/ws/maven2-archetypes/myfaces-archetype-helloworld/target/myfaces-archetype-helloworld-1.0.5-SNAPSHOT.jar>
to /home/hudson/hudson/jobs/myfaces-maven-achetypes/modules/org.apache.myfaces.buildtools$myfaces-archetype-helloworld/builds/2012-07-01_00-31-27/archive/org.apache.myfaces.buildtools/myfaces-archetype-helloworld/1.0.5-SNAPSHOT/myfaces-archetype-helloworld-1.0.5-SNAPSHOT.jar
[JENKINS] Archiving <https://builds.apache.org/job/myfaces-maven-achetypes/ws/maven2-archetypes/myfaces-archetype-helloworld20-owb/pom.xml>
to /home/hudson/hudson/jobs/myfaces-maven-achetypes/modules/org.apache.myfaces.buildtools$myfaces-archetype-helloworld20-owb/builds/2012-07-01_00-31-27/archive/org.apache.myfaces.buildtools/myfaces-archetype-helloworld20-owb/1.0.5-SNAPSHOT/myfaces-archetype-helloworld20-owb-1.0.5-SNAPSHOT.pom
[JENKINS] Archiving <https://builds.apache.org/job/myfaces-maven-achetypes/ws/maven2-archetypes/myfaces-archetype-helloworld20-owb/target/myfaces-archetype-helloworld20-owb-1.0.5-SNAPSHOT.jar>
to /home/hudson/hudson/jobs/myfaces-maven-achetypes/modules/org.apache.myfaces.buildtools$myfaces-archetype-helloworld20-owb/builds/2012-07-01_00-31-27/archive/org.apache.myfaces.buildtools/myfaces-archetype-helloworld20-owb/1.0.5-SNAPSHOT/myfaces-archetype-helloworld20-owb-1.0.5-SNAPSHOT.jar
[JENKINS] Archiving <https://builds.apache.org/job/myfaces-maven-achetypes/ws/maven2-archetypes/myfaces-archetype-trinidad20/pom.xml>
to /home/hudson/hudson/jobs/myfaces-maven-achetypes/modules/org.apache.myfaces.buildtools$myfaces-archetype-trinidad20/builds/2012-07-01_00-31-27/archive/org.apache.myfaces.buildtools/myfaces-archetype-trinidad20/1.0.5-SNAPSHOT/myfaces-archetype-trinidad20-1.0.5-SNAPSHOT.pom
[JENKINS] Archiving <https://builds.apache.org/job/myfaces-maven-achetypes/ws/maven2-archetypes/myfaces-archetype-trinidad20/target/myfaces-archetype-trinidad20-1.0.5-SNAPSHOT.jar>
to /home/hudson/hudson/jobs/myfaces-maven-achetypes/modules/org.apache.myfaces.buildtools$myfaces-archetype-trinidad20/builds/2012-07-01_00-31-27/archive/org.apache.myfaces.buildtools/myfaces-archetype-trinidad20/1.0.5-SNAPSHOT/myfaces-archetype-trinidad20-1.0.5-SNAPSHOT.jar
[JENKINS] Archiving <https://builds.apache.org/job/myfaces-maven-achetypes/ws/maven2-archetypes/myfaces-archetype-codi-jsf20/pom.xml>
to /home/hudson/hudson/jobs/myfaces-maven-achetypes/modules/org.apache.myfaces.buildtools$myfaces-archetype-codi-jsf20/builds/2012-07-01_00-31-27/archive/org.apache.myfaces.buildtools/myfaces-archetype-codi-jsf20/1.0.5-SNAPSHOT/myfaces-archetype-codi-jsf20-1.0.5-SNAPSHOT.pom
[JENKINS] Archiving <https://builds.apache.org/job/myfaces-maven-achetypes/ws/maven2-archetypes/myfaces-archetype-codi-jsf20/target/myfaces-archetype-codi-jsf20-1.0.5-SNAPSHOT.jar>
to /home/hudson/hudson/jobs/myfaces-maven-achetypes/modules/org.apache.myfaces.buildtools$myfaces-archetype-codi-jsf20/builds/2012-07-01_00-31-27/archive/org.apache.myfaces.buildtools/myfaces-archetype-codi-jsf20/1.0.5-SNAPSHOT/myfaces-archetype-codi-jsf20-1.0.5-SNAPSHOT.jar
[JENKINS] Archiving <https://builds.apache.org/job/myfaces-maven-achetypes/ws/maven2-archetypes/myfaces-archetype-codi-jsf12/pom.xml>
to /home/hudson/hudson/jobs/myfaces-maven-achetypes/modules/org.apache.myfaces.buildtools$myfaces-archetype-codi-jsf12/builds/2012-07-01_00-31-27/archive/org.apache.myfaces.buildtools/myfaces-archetype-codi-jsf12/1.0.5-SNAPSHOT/myfaces-archetype-codi-jsf12-1.0.5-SNAPSHOT.pom
[JENKINS] Archiving <https://builds.apache.org/job/myfaces-maven-achetypes/ws/maven2-archetypes/myfaces-archetype-codi-jsf12/target/myfaces-archetype-codi-jsf12-1.0.5-SNAPSHOT.jar>
to /home/hudson/hudson/jobs/myfaces-maven-achetypes/modules/org.apache.myfaces.buildtools$myfaces-archetype-codi-jsf12/builds/2012-07-01_00-31-27/archive/org.apache.myfaces.buildtools/myfaces-archetype-codi-jsf12/1.0.5-SNAPSHOT/myfaces-archetype-codi-jsf12-1.0.5-SNAPSHOT.jar
[JENKINS] Archiving <https://builds.apache.org/job/myfaces-maven-achetypes/ws/maven2-archetypes/myfaces-archetype-core-integration-test/pom.xml>
to /home/hudson/hudson/jobs/myfaces-maven-achetypes/modules/org.apache.myfaces.buildtools$myfaces-archetype-core-integration-test/builds/2012-07-01_00-31-27/archive/org.apache.myfaces.buildtools/myfaces-archetype-core-integration-test/1.0.5-SNAPSHOT/myfaces-archetype-core-integration-test-1.0.5-SNAPSHOT.pom
[JENKINS] Archiving <https://builds.apache.org/job/myfaces-maven-achetypes/ws/maven2-archetypes/myfaces-archetype-core-integration-test/target/myfaces-archetype-core-integration-test-1.0.5-SNAPSHOT.jar>
to /home/hudson/hudson/jobs/myfaces-maven-achetypes/modules/org.apache.myfaces.buildtools$myfaces-archetype-core-integration-test/builds/2012-07-01_00-31-27/archive/org.apache.myfaces.buildtools/myfaces-archetype-core-integration-test/1.0.5-SNAPSHOT/myfaces-archetype-core-integration-test-1.0.5-SNAPSHOT.jar
[JENKINS] Archiving <https://builds.apache.org/job/myfaces-maven-achetypes/ws/maven2-archetypes/myfaces-archetype-jsfcomponents/pom.xml>
to /home/hudson/hudson/jobs/myfaces-maven-achetypes/modules/org.apache.myfaces.buildtools$myfaces-archetype-jsfcomponents/builds/2012-07-01_00-31-27/archive/org.apache.myfaces.buildtools/myfaces-archetype-jsfcomponents/1.0.5-SNAPSHOT/myfaces-archetype-jsfcomponents-1.0.5-SNAPSHOT.pom
[JENKINS] Archiving <https://builds.apache.org/job/myfaces-maven-achetypes/ws/maven2-archetypes/myfaces-archetype-jsfcomponents/target/myfaces-archetype-jsfcomponents-1.0.5-SNAPSHOT.jar>
to /home/hudson/hudson/jobs/myfaces-maven-achetypes/modules/org.apache.myfaces.buildtools$myfaces-archetype-jsfcomponents/builds/2012-07-01_00-31-27/archive/org.apache.myfaces.buildtools/myfaces-archetype-jsfcomponents/1.0.5-SNAPSHOT/myfaces-archetype-jsfcomponents-1.0.5-SNAPSHOT.jar
[JENKINS] Archiving <https://builds.apache.org/job/myfaces-maven-achetypes/ws/maven2-archetypes/pom.xml>
to /home/hudson/hudson/jobs/myfaces-maven-achetypes/modules/org.apache.myfaces.buildtools$myfaces-archetype-parent/builds/2012-07-01_00-31-27/archive/org.apache.myfaces.buildtools/myfaces-archetype-parent/1.0.5-SNAPSHOT/myfaces-archetype-parent-1.0.5-SNAPSHOT.pom
[JENKINS] Archiving <https://builds.apache.org/job/myfaces-maven-achetypes/ws/maven2-archetypes/target/myfaces-archetype-parent-1.0.5-SNAPSHOT-site.xml>
to /home/hudson/hudson/jobs/myfaces-maven-achetypes/modules/org.apache.myfaces.buildtools$myfaces-archetype-parent/builds/2012-07-01_00-31-27/archive/org.apache.myfaces.buildtools/myfaces-archetype-parent/1.0.5-SNAPSHOT/myfaces-archetype-parent-1.0.5-SNAPSHOT-site.xml
[JENKINS] Archiving <https://builds.apache.org/job/myfaces-maven-achetypes/ws/maven2-archetypes/myfaces-archetype-helloworld20-debug/pom.xml>
to /home/hudson/hudson/jobs/myfaces-maven-achetypes/modules/org.apache.myfaces.buildtools$myfaces-archetype-helloworld20-debug/builds/2012-07-01_00-31-27/archive/org.apache.myfaces.buildtools/myfaces-archetype-helloworld20-debug/1.0.5-SNAPSHOT/myfaces-archetype-helloworld20-debug-1.0.5-SNAPSHOT.pom
[JENKINS] Archiving <https://builds.apache.org/job/myfaces-maven-achetypes/ws/maven2-archetypes/myfaces-archetype-helloworld20-debug/target/myfaces-archetype-helloworld20-debug-1.0.5-SNAPSHOT.jar>
to /home/hudson/hudson/jobs/myfaces-maven-achetypes/modules/org.apache.myfaces.buildtools$myfaces-archetype-helloworld20-debug/builds/2012-07-01_00-31-27/archive/org.apache.myfaces.buildtools/myfaces-archetype-helloworld20-debug/1.0.5-SNAPSHOT/myfaces-archetype-helloworld20-debug-1.0.5-SNAPSHOT.jar
[JENKINS] Archiving <https://builds.apache.org/job/myfaces-maven-achetypes/ws/maven2-archetypes/myfaces-archetype-helloworld-facelets/pom.xml>
to /home/hudson/hudson/jobs/myfaces-maven-achetypes/modules/org.apache.myfaces.buildtools$myfaces-archetype-helloworld-facelets/builds/2012-07-01_00-31-27/archive/org.apache.myfaces.buildtools/myfaces-archetype-helloworld-facelets/1.0.5-SNAPSHOT/myfaces-archetype-helloworld-facelets-1.0.5-SNAPSHOT.pom
[JENKINS] Archiving <https://builds.apache.org/job/myfaces-maven-achetypes/ws/maven2-archetypes/myfaces-archetype-helloworld-facelets/target/myfaces-archetype-helloworld-facelets-1.0.5-SNAPSHOT.jar>
to /home/hudson/hudson/jobs/myfaces-maven-achetypes/modules/org.apache.myfaces.buildtools$myfaces-archetype-helloworld-facelets/builds/2012-07-01_00-31-27/archive/org.apache.myfaces.buildtools/myfaces-archetype-helloworld-facelets/1.0.5-SNAPSHOT/myfaces-archetype-helloworld-facelets-1.0.5-SNAPSHOT.jar
[JENKINS] Archiving <https://builds.apache.org/job/myfaces-maven-achetypes/ws/maven2-archetypes/myfaces-archetype-jsfcomponents20/pom.xml>
to /home/hudson/hudson/jobs/myfaces-maven-achetypes/modules/org.apache.myfaces.buildtools$myfaces-archetype-jsfcomponents20/builds/2012-07-01_00-31-27/archive/org.apache.myfaces.buildtools/myfaces-archetype-jsfcomponents20/1.0.5-SNAPSHOT/myfaces-archetype-jsfcomponents20-1.0.5-SNAPSHOT.pom
[JENKINS] Archiving <https://builds.apache.org/job/myfaces-maven-achetypes/ws/maven2-archetypes/myfaces-archetype-jsfcomponents20/target/myfaces-archetype-jsfcomponents20-1.0.5-SNAPSHOT.jar>
to /home/hudson/hudson/jobs/myfaces-maven-achetypes/modules/org.apache.myfaces.buildtools$myfaces-archetype-jsfcomponents20/builds/2012-07-01_00-31-27/archive/org.apache.myfaces.buildtools/myfaces-archetype-jsfcomponents20/1.0.5-SNAPSHOT/myfaces-archetype-jsfcomponents20-1.0.5-SNAPSHOT.jar
[JENKINS] Archiving <https://builds.apache.org/job/myfaces-maven-achetypes/ws/maven2-archetypes/myfaces-archetype-trinidad/pom.xml>
to /home/hudson/hudson/jobs/myfaces-maven-achetypes/modules/org.apache.myfaces.buildtools$myfaces-archetype-trinidad/builds/2012-07-01_00-31-27/archive/org.apache.myfaces.buildtools/myfaces-archetype-trinidad/1.0.5-SNAPSHOT/myfaces-archetype-trinidad-1.0.5-SNAPSHOT.pom
[JENKINS] Archiving <https://builds.apache.org/job/myfaces-maven-achetypes/ws/maven2-archetypes/myfaces-archetype-trinidad/target/myfaces-archetype-trinidad-1.0.5-SNAPSHOT.jar>
to /home/hudson/hudson/jobs/myfaces-maven-achetypes/modules/org.apache.myfaces.buildtools$myfaces-archetype-trinidad/builds/2012-07-01_00-31-27/archive/org.apache.myfaces.buildtools/myfaces-archetype-trinidad/1.0.5-SNAPSHOT/myfaces-archetype-trinidad-1.0.5-SNAPSHOT.jar
[JENKINS] Archiving <https://builds.apache.org/job/myfaces-maven-achetypes/ws/maven2-archetypes/myfaces-archetype-helloworld-portlets/pom.xml>
to /home/hudson/hudson/jobs/myfaces-maven-achetypes/modules/org.apache.myfaces.buildtools$myfaces-archetype-helloworld-portlets/builds/2012-07-01_00-31-27/archive/org.apache.myfaces.buildtools/myfaces-archetype-helloworld-portlets/1.0.5-SNAPSHOT/myfaces-archetype-helloworld-portlets-1.0.5-SNAPSHOT.pom
[JENKINS] Archiving <https://builds.apache.org/job/myfaces-maven-achetypes/ws/maven2-archetypes/myfaces-archetype-helloworld-portlets/target/myfaces-archetype-helloworld-portlets-1.0.5-SNAPSHOT.jar>
to /home/hudson/hudson/jobs/myfaces-maven-achetypes/modules/org.apache.myfaces.buildtools$myfaces-archetype-helloworld-portlets/builds/2012-07-01_00-31-27/archive/org.apache.myfaces.buildtools/myfaces-archetype-helloworld-portlets/1.0.5-SNAPSHOT/myfaces-archetype-helloworld-portlets-1.0.5-SNAPSHOT.jar
Waiting for Jenkins to finish collecting data
channel stopped
Maven RedeployPublished use remote ubuntu2 maven settings from : /home/hudson/.m2/settings.xml
[ERROR] uniqueVersion == false is not anymore supported in maven 3
[INFO] Deployment in https://repository.apache.org/content/repositories/snapshots (id=apache.snapshots.https,uniqueVersion=false)
Deploying the main artifact myfaces-archetype-codi-jsf12-1.0.5-SNAPSHOT.jar
Downloading: https://repository.apache.org/content/repositories/snapshots/org/apache/myfaces/buildtools/myfaces-archetype-codi-jsf12/1.0.5-SNAPSHOT/maven-metadata.xml
ERROR: Failed to retrieve remote metadata org.apache.myfaces.buildtools:myfaces-archetype-codi-jsf12:1.0.5-SNAPSHOT/maven-metadata.xml:
Could not transfer metadata org.apache.myfaces.buildtools:myfaces-archetype-codi-jsf12:1.0.5-SNAPSHOT/maven-metadata.xml
from/to apache.snapshots.https (https://repository.apache.org/content/repositories/snapshots):
Failed to transfer file: https://repository.apache.org/content/repositories/snapshots/org/apache/myfaces/buildtools/myfaces-archetype-codi-jsf12/1.0.5-SNAPSHOT/maven-metadata.xml.
Return code is: 503, ReasonPhrase:Service Temporarily Unavailable.
org.apache.maven.artifact.deployer.ArtifactDeploymentException: Failed to retrieve remote
metadata org.apache.myfaces.buildtools:myfaces-archetype-codi-jsf12:1.0.5-SNAPSHOT/maven-metadata.xml:
Could not transfer metadata org.apache.myfaces.buildtools:myfaces-archetype-codi-jsf12:1.0.5-SNAPSHOT/maven-metadata.xml
from/to apache.snapshots.https (https://repository.apache.org/content/repositories/snapshots):
Failed to transfer file: https://repository.apache.org/content/repositories/snapshots/org/apache/myfaces/buildtools/myfaces-archetype-codi-jsf12/1.0.5-SNAPSHOT/maven-metadata.xml.
Return code is: 503, ReasonPhrase:Service Temporarily Unavailable.
	at org.apache.maven.artifact.deployer.DefaultArtifactDeployer.deploy(DefaultArtifactDeployer.java:141)
	at hudson.maven.reporters.MavenArtifactRecord.deploy(MavenArtifactRecord.java:182)
	at hudson.maven.RedeployPublisher.perform(RedeployPublisher.java:174)
	at hudson.tasks.BuildStepMonitor$1.perform(BuildStepMonitor.java:19)
	at hudson.model.AbstractBuild$AbstractBuildExecution.perform(AbstractBuild.java:717)
	at hudson.model.AbstractBuild$AbstractBuildExecution.performAllBuildSteps(AbstractBuild.java:692)
	at hudson.maven.MavenModuleSetBuild$MavenModuleSetBuildExecution.post2(MavenModuleSetBuild.java:994)
	at hudson.model.AbstractBuild$AbstractBuildExecution.post(AbstractBuild.java:639)
	at hudson.model.Run.execute(Run.java:1485)
	at hudson.maven.MavenModuleSetBuild.run(MavenModuleSetBuild.java:477)
	at hudson.model.ResourceController.execute(ResourceController.java:88)
	at hudson.model.Executor.run(Executor.java:239)
Caused by: org.sonatype.aether.deployment.DeploymentException: Failed to retrieve remote metadata
org.apache.myfaces.buildtools:myfaces-archetype-codi-jsf12:1.0.5-SNAPSHOT/maven-metadata.xml:
Could not transfer metadata org.apache.myfaces.buildtools:myfaces-archetype-codi-jsf12:1.0.5-SNAPSHOT/maven-metadata.xml
from/to apache.snapshots.https (https://repository.apache.org/content/repositories/snapshots):
Failed to transfer file: https://repository.apache.org/content/repositories/snapshots/org/apache/myfaces/buildtools/myfaces-archetype-codi-jsf12/1.0.5-SNAPSHOT/maven-metadata.xml.
Return code is: 503, ReasonPhrase:Service Temporarily Unavailable.
	at org.sonatype.aether.impl.internal.DefaultDeployer.upload(DefaultDeployer.java:403)
	at org.sonatype.aether.impl.internal.DefaultDeployer.deploy(DefaultDeployer.java:256)
	at org.sonatype.aether.impl.internal.DefaultDeployer.deploy(DefaultDeployer.java:211)
	at org.sonatype.aether.impl.internal.DefaultRepositorySystem.deploy(DefaultRepositorySystem.java:443)
	at org.apache.maven.artifact.deployer.DefaultArtifactDeployer.deploy(DefaultArtifactDeployer.java:137)
	... 11 more
Caused by: org.sonatype.aether.transfer.MetadataTransferException: Could not transfer metadata
org.apache.myfaces.buildtools:myfaces-archetype-codi-jsf12:1.0.5-SNAPSHOT/maven-metadata.xml
from/to apache.snapshots.https (https://repository.apache.org/content/repositories/snapshots):
Failed to transfer file: https://repository.apache.org/content/repositories/snapshots/org/apache/myfaces/buildtools/myfaces-archetype-codi-jsf12/1.0.5-SNAPSHOT/maven-metadata.xml.
Return code is: 503, ReasonPhrase:Service Temporarily Unavailable.
	at org.sonatype.aether.connector.wagon.WagonRepositoryConnector$3.wrap(WagonRepositoryConnector.java:930)
	at org.sonatype.aether.connector.wagon.WagonRepositoryConnector$3.wrap(WagonRepositoryConnector.java:920)
	at org.sonatype.aether.connector.wagon.WagonRepositoryConnector$GetTask.run(WagonRepositoryConnector.java:669)
	at org.sonatype.aether.util.concurrency.RunnableErrorForwarder$1.run(RunnableErrorForwarder.java:60)
	at java.util.concurrent.ThreadPoolExecutor.runWorker(ThreadPoolExecutor.java:1110)
	at java.util.concurrent.ThreadPoolExecutor$Worker.run(ThreadPoolExecutor.java:603)
	at java.lang.Thread.run(Thread.java:722)
Caused by: org.apache.maven.wagon.TransferFailedException: Failed to transfer file: https://repository.apache.org/content/repositories/snapshots/org/apache/myfaces/buildtools/myfaces-archetype-codi-jsf12/1.0.5-SNAPSHOT/maven-metadata.xml.
Return code is: 503, ReasonPhrase:Service Temporarily Unavailable.
	at org.apache.maven.wagon.shared.http4.AbstractHttpClientWagon.fillInputData(AbstractHttpClientWagon.java:852)
	at org.apache.maven.wagon.StreamWagon.getInputStream(StreamWagon.java:116)
	at org.apache.maven.wagon.StreamWagon.getIfNewer(StreamWagon.java:88)
	at org.apache.maven.wagon.StreamWagon.get(StreamWagon.java:61)
	at org.sonatype.aether.connector.wagon.WagonRepositoryConnector$GetTask.run(WagonRepositoryConnector.java:601)
	... 4 more
[INFO] Deployment failed after 0.68 sec
Build step 'Deploy artifacts to Maven repository' changed build result to FAILURE

Mime
View raw message