myfaces-commits mailing list archives

Site index · List index
Message view « Date » · « Thread »
Top « Date » · « Thread »
From Apache Jenkins Server <jenk...@builds.apache.org>
Subject Build failed in Jenkins: ExtVal for JSF 1.2 (deploy) #76
Date Sun, 01 Jul 2012 00:16:22 GMT
See <https://builds.apache.org/job/ExtVal%20for%20JSF%201.2%20(deploy)/76/>

------------------------------------------
[...truncated 251 lines...]
[INFO] Copying 3 resources
[INFO] [compiler:compile {execution: default-compile}]
[INFO] Compiling 40 source files to <https://builds.apache.org/job/ExtVal%20for%20JSF%201.2%20(deploy)/ws/trunk/validation-modules/bean-validation/target/classes>
[INFO] [resources:testResources {execution: default-testResources}]
[INFO] Using 'UTF-8' encoding to copy filtered resources.
[INFO] Copying 0 resource
[INFO] Copying 3 resources
[INFO] [compiler:testCompile {execution: default-testCompile}]
[INFO] Nothing to compile - all classes are up to date
[INFO] [surefire:test {execution: default-test}]
[INFO] Surefire report directory: <https://builds.apache.org/job/ExtVal%20for%20JSF%201.2%20(deploy)/ws/trunk/validation-modules/bean-validation/target/surefire-reports>
/bin/sh: Syntax error: "(" unexpected
[ERROR] There are test failures.

Please refer to <https://builds.apache.org/job/ExtVal%20for%20JSF%201.2%20(deploy)/ws/trunk/validation-modules/bean-validation/target/surefire-reports>
for the individual test results.
[JENKINS] Recording test results
[INFO] [jar:jar {execution: default-jar}]
[INFO] Building jar: <https://builds.apache.org/job/ExtVal%20for%20JSF%201.2%20(deploy)/ws/trunk/validation-modules/bean-validation/target/myfaces-extval-bean-validation-1.2.6-SNAPSHOT.jar>
[INFO] Preparing source:jar
[WARNING] Removing: jar from forked lifecycle, to prevent recursive invocation.
[JENKINS] Archiving <https://builds.apache.org/job/ExtVal%20for%20JSF%201.2%20(deploy)/ws/trunk/validation-modules/bean-validation/pom.xml>
to /home/hudson/hudson/jobs/ExtVal for JSF 1.2 (deploy)/modules/org.apache.myfaces.extensions.validator.validation-modules$myfaces-extval-bean-validation/builds/2012-07-01_00-14-34/archive/org.apache.myfaces.extensions.validator.validation-modules/myfaces-extval-bean-validation/1.2.6-SNAPSHOT/myfaces-extval-bean-validation-1.2.6-SNAPSHOT.pom
[JENKINS] Archiving <https://builds.apache.org/job/ExtVal%20for%20JSF%201.2%20(deploy)/ws/trunk/validation-modules/bean-validation/target/myfaces-extval-bean-validation-1.2.6-SNAPSHOT.jar>
to /home/hudson/hudson/jobs/ExtVal for JSF 1.2 (deploy)/modules/org.apache.myfaces.extensions.validator.validation-modules$myfaces-extval-bean-validation/builds/2012-07-01_00-14-34/archive/org.apache.myfaces.extensions.validator.validation-modules/myfaces-extval-bean-validation/1.2.6-SNAPSHOT/myfaces-extval-bean-validation-1.2.6-SNAPSHOT.jar
[INFO] [antrun:run {execution: javadoc.resources}]
[INFO] Executing tasks
[INFO] Executed tasks
[INFO] [source:jar {execution: attach-sources}]
[INFO] META-INF already added, skipping
[INFO] META-INF already added, skipping
[INFO] META-INF/LICENSE already added, skipping
[INFO] META-INF/DEPENDENCIES already added, skipping
[INFO] META-INF/NOTICE already added, skipping
[INFO] Building jar: <https://builds.apache.org/job/ExtVal%20for%20JSF%201.2%20(deploy)/ws/trunk/validation-modules/bean-validation/target/myfaces-extval-bean-validation-1.2.6-SNAPSHOT-sources.jar>
[INFO] META-INF already added, skipping
[INFO] META-INF already added, skipping
[INFO] META-INF/LICENSE already added, skipping
[INFO] META-INF/DEPENDENCIES already added, skipping
[INFO] META-INF/NOTICE already added, skipping
[INFO] Preparing checkstyle:check
[JENKINS] Archiving <https://builds.apache.org/job/ExtVal%20for%20JSF%201.2%20(deploy)/ws/trunk/validation-modules/bean-validation/target/myfaces-extval-bean-validation-1.2.6-SNAPSHOT-sources.jar>
to /home/hudson/hudson/jobs/ExtVal for JSF 1.2 (deploy)/modules/org.apache.myfaces.extensions.validator.validation-modules$myfaces-extval-bean-validation/builds/2012-07-01_00-14-34/archive/org.apache.myfaces.extensions.validator.validation-modules/myfaces-extval-bean-validation/1.2.6-SNAPSHOT/myfaces-extval-bean-validation-1.2.6-SNAPSHOT-sources.jar
[INFO] [checkstyle:checkstyle {execution: checkstyle}]
[INFO] [checkstyle:check {execution: verify-style}]
[INFO] [install:install {execution: default-install}]
[INFO] Installing <https://builds.apache.org/job/ExtVal%20for%20JSF%201.2%20(deploy)/ws/trunk/validation-modules/bean-validation/target/myfaces-extval-bean-validation-1.2.6-SNAPSHOT.jar>
to /home/hudson/hudson-slave/maven-repositories/1/org/apache/myfaces/extensions/validator/validation-modules/myfaces-extval-bean-validation/1.2.6-SNAPSHOT/myfaces-extval-bean-validation-1.2.6-SNAPSHOT.jar
[INFO] Installing <https://builds.apache.org/job/ExtVal%20for%20JSF%201.2%20(deploy)/ws/trunk/validation-modules/bean-validation/target/myfaces-extval-bean-validation-1.2.6-SNAPSHOT-sources.jar>
to /home/hudson/hudson-slave/maven-repositories/1/org/apache/myfaces/extensions/validator/validation-modules/myfaces-extval-bean-validation/1.2.6-SNAPSHOT/myfaces-extval-bean-validation-1.2.6-SNAPSHOT-sources.jar
[INFO] ------------------------------------------------------------------------
[INFO] Building MyFaces Extensions-Validator Component-Support Modules
[INFO]    task-segment: [clean, install]
[INFO] ------------------------------------------------------------------------
[INFO] [clean:clean {execution: default-clean}]
[INFO] Deleting file set: <https://builds.apache.org/job/ExtVal%20for%20JSF%201.2%20(deploy)/ws/trunk/component-support/target>
(included: [**], excluded: [])
[INFO] [antrun:run {execution: javadoc.resources}]
[INFO] Executing tasks
[INFO] Executed tasks
[INFO] [remote-resources:process {execution: default}]
[INFO] [site:attach-descriptor {execution: default-attach-descriptor}]
[INFO] Preparing checkstyle:check
[JENKINS] Archiving <https://builds.apache.org/job/ExtVal%20for%20JSF%201.2%20(deploy)/ws/trunk/component-support/pom.xml>
to /home/hudson/hudson/jobs/ExtVal for JSF 1.2 (deploy)/modules/org.apache.myfaces.extensions.validator.component-support-modules$component-support-modules-project/builds/2012-07-01_00-14-34/archive/org.apache.myfaces.extensions.validator.component-support-modules/component-support-modules-project/1.2.6-SNAPSHOT/component-support-modules-project-1.2.6-SNAPSHOT.pom
[INFO] [checkstyle:checkstyle {execution: checkstyle}]
[INFO] Source directory does not exist - skipping report.
[INFO] [checkstyle:check {execution: verify-style}]
[INFO] Unable to perform checkstyle:check, unable to find checkstyle:checkstyle outputFile.
[INFO] [install:install {execution: default-install}]
[INFO] Installing <https://builds.apache.org/job/ExtVal%20for%20JSF%201.2%20(deploy)/ws/trunk/component-support/pom.xml>
to /home/hudson/hudson-slave/maven-repositories/1/org/apache/myfaces/extensions/validator/component-support-modules/component-support-modules-project/1.2.6-SNAPSHOT/component-support-modules-project-1.2.6-SNAPSHOT.pom
[INFO] ------------------------------------------------------------------------
[INFO] Building MyFaces Extensions-Validator Trinidad Support Module
[INFO]    task-segment: [clean, install]
[INFO] ------------------------------------------------------------------------
[INFO] [clean:clean {execution: default-clean}]
[INFO] Deleting file set: <https://builds.apache.org/job/ExtVal%20for%20JSF%201.2%20(deploy)/ws/trunk/component-support/trinidad-support/target>
(included: [**], excluded: [])
[INFO] [antrun:run {execution: javadoc.resources}]
[INFO] Executing tasks
[INFO] Executed tasks
[INFO] [remote-resources:process {execution: default}]
[INFO] [resources:resources {execution: default-resources}]
[INFO] Using 'UTF-8' encoding to copy filtered resources.
[INFO] Copying 0 resource to META-INF
[INFO] Copying 3 resources
[INFO] Copying 3 resources
[INFO] [compiler:compile {execution: default-compile}]
[INFO] Compiling 25 source files to <https://builds.apache.org/job/ExtVal%20for%20JSF%201.2%20(deploy)/ws/trunk/component-support/trinidad-support/target/classes>
[INFO] [resources:testResources {execution: default-testResources}]
[INFO] Using 'UTF-8' encoding to copy filtered resources.
[INFO] skip non existing resourceDirectory <https://builds.apache.org/job/ExtVal%20for%20JSF%201.2%20(deploy)/ws/trunk/component-support/trinidad-support/src/test/resources>
[INFO] Copying 3 resources
[INFO] [compiler:testCompile {execution: default-testCompile}]
[INFO] No sources to compile
[INFO] [surefire:test {execution: default-test}]
[INFO] Surefire report directory: <https://builds.apache.org/job/ExtVal%20for%20JSF%201.2%20(deploy)/ws/trunk/component-support/trinidad-support/target/surefire-reports>

-------------------------------------------------------
 T E S T S
-------------------------------------------------------
There are no tests to run.

Results :

Tests run: 0, Failures: 0, Errors: 0, Skipped: 0

[JENKINS] Recording test results
[INFO] [jar:jar {execution: default-jar}]
[INFO] Building jar: <https://builds.apache.org/job/ExtVal%20for%20JSF%201.2%20(deploy)/ws/trunk/component-support/trinidad-support/target/myfaces-extval-trinidad-support-1.2.6-SNAPSHOT.jar>
[INFO] Preparing source:jar
[WARNING] Removing: jar from forked lifecycle, to prevent recursive invocation.
[JENKINS] Archiving <https://builds.apache.org/job/ExtVal%20for%20JSF%201.2%20(deploy)/ws/trunk/component-support/trinidad-support/pom.xml>
to /home/hudson/hudson/jobs/ExtVal for JSF 1.2 (deploy)/modules/org.apache.myfaces.extensions.validator.component-support-modules$myfaces-extval-trinidad-support/builds/2012-07-01_00-14-34/archive/org.apache.myfaces.extensions.validator.component-support-modules/myfaces-extval-trinidad-support/1.2.6-SNAPSHOT/myfaces-extval-trinidad-support-1.2.6-SNAPSHOT.pom
[JENKINS] Archiving <https://builds.apache.org/job/ExtVal%20for%20JSF%201.2%20(deploy)/ws/trunk/component-support/trinidad-support/target/myfaces-extval-trinidad-support-1.2.6-SNAPSHOT.jar>
to /home/hudson/hudson/jobs/ExtVal for JSF 1.2 (deploy)/modules/org.apache.myfaces.extensions.validator.component-support-modules$myfaces-extval-trinidad-support/builds/2012-07-01_00-14-34/archive/org.apache.myfaces.extensions.validator.component-support-modules/myfaces-extval-trinidad-support/1.2.6-SNAPSHOT/myfaces-extval-trinidad-support-1.2.6-SNAPSHOT.jar
[INFO] [antrun:run {execution: javadoc.resources}]
[INFO] Executing tasks
[INFO] Executed tasks
[INFO] [source:jar {execution: attach-sources}]
[INFO] META-INF already added, skipping
[INFO] META-INF already added, skipping
[INFO] META-INF/LICENSE already added, skipping
[INFO] META-INF/DEPENDENCIES already added, skipping
[INFO] META-INF/NOTICE already added, skipping
[INFO] Building jar: <https://builds.apache.org/job/ExtVal%20for%20JSF%201.2%20(deploy)/ws/trunk/component-support/trinidad-support/target/myfaces-extval-trinidad-support-1.2.6-SNAPSHOT-sources.jar>
[INFO] META-INF already added, skipping
[INFO] META-INF already added, skipping
[INFO] META-INF/LICENSE already added, skipping
[INFO] META-INF/DEPENDENCIES already added, skipping
[INFO] META-INF/NOTICE already added, skipping
[INFO] Preparing checkstyle:check
[JENKINS] Archiving <https://builds.apache.org/job/ExtVal%20for%20JSF%201.2%20(deploy)/ws/trunk/component-support/trinidad-support/target/myfaces-extval-trinidad-support-1.2.6-SNAPSHOT-sources.jar>
to /home/hudson/hudson/jobs/ExtVal for JSF 1.2 (deploy)/modules/org.apache.myfaces.extensions.validator.component-support-modules$myfaces-extval-trinidad-support/builds/2012-07-01_00-14-34/archive/org.apache.myfaces.extensions.validator.component-support-modules/myfaces-extval-trinidad-support/1.2.6-SNAPSHOT/myfaces-extval-trinidad-support-1.2.6-SNAPSHOT-sources.jar
[INFO] [checkstyle:checkstyle {execution: checkstyle}]
[INFO] [checkstyle:check {execution: verify-style}]
[INFO] [install:install {execution: default-install}]
[INFO] Installing <https://builds.apache.org/job/ExtVal%20for%20JSF%201.2%20(deploy)/ws/trunk/component-support/trinidad-support/target/myfaces-extval-trinidad-support-1.2.6-SNAPSHOT.jar>
to /home/hudson/hudson-slave/maven-repositories/1/org/apache/myfaces/extensions/validator/component-support-modules/myfaces-extval-trinidad-support/1.2.6-SNAPSHOT/myfaces-extval-trinidad-support-1.2.6-SNAPSHOT.jar
[INFO] Installing <https://builds.apache.org/job/ExtVal%20for%20JSF%201.2%20(deploy)/ws/trunk/component-support/trinidad-support/target/myfaces-extval-trinidad-support-1.2.6-SNAPSHOT-sources.jar>
to /home/hudson/hudson-slave/maven-repositories/1/org/apache/myfaces/extensions/validator/component-support-modules/myfaces-extval-trinidad-support/1.2.6-SNAPSHOT/myfaces-extval-trinidad-support-1.2.6-SNAPSHOT-sources.jar
[INFO] ------------------------------------------------------------------------
[INFO] Building MyFaces Extensions-Validator Generic Support Module
[INFO]    task-segment: [clean, install]
[INFO] ------------------------------------------------------------------------
[INFO] [clean:clean {execution: default-clean}]
[INFO] Deleting file set: <https://builds.apache.org/job/ExtVal%20for%20JSF%201.2%20(deploy)/ws/trunk/component-support/generic-support/target>
(included: [**], excluded: [])
[INFO] [antrun:run {execution: javadoc.resources}]
[INFO] Executing tasks
[INFO] Executed tasks
[INFO] [remote-resources:process {execution: default}]
[INFO] [resources:resources {execution: default-resources}]
[INFO] Using 'UTF-8' encoding to copy filtered resources.
[INFO] Copying 0 resource to META-INF
[INFO] Copying 3 resources
[INFO] Copying 3 resources
[INFO] [compiler:compile {execution: default-compile}]
[INFO] Compiling 4 source files to <https://builds.apache.org/job/ExtVal%20for%20JSF%201.2%20(deploy)/ws/trunk/component-support/generic-support/target/classes>
[INFO] [resources:testResources {execution: default-testResources}]
[INFO] Using 'UTF-8' encoding to copy filtered resources.
[INFO] skip non existing resourceDirectory <https://builds.apache.org/job/ExtVal%20for%20JSF%201.2%20(deploy)/ws/trunk/component-support/generic-support/src/test/resources>
[INFO] Copying 3 resources
[INFO] [compiler:testCompile {execution: default-testCompile}]
[INFO] No sources to compile
[INFO] [surefire:test {execution: default-test}]
[INFO] Surefire report directory: <https://builds.apache.org/job/ExtVal%20for%20JSF%201.2%20(deploy)/ws/trunk/component-support/generic-support/target/surefire-reports>

-------------------------------------------------------
 T E S T S
-------------------------------------------------------
There are no tests to run.

Results :

Tests run: 0, Failures: 0, Errors: 0, Skipped: 0

[JENKINS] Recording test results
[INFO] [jar:jar {execution: default-jar}]
[INFO] Building jar: <https://builds.apache.org/job/ExtVal%20for%20JSF%201.2%20(deploy)/ws/trunk/component-support/generic-support/target/myfaces-extval-generic-support-1.2.6-SNAPSHOT.jar>
[INFO] Preparing source:jar
[WARNING] Removing: jar from forked lifecycle, to prevent recursive invocation.
[JENKINS] Archiving <https://builds.apache.org/job/ExtVal%20for%20JSF%201.2%20(deploy)/ws/trunk/component-support/generic-support/pom.xml>
to /home/hudson/hudson/jobs/ExtVal for JSF 1.2 (deploy)/modules/org.apache.myfaces.extensions.validator.component-support-modules$myfaces-extval-generic-support/builds/2012-07-01_00-14-34/archive/org.apache.myfaces.extensions.validator.component-support-modules/myfaces-extval-generic-support/1.2.6-SNAPSHOT/myfaces-extval-generic-support-1.2.6-SNAPSHOT.pom
[JENKINS] Archiving <https://builds.apache.org/job/ExtVal%20for%20JSF%201.2%20(deploy)/ws/trunk/component-support/generic-support/target/myfaces-extval-generic-support-1.2.6-SNAPSHOT.jar>
to /home/hudson/hudson/jobs/ExtVal for JSF 1.2 (deploy)/modules/org.apache.myfaces.extensions.validator.component-support-modules$myfaces-extval-generic-support/builds/2012-07-01_00-14-34/archive/org.apache.myfaces.extensions.validator.component-support-modules/myfaces-extval-generic-support/1.2.6-SNAPSHOT/myfaces-extval-generic-support-1.2.6-SNAPSHOT.jar
[INFO] [antrun:run {execution: javadoc.resources}]
[INFO] Executing tasks
[INFO] Executed tasks
[INFO] [source:jar {execution: attach-sources}]
[INFO] META-INF already added, skipping
[INFO] META-INF already added, skipping
[INFO] META-INF/LICENSE already added, skipping
[INFO] META-INF/DEPENDENCIES already added, skipping
[INFO] META-INF/NOTICE already added, skipping
[INFO] Building jar: <https://builds.apache.org/job/ExtVal%20for%20JSF%201.2%20(deploy)/ws/trunk/component-support/generic-support/target/myfaces-extval-generic-support-1.2.6-SNAPSHOT-sources.jar>
[INFO] META-INF already added, skipping
[INFO] META-INF already added, skipping
[INFO] META-INF/LICENSE already added, skipping
[INFO] META-INF/DEPENDENCIES already added, skipping
[INFO] META-INF/NOTICE already added, skipping
[INFO] Preparing checkstyle:check
[JENKINS] Archiving <https://builds.apache.org/job/ExtVal%20for%20JSF%201.2%20(deploy)/ws/trunk/component-support/generic-support/target/myfaces-extval-generic-support-1.2.6-SNAPSHOT-sources.jar>
to /home/hudson/hudson/jobs/ExtVal for JSF 1.2 (deploy)/modules/org.apache.myfaces.extensions.validator.component-support-modules$myfaces-extval-generic-support/builds/2012-07-01_00-14-34/archive/org.apache.myfaces.extensions.validator.component-support-modules/myfaces-extval-generic-support/1.2.6-SNAPSHOT/myfaces-extval-generic-support-1.2.6-SNAPSHOT-sources.jar
[INFO] [checkstyle:checkstyle {execution: checkstyle}]
[INFO] [checkstyle:check {execution: verify-style}]
[INFO] [install:install {execution: default-install}]
[INFO] Installing <https://builds.apache.org/job/ExtVal%20for%20JSF%201.2%20(deploy)/ws/trunk/component-support/generic-support/target/myfaces-extval-generic-support-1.2.6-SNAPSHOT.jar>
to /home/hudson/hudson-slave/maven-repositories/1/org/apache/myfaces/extensions/validator/component-support-modules/myfaces-extval-generic-support/1.2.6-SNAPSHOT/myfaces-extval-generic-support-1.2.6-SNAPSHOT.jar
[INFO] Installing <https://builds.apache.org/job/ExtVal%20for%20JSF%201.2%20(deploy)/ws/trunk/component-support/generic-support/target/myfaces-extval-generic-support-1.2.6-SNAPSHOT-sources.jar>
to /home/hudson/hudson-slave/maven-repositories/1/org/apache/myfaces/extensions/validator/component-support-modules/myfaces-extval-generic-support/1.2.6-SNAPSHOT/myfaces-extval-generic-support-1.2.6-SNAPSHOT-sources.jar
[INFO] 
[INFO] 
[INFO] ------------------------------------------------------------------------
[INFO] Reactor Summary:
[INFO] ------------------------------------------------------------------------
[INFO] Apache MyFaces Extensions-Validator Module ............ SUCCESS [19.956s]
[INFO] MyFaces Extensions-Validator Core ..................... SUCCESS [15.930s]
[INFO] MyFaces Extensions-Validator Validation-Modules ....... SUCCESS [1.479s]
[INFO] MyFaces Extensions-Validator Property-Validation-Module  SUCCESS [11.761s]
[INFO] MyFaces Extensions-Validator Bean-Validation-Integration-Module (JSR 303)  SUCCESS
[9.588s]
[INFO] MyFaces Extensions-Validator Component-Support Modules  SUCCESS [1.423s]
[INFO] MyFaces Extensions-Validator Trinidad Support Module .. SUCCESS [7.672s]
[INFO] MyFaces Extensions-Validator Generic Support Module ... SUCCESS [6.431s]
[INFO] ------------------------------------------------------------------------
[INFO] ------------------------------------------------------------------------
[INFO] BUILD SUCCESSFUL
[INFO] ------------------------------------------------------------------------
[INFO] Total time: 1 minute 20 seconds
[INFO] Finished at: Sun Jul 01 00:16:21 UTC 2012
[INFO] Final Memory: 47M/196M
[INFO] ------------------------------------------------------------------------
channel stopped
Maven RedeployPublished use remote ubuntu2 maven settings from : /home/hudson/.m2/settings.xml
[INFO] Deployment in https://repository.apache.org/content/repositories/snapshots (id=apache.snapshots.https,uniqueVersion=false)
Deploying the main artifact myfaces-extval-core-1.2.6-SNAPSHOT.jar
ERROR: Error retrieving previous build number for artifact 'org.apache.myfaces.extensions.validator:myfaces-extval-core:jar':
repository metadata for: 'snapshot org.apache.myfaces.extensions.validator:myfaces-extval-core:1.2.6-SNAPSHOT'
could not be retrieved from repository: apache.snapshots.https due to an error: Failed to
transfer file: https://repository.apache.org/content/repositories/snapshots/org/apache/myfaces/extensions/validator/myfaces-extval-core/1.2.6-SNAPSHOT/maven-metadata.xml.
Return code is: 503, ReasonPhrase:Service Temporarily Unavailable.
org.apache.maven.artifact.deployer.ArtifactDeploymentException: Error retrieving previous
build number for artifact 'org.apache.myfaces.extensions.validator:myfaces-extval-core:jar':
repository metadata for: 'snapshot org.apache.myfaces.extensions.validator:myfaces-extval-core:1.2.6-SNAPSHOT'
could not be retrieved from repository: apache.snapshots.https due to an error: Failed to
transfer file: https://repository.apache.org/content/repositories/snapshots/org/apache/myfaces/extensions/validator/myfaces-extval-core/1.2.6-SNAPSHOT/maven-metadata.xml.
Return code is: 503, ReasonPhrase:Service Temporarily Unavailable.
	at hudson.maven.artifact.transform.SnapshotTransformation.transformForDeployment(SnapshotTransformation.java:110)
	at hudson.maven.artifact.transform.DefaultArtifactTransformationManager.transformForDeployment(DefaultArtifactTransformationManager.java:69)
	at hudson.maven.artifact.deployer.DefaultArtifactDeployer.deploy(DefaultArtifactDeployer.java:92)
	at hudson.maven.reporters.MavenArtifactRecord.deploy(MavenArtifactRecord.java:182)
	at hudson.maven.RedeployPublisher.perform(RedeployPublisher.java:174)
	at hudson.tasks.BuildStepMonitor$1.perform(BuildStepMonitor.java:19)
	at hudson.model.AbstractBuild$AbstractBuildExecution.perform(AbstractBuild.java:717)
	at hudson.model.AbstractBuild$AbstractBuildExecution.performAllBuildSteps(AbstractBuild.java:692)
	at hudson.maven.MavenModuleSetBuild$MavenModuleSetBuildExecution.post2(MavenModuleSetBuild.java:994)
	at hudson.model.AbstractBuild$AbstractBuildExecution.post(AbstractBuild.java:639)
	at hudson.model.Run.execute(Run.java:1485)
	at hudson.maven.MavenModuleSetBuild.run(MavenModuleSetBuild.java:477)
	at hudson.model.ResourceController.execute(ResourceController.java:88)
	at hudson.model.Executor.run(Executor.java:239)
Caused by: org.apache.maven.artifact.repository.metadata.RepositoryMetadataResolutionException:
repository metadata for: 'snapshot org.apache.myfaces.extensions.validator:myfaces-extval-core:1.2.6-SNAPSHOT'
could not be retrieved from repository: apache.snapshots.https due to an error: Failed to
transfer file: https://repository.apache.org/content/repositories/snapshots/org/apache/myfaces/extensions/validator/myfaces-extval-core/1.2.6-SNAPSHOT/maven-metadata.xml.
Return code is: 503, ReasonPhrase:Service Temporarily Unavailable.
	at org.apache.maven.artifact.repository.metadata.DefaultRepositoryMetadataManager.resolveAlways(DefaultRepositoryMetadataManager.java:400)
	at hudson.maven.artifact.transform.SnapshotTransformation.resolveLatestSnapshotBuildNumber(SnapshotTransformation.java:160)
	at hudson.maven.artifact.transform.SnapshotTransformation.transformForDeployment(SnapshotTransformation.java:104)
	... 13 more
Caused by: org.apache.maven.wagon.TransferFailedException: Failed to transfer file: https://repository.apache.org/content/repositories/snapshots/org/apache/myfaces/extensions/validator/myfaces-extval-core/1.2.6-SNAPSHOT/maven-metadata.xml.
Return code is: 503, ReasonPhrase:Service Temporarily Unavailable.
	at org.apache.maven.wagon.shared.http4.AbstractHttpClientWagon.fillInputData(AbstractHttpClientWagon.java:852)
	at org.apache.maven.wagon.StreamWagon.getInputStream(StreamWagon.java:116)
	at org.apache.maven.wagon.StreamWagon.getIfNewer(StreamWagon.java:88)
	at org.apache.maven.wagon.StreamWagon.get(StreamWagon.java:61)
	at org.apache.maven.repository.legacy.DefaultWagonManager.getRemoteFile(DefaultWagonManager.java:351)
	at org.apache.maven.repository.legacy.DefaultWagonManager.getArtifactMetadataFromDeploymentRepository(DefaultWagonManager.java:215)
	at org.apache.maven.artifact.repository.metadata.DefaultRepositoryMetadataManager.getArtifactMetadataFromDeploymentRepository(DefaultRepositoryMetadataManager.java:424)
	at org.apache.maven.artifact.repository.metadata.DefaultRepositoryMetadataManager.resolveAlways(DefaultRepositoryMetadataManager.java:396)
	... 15 more
[INFO] Deployment failed after 0.54 sec
Build step 'Deploy artifacts to Maven repository' changed build result to FAILURE

Mime
View raw message