myfaces-commits mailing list archives

Site index · List index
Message view « Date » · « Thread »
Top « Date » · « Thread »
From Apache Jenkins Server <jenk...@builds.apache.org>
Subject Build failed in Jenkins: myfaces-current-2.0-integration-tests #659
Date Thu, 16 Aug 2012 18:01:40 GMT
See <https://builds.apache.org/job/myfaces-current-2.0-integration-tests/659/>

------------------------------------------
[...truncated 829 lines...]
Aug 16, 2012 5:53:06 PM org.apache.myfaces.webapp.WebConfigParamsLogger logWebContextParams
INFO: No context init parameter 'org.apache.myfaces.CACHE_EL_EXPRESSIONS' found, using default
value 'noCache'.
Aug 16, 2012 5:53:06 PM org.apache.myfaces.webapp.WebConfigParamsLogger logWebContextParams
INFO: No context init parameter 'org.apache.myfaces.INITIALIZE_ALWAYS_STANDALONE' found, using
default value 'false'.
Aug 16, 2012 5:53:06 PM org.apache.myfaces.webapp.WebConfigParamsLogger logWebContextParams
INFO: No context init parameter 'org.apache.myfaces.LOG_WEB_CONTEXT_PARAMS' found, using default
value 'auto'.
Aug 16, 2012 5:53:06 PM org.apache.myfaces.webapp.WebConfigParamsLogger logWebContextParams
INFO: No context init parameter 'org.apache.myfaces.FACES_INITIALIZER' found.
Aug 16, 2012 5:53:06 PM org.apache.myfaces.webapp.WebConfigParamsLogger logWebContextParams
INFO: No context init parameter 'org.apache.myfaces.FACES_INIT_PLUGINS' found.
Aug 16, 2012 5:53:06 PM org.apache.myfaces.util.ExternalSpecifications isUnifiedELAvailable
INFO: MyFaces Unified EL support enabled
2012-08-16 17:53:06.366:INFO::Extract <https://builds.apache.org/job/myfaces-current-2.0-integration-tests/ws/servlet25-el22-basic-tests/target/cargo/configurations/jetty6x/cargocpc.war>
to /var/tmp/Jetty_0_0_0_0_9090_cargocpc.war__cargocpc__tqefh9/webapp
2012-08-16 17:53:06.408:INFO::Started SelectChannelConnector@0.0.0.0:9090
[INFO] [beddedLocalContainer] Jetty 6.x Embedded started on port [9090]
mojoSucceeded org.codehaus.cargo:cargo-maven2-plugin:1.1.1(start-container)
mojoStarted org.apache.maven.plugins:maven-failsafe-plugin:2.9(htmlunit-integration-tests)
[INFO] 
[INFO] Failsafe report directory: <https://builds.apache.org/job/myfaces-current-2.0-integration-tests/ws/servlet25-el22-basic-tests/target/failsafe-reports>

-------------------------------------------------------
 T E S T S
-------------------------------------------------------
Running org.apache.myfaces.integrationtest.FormInputTest
[INFO] --- maven-failsafe-plugin:2.9:integration-test (htmlunit-integration-tests) @ myfaces-servlet25-el22-basic-tests
---
2012-08-16 17:53:10.167:INFO:/cargo-test:No state saving method defined, assuming default
server state saving
Tests run: 1, Failures: 0, Errors: 0, Skipped: 0, Time elapsed: 2.502 sec

Results :

Tests run: 1, Failures: 0, Errors: 0, Skipped: 0

[WARNING] File encoding has not been set, using platform encoding ISO646-US, i.e. build is
platform dependent!
mojoSucceeded org.apache.maven.plugins:maven-failsafe-plugin:2.9(htmlunit-integration-tests)
[JENKINS] Recording test results
mojoStarted org.codehaus.cargo:cargo-maven2-plugin:1.1.1(stop-container)
[INFO] [beddedLocalContainer] Jetty 6.x Embedded is stopping...
[INFO] 
[INFO] --- cargo-maven2-plugin:1.1.1:stop (stop-container) @ myfaces-servlet25-el22-basic-tests
---
2012-08-16 17:53:16.152:INFO::Stopped SelectChannelConnector@0.0.0.0:9090
[INFO] [beddedLocalContainer] Jetty 6.x Embedded is stopped
mojoSucceeded org.codehaus.cargo:cargo-maven2-plugin:1.1.1(stop-container)
mojoStarted org.apache.maven.plugins:maven-checkstyle-plugin:2.6(verify-style)[INFO] 

[INFO] 
[INFO] --- maven-checkstyle-plugin:2.6:check (verify-style) @ myfaces-servlet25-el22-basic-tests
---
mojoSucceeded org.apache.maven.plugins:maven-checkstyle-plugin:2.6(verify-style)
mojoStarted org.apache.maven.plugins:maven-failsafe-plugin:2.9(verify)
[INFO] 
[INFO] Failsafe report directory: <https://builds.apache.org/job/myfaces-current-2.0-integration-tests/ws/servlet25-el22-basic-tests/target/failsafe-reports>
[WARNING] File encoding has not been set, using platform encoding ISO646-US, i.e. build is
platform dependent!
[INFO] --- maven-failsafe-plugin:2.9:verify (verify) @ myfaces-servlet25-el22-basic-tests
---
mojoSucceeded org.apache.maven.plugins:maven-failsafe-plugin:2.9(verify)
mojoStarted org.apache.maven.plugins:maven-install-plugin:2.3.1(default-install)
[INFO] 
[INFO] Installing <https://builds.apache.org/job/myfaces-current-2.0-integration-tests/ws/servlet25-el22-basic-tests/target/myfaces-servlet25-el22-basic-tests-2.0.15-SNAPSHOT.war>
to /export/home/hudson/hudson-slave/maven-repositories/1/org/apache/myfaces/core/integrationtest/myfaces-servlet25-el22-basic-tests/2.0.15-SNAPSHOT/myfaces-servlet25-el22-basic-tests-2.0.15-SNAPSHOT.war
[INFO] Installing <https://builds.apache.org/job/myfaces-current-2.0-integration-tests/ws/servlet25-el22-basic-tests/pom.xml>
to /export/home/hudson/hudson-slave/maven-repositories/1/org/apache/myfaces/core/integrationtest/myfaces-servlet25-el22-basic-tests/2.0.15-SNAPSHOT/myfaces-servlet25-el22-basic-tests-2.0.15-SNAPSHOT.pom
[INFO] --- maven-install-plugin:2.3.1:install (default-install) @ myfaces-servlet25-el22-basic-tests
---
[INFO] Installing <https://builds.apache.org/job/myfaces-current-2.0-integration-tests/ws/servlet25-el22-basic-tests/target/myfaces-servlet25-el22-basic-tests-2.0.15-SNAPSHOT-sources.jar>
to /export/home/hudson/hudson-slave/maven-repositories/1/org/apache/myfaces/core/integrationtest/myfaces-servlet25-el22-basic-tests/2.0.15-SNAPSHOT/myfaces-servlet25-el22-basic-tests-2.0.15-SNAPSHOT-sources.jar
mojoSucceeded org.apache.maven.plugins:maven-install-plugin:2.3.1(default-install)
projectSucceeded org.apache.myfaces.core.integrationtest:myfaces-servlet25-el22-basic-tests:2.0.15-SNAPSHOT
projectStarted org.apache.myfaces.core.integrationtest:myfaces-servlet30-el22-basic-tests:2.0.15-SNAPSHOT
[INFO]                                                                         
[INFO] ------------------------------------------------------------------------
[INFO] Building Apache MyFaces JSF-2.0 Core Integration Tests - Basic tests for a Servlet
3.0 + EL 2.2 environment 2.0.15-SNAPSHOT
[INFO] ------------------------------------------------------------------------
mojoStarted org.apache.maven.plugins:maven-clean-plugin:2.4.1(default-clean)
[INFO] 
[INFO] --- maven-clean-plugin:2.4.1:clean (default-clean) @ myfaces-servlet30-el22-basic-tests
---[INFO] Deleting <https://builds.apache.org/job/myfaces-current-2.0-integration-tests/ws/servlet30-el22-basic-tests/target>

mojoSucceeded org.apache.maven.plugins:maven-clean-plugin:2.4.1(default-clean)
mojoStarted org.apache.maven.plugins:maven-remote-resources-plugin:1.2.1(default)
[INFO] 
[INFO] --- maven-remote-resources-plugin:1.2.1:process (default) @ myfaces-servlet30-el22-basic-tests
---
mojoSucceeded org.apache.maven.plugins:maven-remote-resources-plugin:1.2.1(default)
mojoStarted org.apache.maven.plugins:maven-resources-plugin:2.5(default-resources)
[debug] execute contextualize
[INFO] 
[INFO] Using 'UTF-8' encoding to copy filtered resources.
[INFO] Copying 0 resource
[INFO] Copying 3 resources
[INFO] --- maven-resources-plugin:2.5:resources (default-resources) @ myfaces-servlet30-el22-basic-tests
---
mojoSucceeded org.apache.maven.plugins:maven-resources-plugin:2.5(default-resources)
mojoStarted org.apache.maven.plugins:maven-compiler-plugin:2.0.2(default-compile)
[INFO] 
[INFO] Compiling 1 source file to <https://builds.apache.org/job/myfaces-current-2.0-integration-tests/ws/servlet30-el22-basic-tests/target/classes>
[INFO] --- maven-compiler-plugin:2.0.2:compile (default-compile) @ myfaces-servlet30-el22-basic-tests
---
mojoSucceeded org.apache.maven.plugins:maven-compiler-plugin:2.0.2(default-compile)
mojoStarted org.apache.maven.plugins:maven-resources-plugin:2.5(default-testResources)
[INFO] [debug] execute contextualize
[INFO] Using 'UTF-8' encoding to copy filtered resources.
[INFO] skip non existing resourceDirectory <https://builds.apache.org/job/myfaces-current-2.0-integration-tests/ws/servlet30-el22-basic-tests/src/test/resources>

[INFO] Copying 3 resources
[INFO] --- maven-resources-plugin:2.5:testResources (default-testResources) @ myfaces-servlet30-el22-basic-tests
---
mojoSucceeded org.apache.maven.plugins:maven-resources-plugin:2.5(default-testResources)
mojoStarted org.apache.maven.plugins:maven-compiler-plugin:2.0.2(default-testCompile)
[INFO] 
[INFO] Compiling 1 source file to <https://builds.apache.org/job/myfaces-current-2.0-integration-tests/ws/servlet30-el22-basic-tests/target/test-classes>
[INFO] --- maven-compiler-plugin:2.0.2:testCompile (default-testCompile) @ myfaces-servlet30-el22-basic-tests
---
mojoSucceeded org.apache.maven.plugins:maven-compiler-plugin:2.0.2(default-testCompile)
mojoStarted org.apache.maven.plugins:maven-surefire-plugin:2.9(default-test)
[INFO] 
[INFO] Tests are skipped.
[INFO] --- maven-surefire-plugin:2.9:test (default-test) @ myfaces-servlet30-el22-basic-tests
---
mojoSucceeded org.apache.maven.plugins:maven-surefire-plugin:2.9(default-test)
mojoStarted org.apache.maven.plugins:maven-war-plugin:2.1.1(default-war)
[INFO] 
[INFO] --- maven-war-plugin:2.1.1:war (default-war) @ myfaces-servlet30-el22-basic-tests ---[INFO]
Packaging webapp
[INFO] Assembling webapp [myfaces-servlet30-el22-basic-tests] in [<https://builds.apache.org/job/myfaces-current-2.0-integration-tests/ws/servlet30-el22-basic-tests/target/myfaces-servlet30-el22-basic-tests-2.0.15-SNAPSHOT]>
[INFO] Processing war project
[INFO] Copying webapp resources [<https://builds.apache.org/job/myfaces-current-2.0-integration-tests/ws/servlet30-el22-basic-tests/src/main/webapp]>
[INFO] Webapp assembled in [93 msecs]

[INFO] Building war: <https://builds.apache.org/job/myfaces-current-2.0-integration-tests/ws/servlet30-el22-basic-tests/target/myfaces-servlet30-el22-basic-tests-2.0.15-SNAPSHOT.war>
[INFO] WEB-INF/web.xml already added, skipping
mojoSucceeded org.apache.maven.plugins:maven-war-plugin:2.1.1(default-war)
mojoStarted org.apache.maven.plugins:maven-site-plugin:3.0(attach-descriptor)
[INFO] 
[INFO] --- maven-site-plugin:3.0:attach-descriptor (attach-descriptor) @ myfaces-servlet30-el22-basic-tests
---
mojoSucceeded org.apache.maven.plugins:maven-site-plugin:3.0(attach-descriptor)
Aug 16, 2012 5:53:45 PM hudson.maven.ExecutedMojo <init>
WARNING: Failed to getClass for org.apache.maven.plugin.source.SourceJarMojo
mojoStarted org.apache.maven.plugins:maven-source-plugin:2.0.4(attach-source)
[INFO] 
[INFO] Building jar: <https://builds.apache.org/job/myfaces-current-2.0-integration-tests/ws/servlet30-el22-basic-tests/target/myfaces-servlet30-el22-basic-tests-2.0.15-SNAPSHOT-sources.jar>
[INFO] --- maven-source-plugin:2.0.4:jar (attach-source) @ myfaces-servlet30-el22-basic-tests
---
mojoSucceeded org.apache.maven.plugins:maven-source-plugin:2.0.4(attach-source)
mojoStarted org.codehaus.cargo:cargo-maven2-plugin:1.1.1(start-container)
[INFO] 
[INFO] --- cargo-maven2-plugin:1.1.1:start (start-container) @ myfaces-servlet30-el22-basic-tests
---
mojoFailed org.codehaus.cargo:cargo-maven2-plugin:1.1.1(start-container)
projectFailed org.apache.myfaces.core.integrationtest:myfaces-servlet30-el22-basic-tests:2.0.15-SNAPSHOT
sessionEnded
[INFO] ------------------------------------------------------------------------
[INFO] Reactor Summary:
[INFO] 
[INFO] Apache MyFaces JSF-2.0 Core Integration Tests Parent  SUCCESS [5:36.797s]
[INFO] Apache MyFaces JSF-2.0 Core Integration Tests Support Module  SUCCESS [27.329s]
[INFO] Apache MyFaces JSF-2.0 Core Integration Tests - Basic tests for a Servlet 2.5 + EL
1.0 environment  SUCCESS [1:54.977s]
[INFO] Apache MyFaces JSF-2.0 Core Integration Tests - Basic tests for a Servlet 2.5 + EL
2.2 environment  SUCCESS [44.032s]
[INFO] Apache MyFaces JSF-2.0 Core Integration Tests - Basic tests for a Servlet 3.0 + EL
2.2 environment  FAILURE [18.524s]
[INFO] ------------------------------------------------------------------------
[INFO] BUILD FAILURE
[INFO] ------------------------------------------------------------------------
[INFO] Total time: 9:20.224s
[INFO] Finished at: Thu Aug 16 17:53:52 GMT+00:00 2012
[INFO] Final Memory: 45M/371M
[INFO] ------------------------------------------------------------------------
Projects to build: [MavenProject: org.apache.myfaces.core.integrationtest:myfaces-integration-tests:2.0.15-SNAPSHOT
@ <https://builds.apache.org/job/myfaces-current-2.0-integration-tests/ws/pom.xml,>
MavenProject: org.apache.myfaces.core.integrationtest:myfaces-integration-test-support:2.0.15-SNAPSHOT
@ <https://builds.apache.org/job/myfaces-current-2.0-integration-tests/ws/integration-test-support/pom.xml,>
MavenProject: org.apache.myfaces.core.integrationtest:myfaces-servlet25-el10-basic-tests:2.0.15-SNAPSHOT
@ <https://builds.apache.org/job/myfaces-current-2.0-integration-tests/ws/servlet25-el10-basic-tests/pom.xml,>
MavenProject: org.apache.myfaces.core.integrationtest:myfaces-servlet25-el22-basic-tests:2.0.15-SNAPSHOT
@ <https://builds.apache.org/job/myfaces-current-2.0-integration-tests/ws/servlet25-el22-basic-tests/pom.xml,>
MavenProject: org.apache.myfaces.core.integrationtest:myfaces-servlet30-el22-basic-tests:2.0.15-SNAPSHOT
@ <https://builds.apache.org/job/myfaces-current-2.0-integration-tests/ws/servlet30-el22-basic-tests/pom.xml]>
[JENKINS] Archiving <https://builds.apache.org/job/myfaces-current-2.0-integration-tests/ws/pom.xml>
to /home/hudson/hudson/jobs/myfaces-current-2.0-integration-tests/modules/org.apache.myfaces.core.integrationtest$myfaces-integration-tests/builds/2012-08-16_17-42-49/archive/org.apache.myfaces.core.integrationtest/myfaces-integration-tests/2.0.15-SNAPSHOT/myfaces-integration-tests-2.0.15-SNAPSHOT.pom
[JENKINS] Archiving <https://builds.apache.org/job/myfaces-current-2.0-integration-tests/ws/integration-test-support/pom.xml>
to /home/hudson/hudson/jobs/myfaces-current-2.0-integration-tests/modules/org.apache.myfaces.core.integrationtest$myfaces-integration-test-support/builds/2012-08-16_17-42-49/archive/org.apache.myfaces.core.integrationtest/myfaces-integration-test-support/2.0.15-SNAPSHOT/myfaces-integration-test-support-2.0.15-SNAPSHOT.pom
[JENKINS] Archiving <https://builds.apache.org/job/myfaces-current-2.0-integration-tests/ws/integration-test-support/target/myfaces-integration-test-support-2.0.15-SNAPSHOT.jar>
to /home/hudson/hudson/jobs/myfaces-current-2.0-integration-tests/modules/org.apache.myfaces.core.integrationtest$myfaces-integration-test-support/builds/2012-08-16_17-42-49/archive/org.apache.myfaces.core.integrationtest/myfaces-integration-test-support/2.0.15-SNAPSHOT/myfaces-integration-test-support-2.0.15-SNAPSHOT.jar
[JENKINS] Archiving <https://builds.apache.org/job/myfaces-current-2.0-integration-tests/ws/integration-test-support/target/myfaces-integration-test-support-2.0.15-SNAPSHOT-sources.jar>
to /home/hudson/hudson/jobs/myfaces-current-2.0-integration-tests/modules/org.apache.myfaces.core.integrationtest$myfaces-integration-test-support/builds/2012-08-16_17-42-49/archive/org.apache.myfaces.core.integrationtest/myfaces-integration-test-support/2.0.15-SNAPSHOT/myfaces-integration-test-support-2.0.15-SNAPSHOT-sources.jar
[JENKINS] Archiving <https://builds.apache.org/job/myfaces-current-2.0-integration-tests/ws/servlet25-el22-basic-tests/pom.xml>
to /home/hudson/hudson/jobs/myfaces-current-2.0-integration-tests/modules/org.apache.myfaces.core.integrationtest$myfaces-servlet25-el22-basic-tests/builds/2012-08-16_17-42-50/archive/org.apache.myfaces.core.integrationtest/myfaces-servlet25-el22-basic-tests/2.0.15-SNAPSHOT/myfaces-servlet25-el22-basic-tests-2.0.15-SNAPSHOT.pom
[JENKINS] Archiving <https://builds.apache.org/job/myfaces-current-2.0-integration-tests/ws/servlet25-el22-basic-tests/target/myfaces-servlet25-el22-basic-tests-2.0.15-SNAPSHOT.war>
to /home/hudson/hudson/jobs/myfaces-current-2.0-integration-tests/modules/org.apache.myfaces.core.integrationtest$myfaces-servlet25-el22-basic-tests/builds/2012-08-16_17-42-50/archive/org.apache.myfaces.core.integrationtest/myfaces-servlet25-el22-basic-tests/2.0.15-SNAPSHOT/myfaces-servlet25-el22-basic-tests-2.0.15-SNAPSHOT.war
[JENKINS] Archiving <https://builds.apache.org/job/myfaces-current-2.0-integration-tests/ws/servlet25-el22-basic-tests/target/myfaces-servlet25-el22-basic-tests-2.0.15-SNAPSHOT-sources.jar>
to /home/hudson/hudson/jobs/myfaces-current-2.0-integration-tests/modules/org.apache.myfaces.core.integrationtest$myfaces-servlet25-el22-basic-tests/builds/2012-08-16_17-42-50/archive/org.apache.myfaces.core.integrationtest/myfaces-servlet25-el22-basic-tests/2.0.15-SNAPSHOT/myfaces-servlet25-el22-basic-tests-2.0.15-SNAPSHOT-sources.jar
[JENKINS] Archiving <https://builds.apache.org/job/myfaces-current-2.0-integration-tests/ws/servlet25-el10-basic-tests/pom.xml>
to /home/hudson/hudson/jobs/myfaces-current-2.0-integration-tests/modules/org.apache.myfaces.core.integrationtest$myfaces-servlet25-el10-basic-tests/builds/2012-08-16_17-42-50/archive/org.apache.myfaces.core.integrationtest/myfaces-servlet25-el10-basic-tests/2.0.15-SNAPSHOT/myfaces-servlet25-el10-basic-tests-2.0.15-SNAPSHOT.pom
[JENKINS] Archiving <https://builds.apache.org/job/myfaces-current-2.0-integration-tests/ws/servlet25-el10-basic-tests/target/myfaces-servlet25-el10-basic-tests-2.0.15-SNAPSHOT.war>
to /home/hudson/hudson/jobs/myfaces-current-2.0-integration-tests/modules/org.apache.myfaces.core.integrationtest$myfaces-servlet25-el10-basic-tests/builds/2012-08-16_17-42-50/archive/org.apache.myfaces.core.integrationtest/myfaces-servlet25-el10-basic-tests/2.0.15-SNAPSHOT/myfaces-servlet25-el10-basic-tests-2.0.15-SNAPSHOT.war
[JENKINS] Archiving <https://builds.apache.org/job/myfaces-current-2.0-integration-tests/ws/servlet25-el10-basic-tests/target/myfaces-servlet25-el10-basic-tests-2.0.15-SNAPSHOT-sources.jar>
to /home/hudson/hudson/jobs/myfaces-current-2.0-integration-tests/modules/org.apache.myfaces.core.integrationtest$myfaces-servlet25-el10-basic-tests/builds/2012-08-16_17-42-50/archive/org.apache.myfaces.core.integrationtest/myfaces-servlet25-el10-basic-tests/2.0.15-SNAPSHOT/myfaces-servlet25-el10-basic-tests-2.0.15-SNAPSHOT-sources.jar
[JENKINS] Archiving <https://builds.apache.org/job/myfaces-current-2.0-integration-tests/ws/servlet30-el22-basic-tests/pom.xml>
to /home/hudson/hudson/jobs/myfaces-current-2.0-integration-tests/modules/org.apache.myfaces.core.integrationtest$myfaces-servlet30-el22-basic-tests/builds/2012-08-16_17-42-51/archive/org.apache.myfaces.core.integrationtest/myfaces-servlet30-el22-basic-tests/2.0.15-SNAPSHOT/myfaces-servlet30-el22-basic-tests-2.0.15-SNAPSHOT.pom
[JENKINS] Archiving <https://builds.apache.org/job/myfaces-current-2.0-integration-tests/ws/servlet30-el22-basic-tests/target/myfaces-servlet30-el22-basic-tests-2.0.15-SNAPSHOT.war>
to /home/hudson/hudson/jobs/myfaces-current-2.0-integration-tests/modules/org.apache.myfaces.core.integrationtest$myfaces-servlet30-el22-basic-tests/builds/2012-08-16_17-42-51/archive/org.apache.myfaces.core.integrationtest/myfaces-servlet30-el22-basic-tests/2.0.15-SNAPSHOT/myfaces-servlet30-el22-basic-tests-2.0.15-SNAPSHOT.war
[JENKINS] Archiving <https://builds.apache.org/job/myfaces-current-2.0-integration-tests/ws/servlet30-el22-basic-tests/target/myfaces-servlet30-el22-basic-tests-2.0.15-SNAPSHOT-sources.jar>
to /home/hudson/hudson/jobs/myfaces-current-2.0-integration-tests/modules/org.apache.myfaces.core.integrationtest$myfaces-servlet30-el22-basic-tests/builds/2012-08-16_17-42-51/archive/org.apache.myfaces.core.integrationtest/myfaces-servlet30-el22-basic-tests/2.0.15-SNAPSHOT/myfaces-servlet30-el22-basic-tests-2.0.15-SNAPSHOT-sources.jar
Waiting for Jenkins to finish collecting data
mavenExecutionResult exceptions not empty
message : Failed to execute goal org.codehaus.cargo:cargo-maven2-plugin:1.1.1:start (start-container)
on project myfaces-servlet30-el22-basic-tests: Execution start-container of goal org.codehaus.cargo:cargo-maven2-plugin:1.1.1:start
failed: Failed to download [http://archive.apache.org/dist/tomcat/tomcat-7/v7.0.16/bin/apache-tomcat-7.0.16.zip]
cause : Execution start-container of goal org.codehaus.cargo:cargo-maven2-plugin:1.1.1:start
failed: Failed to download [http://archive.apache.org/dist/tomcat/tomcat-7/v7.0.16/bin/apache-tomcat-7.0.16.zip]
Stack trace : 
org.apache.maven.lifecycle.LifecycleExecutionException: Failed to execute goal org.codehaus.cargo:cargo-maven2-plugin:1.1.1:start
(start-container) on project myfaces-servlet30-el22-basic-tests: Execution start-container
of goal org.codehaus.cargo:cargo-maven2-plugin:1.1.1:start failed: Failed to download [http://archive.apache.org/dist/tomcat/tomcat-7/v7.0.16/bin/apache-tomcat-7.0.16.zip]
	at org.apache.maven.lifecycle.internal.MojoExecutor.execute(MojoExecutor.java:225)
	at org.apache.maven.lifecycle.internal.MojoExecutor.execute(MojoExecutor.java:153)
	at org.apache.maven.lifecycle.internal.MojoExecutor.execute(MojoExecutor.java:145)
	at org.apache.maven.lifecycle.internal.LifecycleModuleBuilder.buildProject(LifecycleModuleBuilder.java:84)
	at org.apache.maven.lifecycle.internal.LifecycleModuleBuilder.buildProject(LifecycleModuleBuilder.java:59)
	at org.apache.maven.lifecycle.internal.LifecycleStarter.singleThreadedBuild(LifecycleStarter.java:183)
	at org.apache.maven.lifecycle.internal.LifecycleStarter.execute(LifecycleStarter.java:161)
	at org.apache.maven.DefaultMaven.doExecute(DefaultMaven.java:319)
	at org.apache.maven.DefaultMaven.execute(DefaultMaven.java:156)
	at org.jvnet.hudson.maven3.launcher.Maven3Launcher.main(Maven3Launcher.java:79)
	at sun.reflect.NativeMethodAccessorImpl.invoke0(Native Method)
	at sun.reflect.NativeMethodAccessorImpl.invoke(NativeMethodAccessorImpl.java:39)
	at sun.reflect.DelegatingMethodAccessorImpl.invoke(DelegatingMethodAccessorImpl.java:25)
	at java.lang.reflect.Method.invoke(Method.java:597)
	at org.codehaus.plexus.classworlds.launcher.Launcher.launchStandard(Launcher.java:329)
	at org.codehaus.plexus.classworlds.launcher.Launcher.launch(Launcher.java:239)
	at org.jvnet.hudson.maven3.agent.Maven3Main.launch(Maven3Main.java:158)
	at hudson.maven.Maven3Builder.call(Maven3Builder.java:98)
	at hudson.maven.Maven3Builder.call(Maven3Builder.java:64)
	at hudson.remoting.UserRequest.perform(UserRequest.java:118)
	at hudson.remoting.UserRequest.perform(UserRequest.java:48)
	at hudson.remoting.Request$2.run(Request.java:326)
	at hudson.remoting.InterceptingExecutorService$1.call(InterceptingExecutorService.java:72)
	at java.util.concurrent.FutureTask$Sync.innerRun(FutureTask.java:303)
	at java.util.concurrent.FutureTask.run(FutureTask.java:138)
	at java.util.concurrent.ThreadPoolExecutor$Worker.runTask(ThreadPoolExecutor.java:886)
	at java.util.concurrent.ThreadPoolExecutor$Worker.run(ThreadPoolExecutor.java:908)
	at java.lang.Thread.run(Thread.java:662)
Caused by: org.apache.maven.plugin.PluginExecutionException: Execution start-container of
goal org.codehaus.cargo:cargo-maven2-plugin:1.1.1:start failed: Failed to download [http://archive.apache.org/dist/tomcat/tomcat-7/v7.0.16/bin/apache-tomcat-7.0.16.zip]
	at org.apache.maven.plugin.DefaultBuildPluginManager.executeMojo(DefaultBuildPluginManager.java:110)
	at org.apache.maven.lifecycle.internal.MojoExecutor.execute(MojoExecutor.java:209)
	... 27 more
Caused by: org.codehaus.cargo.container.ContainerException: Failed to download [http://archive.apache.org/dist/tomcat/tomcat-7/v7.0.16/bin/apache-tomcat-7.0.16.zip]
	at org.codehaus.cargo.container.installer.ZipURLInstaller.download(ZipURLInstaller.java:456)
	at org.codehaus.cargo.container.installer.ZipURLInstaller.install(ZipURLInstaller.java:246)
	at org.codehaus.cargo.maven2.configuration.Container.setupHome(Container.java:662)
	at org.codehaus.cargo.maven2.configuration.Container.createContainer(Container.java:417)
	at org.codehaus.cargo.maven2.AbstractCargoMojo.createNewContainer(AbstractCargoMojo.java:483)
	at org.codehaus.cargo.maven2.AbstractCargoMojo.createContainer(AbstractCargoMojo.java:423)
	at org.codehaus.cargo.maven2.AbstractContainerStartMojo.doExecute(AbstractContainerStartMojo.java:46)
	at org.codehaus.cargo.maven2.ContainerStartMojo.doExecute(ContainerStartMojo.java:52)
	at org.codehaus.cargo.maven2.AbstractCargoMojo.execute(AbstractCargoMojo.java:278)
	at org.apache.maven.plugin.DefaultBuildPluginManager.executeMojo(DefaultBuildPluginManager.java:101)
	... 28 more
Caused by: in cargo code: java.net.SocketException: Connection reset
	at org.apache.tools.ant.taskdefs.Get.execute(Get.java:82)
	at org.codehaus.cargo.container.installer.ZipURLInstaller.doDownload(ZipURLInstaller.java:497)
	at org.codehaus.cargo.container.installer.ZipURLInstaller.download(ZipURLInstaller.java:436)
	... 37 more
Caused by: java.net.SocketException: Connection reset
	at sun.reflect.NativeConstructorAccessorImpl.newInstance0(Native Method)
	at sun.reflect.NativeConstructorAccessorImpl.newInstance(NativeConstructorAccessorImpl.java:39)
	at sun.reflect.DelegatingConstructorAccessorImpl.newInstance(DelegatingConstructorAccessorImpl.java:27)
	at java.lang.reflect.Constructor.newInstance(Constructor.java:513)
	at sun.net.www.protocol.http.HttpURLConnection$6.run(HttpURLConnection.java:1496)
	at java.security.AccessController.doPrivileged(Native Method)
	at sun.net.www.protocol.http.HttpURLConnection.getChainedException(HttpURLConnection.java:1490)
	at sun.net.www.protocol.http.HttpURLConnection.getInputStream(HttpURLConnection.java:1144)
	at java.net.HttpURLConnection.getResponseCode(HttpURLConnection.java:379)
	at org.apache.tools.ant.taskdefs.Get.doGet(Get.java:151)
	at org.apache.tools.ant.taskdefs.Get.execute(Get.java:78)
	... 39 more
Caused by: java.net.SocketException: Connection reset
	at java.net.SocketInputStream.read(SocketInputStream.java:168)
	at java.io.BufferedInputStream.fill(BufferedInputStream.java:218)
	at java.io.BufferedInputStream.read1(BufferedInputStream.java:258)
	at java.io.BufferedInputStream.read(BufferedInputStream.java:317)
	at sun.net.www.http.HttpClient.parseHTTPHeader(HttpClient.java:687)
	at sun.net.www.http.HttpClient.parseHTTP(HttpClient.java:632)
	at sun.net.www.http.HttpClient.parseHTTP(HttpClient.java:652)
	at sun.net.www.protocol.http.HttpURLConnection.getInputStream(HttpURLConnection.java:1200)
	at sun.net.www.protocol.http.HttpURLConnection.getHeaderField(HttpURLConnection.java:2301)
	at java.net.HttpURLConnection.getHeaderFieldDate(HttpURLConnection.java:450)
	at java.net.URLConnection.getLastModified(URLConnection.java:532)
	at org.apache.tools.ant.taskdefs.Get.doGet(Get.java:150)
	... 40 more
Sending e-mails to: commits@myfaces.apache.org
channel stopped
2012-08-16 18:02:00.917:INFO::Shutdown hook executing
2012-08-16 18:02:00.917:INFO::Shutdown hook complete

Mime
View raw message