myfaces-commits mailing list archives

Site index · List index
Message view « Date » · « Thread »
Top « Date » · « Thread »
From Apache Jenkins Server <jenk...@builds.apache.org>
Subject Build failed in Jenkins: tobago-1.0.x-deploy #270
Date Sun, 07 Oct 2012 12:33:49 GMT
See <https://builds.apache.org/job/tobago-1.0.x-deploy/270/>

------------------------------------------
[...truncated 2526 lines...]
[INFO] skip non existing resourceDirectory <https://builds.apache.org/job/tobago-1.0.x-deploy/ws/tobago-1.0.x-deploy/tobago-tool/maven-apt-plugin/src/test/resources>
[INFO] Copying 3 resources
[INFO] [compiler:testCompile {execution: default-testCompile}]
[INFO] No sources to compile
[INFO] [surefire:test {execution: default-test}]
[INFO] Surefire report directory: <https://builds.apache.org/job/tobago-1.0.x-deploy/ws/tobago-1.0.x-deploy/tobago-tool/maven-apt-plugin/target/surefire-reports>

-------------------------------------------------------
 T E S T S
-------------------------------------------------------
There are no tests to run.

Results :

Tests run: 0, Failures: 0, Errors: 0, Skipped: 0

[JENKINS] Recording test results
[INFO] [jar:jar {execution: default-jar}]
[INFO] Building jar: <https://builds.apache.org/job/tobago-1.0.x-deploy/ws/tobago-1.0.x-deploy/tobago-tool/maven-apt-plugin/target/maven-apt-plugin-1.0.40-SNAPSHOT.jar>
[INFO] [plugin:addPluginArtifactMetadata {execution: default-addPluginArtifactMetadata}]
[INFO] [assembly:single {execution: source-release-assembly}]
[INFO] Skipping the assembly in this project because it's not the Execution Root
[INFO] [install:install {execution: default-install}]
[INFO] Installing <https://builds.apache.org/job/tobago-1.0.x-deploy/ws/tobago-1.0.x-deploy/tobago-tool/maven-apt-plugin/target/maven-apt-plugin-1.0.40-SNAPSHOT.jar>
to /home/jenkins/jenkins-slave/maven-repositories/1/org/apache/myfaces/tobago/maven-apt-plugin/1.0.40-SNAPSHOT/maven-apt-plugin-1.0.40-SNAPSHOT.jar
[INFO] Installing <https://builds.apache.org/job/tobago-1.0.x-deploy/ws/tobago-1.0.x-deploy/tobago-tool/maven-apt-plugin/target/maven-apt-plugin-1.0.40-SNAPSHOT-sources.jar>
to /home/jenkins/jenkins-slave/maven-repositories/1/org/apache/myfaces/tobago/maven-apt-plugin/1.0.40-SNAPSHOT/maven-apt-plugin-1.0.40-SNAPSHOT-sources.jar
[INFO] [deploy:deploy {execution: default-deploy}]
[INFO] Retrieving previous build number from apache.snapshots.https
[WARNING] *** CHECKSUM FAILED - Checksum failed on download: local = 'f97b6d4f7e62763ecb4a0bb3744eb7f5c6b29d9a';
remote = '70791c6e52353c1b8e01806b092d4eb9567b989e' - RETRYING
[WARNING] *** CHECKSUM FAILED - Checksum failed on download: local = 'f97b6d4f7e62763ecb4a0bb3744eb7f5c6b29d9a';
remote = '70791c6e52353c1b8e01806b092d4eb9567b989e' - IGNORING
Uploading: https://repository.apache.org/content/repositories/snapshots/org/apache/myfaces/tobago/maven-apt-plugin/1.0.40-SNAPSHOT/maven-apt-plugin-1.0.40-SNAPSHOT.jar
25K uploaded  (maven-apt-plugin-1.0.40-SNAPSHOT.jar)
[INFO] Retrieving previous metadata from apache.snapshots.https
[WARNING] *** CHECKSUM FAILED - Checksum failed on download: local = 'f97b6d4f7e62763ecb4a0bb3744eb7f5c6b29d9a';
remote = '70791c6e52353c1b8e01806b092d4eb9567b989e' - RETRYING
[WARNING] *** CHECKSUM FAILED - Checksum failed on download: local = 'f97b6d4f7e62763ecb4a0bb3744eb7f5c6b29d9a';
remote = '70791c6e52353c1b8e01806b092d4eb9567b989e' - IGNORING
[INFO] Uploading repository metadata for: 'snapshot org.apache.myfaces.tobago:maven-apt-plugin:1.0.40-SNAPSHOT'
[INFO] Retrieving previous metadata from apache.snapshots.https
[INFO] Uploading repository metadata for: 'artifact org.apache.myfaces.tobago:maven-apt-plugin'
[INFO] Uploading project information for maven-apt-plugin 1.0.40-SNAPSHOT
[INFO] Retrieving previous metadata from apache.snapshots.https
[INFO] Uploading repository metadata for: 'org.apache.myfaces.tobago'
[INFO] Retrieving previous build number from apache.snapshots.https
Uploading: https://repository.apache.org/content/repositories/snapshots/org/apache/myfaces/tobago/maven-apt-plugin/1.0.40-SNAPSHOT/maven-apt-plugin-1.0.40-SNAPSHOT-sources.jar
15K uploaded  (maven-apt-plugin-1.0.40-SNAPSHOT-sources.jar)
[JENKINS] Archiving <https://builds.apache.org/job/tobago-1.0.x-deploy/ws/tobago-1.0.x-deploy/tobago-tool/maven-apt-plugin/target/maven-apt-plugin-1.0.40-SNAPSHOT.jar>
to /home/hudson/hudson/jobs/tobago-1.0.x-deploy/modules/org.apache.myfaces.tobago$maven-apt-plugin/builds/2012-10-07_12-31-29/archive/org.apache.myfaces.tobago/maven-apt-plugin/1.0.40-SNAPSHOT/maven-apt-plugin-1.0.40-SNAPSHOT.jar
[JENKINS] Archiving <https://builds.apache.org/job/tobago-1.0.x-deploy/ws/tobago-1.0.x-deploy/tobago-tool/maven-apt-plugin/target/maven-apt-plugin-1.0.40-SNAPSHOT-sources.jar>
to /home/hudson/hudson/jobs/tobago-1.0.x-deploy/modules/org.apache.myfaces.tobago$maven-apt-plugin/builds/2012-10-07_12-31-29/archive/org.apache.myfaces.tobago/maven-apt-plugin/1.0.40-SNAPSHOT/maven-apt-plugin-1.0.40-SNAPSHOT-sources.jar
[INFO] ------------------------------------------------------------------------
[INFO] Building Maven Tobago Theme Plugin
[INFO]    task-segment: [clean, source:jar, deploy]
[INFO] ------------------------------------------------------------------------
[INFO] [clean:clean {execution: default-clean}]
[INFO] Preparing source:jar
[JENKINS] Archiving <https://builds.apache.org/job/tobago-1.0.x-deploy/ws/tobago-1.0.x-deploy/tobago-tool/maven-theme-plugin/pom.xml>
to /home/hudson/hudson/jobs/tobago-1.0.x-deploy/modules/org.apache.myfaces.tobago$maven-theme-plugin/builds/2012-10-07_12-31-29/archive/org.apache.myfaces.tobago/maven-theme-plugin/1.0.40-SNAPSHOT/maven-theme-plugin-1.0.40-SNAPSHOT.pom
[INFO] [buildnumber:create {execution: default}]
[INFO] [source:jar {execution: default-cli}]
[INFO] Building jar: <https://builds.apache.org/job/tobago-1.0.x-deploy/ws/tobago-1.0.x-deploy/tobago-tool/maven-theme-plugin/target/maven-theme-plugin-1.0.40-SNAPSHOT-sources.jar>
[INFO] [buildnumber:create {execution: default}]
[INFO] [plugin:descriptor {execution: default-descriptor}]
[INFO] Using 'UTF-8' encoding to read mojo metadata.
[INFO] Applying mojo extractor for language: java
[WARNING] org.apache.myfaces.tobago.maven.plugin.PackThemeMojo#archiver:
[WARNING]   The syntax
[WARNING]     @parameter expression="${component.<role>#<roleHint>}"
[WARNING]   is deprecated, please use
[WARNING]     @component role="<role>" roleHint="<roleHint>"
[WARNING]   instead.
[WARNING] org.apache.myfaces.tobago.maven.plugin.UnPackThemeMojo#archiverManager:
[WARNING]   The syntax
[WARNING]     @parameter expression="${component.<role>#<roleHint>}"
[WARNING]   is deprecated, please use
[WARNING]     @component role="<role>" roleHint="<roleHint>"
[WARNING]   instead.
[INFO] Mojo extractor for language: java found 2 mojo descriptors.
[INFO] Applying mojo extractor for language: bsh
[INFO] Mojo extractor for language: bsh found 0 mojo descriptors.
[INFO] [remote-resources:process {execution: default}]
[INFO] [resources:resources {execution: default-resources}]
[INFO] Using 'UTF-8' encoding to copy filtered resources.
[INFO] Copying 2 resources
[INFO] Copying 3 resources
[INFO] [compiler:compile {execution: default-compile}]
[INFO] Compiling 3 source files to <https://builds.apache.org/job/tobago-1.0.x-deploy/ws/tobago-1.0.x-deploy/tobago-tool/maven-theme-plugin/target/classes>
[INFO] [resources:testResources {execution: default-testResources}]
[INFO] Using 'UTF-8' encoding to copy filtered resources.
[INFO] skip non existing resourceDirectory <https://builds.apache.org/job/tobago-1.0.x-deploy/ws/tobago-1.0.x-deploy/tobago-tool/maven-theme-plugin/src/test/resources>
[INFO] Copying 3 resources
[INFO] [compiler:testCompile {execution: default-testCompile}]
[INFO] No sources to compile
[INFO] [surefire:test {execution: default-test}]
[INFO] Surefire report directory: <https://builds.apache.org/job/tobago-1.0.x-deploy/ws/tobago-1.0.x-deploy/tobago-tool/maven-theme-plugin/target/surefire-reports>

-------------------------------------------------------
 T E S T S
-------------------------------------------------------
There are no tests to run.

Results :

Tests run: 0, Failures: 0, Errors: 0, Skipped: 0

[JENKINS] Recording test results
[INFO] [jar:jar {execution: default-jar}]
[INFO] Building jar: <https://builds.apache.org/job/tobago-1.0.x-deploy/ws/tobago-1.0.x-deploy/tobago-tool/maven-theme-plugin/target/maven-theme-plugin-1.0.40-SNAPSHOT.jar>
[INFO] [plugin:addPluginArtifactMetadata {execution: default-addPluginArtifactMetadata}]
[INFO] [assembly:single {execution: source-release-assembly}]
[INFO] Skipping the assembly in this project because it's not the Execution Root
[INFO] [install:install {execution: default-install}]
[INFO] Installing <https://builds.apache.org/job/tobago-1.0.x-deploy/ws/tobago-1.0.x-deploy/tobago-tool/maven-theme-plugin/target/maven-theme-plugin-1.0.40-SNAPSHOT.jar>
to /home/jenkins/jenkins-slave/maven-repositories/1/org/apache/myfaces/tobago/maven-theme-plugin/1.0.40-SNAPSHOT/maven-theme-plugin-1.0.40-SNAPSHOT.jar
[INFO] Installing <https://builds.apache.org/job/tobago-1.0.x-deploy/ws/tobago-1.0.x-deploy/tobago-tool/maven-theme-plugin/target/maven-theme-plugin-1.0.40-SNAPSHOT-sources.jar>
to /home/jenkins/jenkins-slave/maven-repositories/1/org/apache/myfaces/tobago/maven-theme-plugin/1.0.40-SNAPSHOT/maven-theme-plugin-1.0.40-SNAPSHOT-sources.jar
[INFO] [deploy:deploy {execution: default-deploy}]
[INFO] Retrieving previous build number from apache.snapshots.https
[WARNING] *** CHECKSUM FAILED - Checksum failed on download: local = 'fc55cd7dace570e0085a26ec9290dfa0a2b04d64';
remote = 'e7375ee198cb170cffc70829262606dbee08ba66' - RETRYING
[WARNING] *** CHECKSUM FAILED - Checksum failed on download: local = 'fc55cd7dace570e0085a26ec9290dfa0a2b04d64';
remote = 'e7375ee198cb170cffc70829262606dbee08ba66' - IGNORING
Uploading: https://repository.apache.org/content/repositories/snapshots/org/apache/myfaces/tobago/maven-theme-plugin/1.0.40-SNAPSHOT/maven-theme-plugin-1.0.40-SNAPSHOT.jar
19K uploaded  (maven-theme-plugin-1.0.40-SNAPSHOT.jar)
[INFO] Retrieving previous metadata from apache.snapshots.https
[INFO] Uploading repository metadata for: 'artifact org.apache.myfaces.tobago:maven-theme-plugin'
[INFO] Retrieving previous metadata from apache.snapshots.https
[WARNING] *** CHECKSUM FAILED - Checksum failed on download: local = 'fc55cd7dace570e0085a26ec9290dfa0a2b04d64';
remote = 'e7375ee198cb170cffc70829262606dbee08ba66' - RETRYING
[WARNING] *** CHECKSUM FAILED - Checksum failed on download: local = 'fc55cd7dace570e0085a26ec9290dfa0a2b04d64';
remote = 'e7375ee198cb170cffc70829262606dbee08ba66' - IGNORING
[INFO] Uploading repository metadata for: 'snapshot org.apache.myfaces.tobago:maven-theme-plugin:1.0.40-SNAPSHOT'
[INFO] Uploading project information for maven-theme-plugin 1.0.40-SNAPSHOT
[INFO] Retrieving previous metadata from apache.snapshots.https
[INFO] Uploading repository metadata for: 'org.apache.myfaces.tobago'
[INFO] Retrieving previous build number from apache.snapshots.https
Uploading: https://repository.apache.org/content/repositories/snapshots/org/apache/myfaces/tobago/maven-theme-plugin/1.0.40-SNAPSHOT/maven-theme-plugin-1.0.40-SNAPSHOT-sources.jar
10K uploaded  (maven-theme-plugin-1.0.40-SNAPSHOT-sources.jar)
[JENKINS] Archiving <https://builds.apache.org/job/tobago-1.0.x-deploy/ws/tobago-1.0.x-deploy/tobago-tool/maven-theme-plugin/target/maven-theme-plugin-1.0.40-SNAPSHOT.jar>
to /home/hudson/hudson/jobs/tobago-1.0.x-deploy/modules/org.apache.myfaces.tobago$maven-theme-plugin/builds/2012-10-07_12-31-29/archive/org.apache.myfaces.tobago/maven-theme-plugin/1.0.40-SNAPSHOT/maven-theme-plugin-1.0.40-SNAPSHOT.jar
[JENKINS] Archiving <https://builds.apache.org/job/tobago-1.0.x-deploy/ws/tobago-1.0.x-deploy/tobago-tool/maven-theme-plugin/target/maven-theme-plugin-1.0.40-SNAPSHOT-sources.jar>
to /home/hudson/hudson/jobs/tobago-1.0.x-deploy/modules/org.apache.myfaces.tobago$maven-theme-plugin/builds/2012-10-07_12-31-29/archive/org.apache.myfaces.tobago/maven-theme-plugin/1.0.40-SNAPSHOT/maven-theme-plugin-1.0.40-SNAPSHOT-sources.jar
[INFO] ------------------------------------------------------------------------
[INFO] Building Tobago Annotation
[INFO]    task-segment: [clean, source:jar, deploy]
[INFO] ------------------------------------------------------------------------
[INFO] [clean:clean {execution: default-clean}]
[INFO] Preparing source:jar
[JENKINS] Archiving <https://builds.apache.org/job/tobago-1.0.x-deploy/ws/tobago-1.0.x-deploy/tobago-tool/tobago-tool-annotation/pom.xml>
to /home/hudson/hudson/jobs/tobago-1.0.x-deploy/modules/org.apache.myfaces.tobago$tobago-tool-annotation/builds/2012-10-07_12-31-29/archive/org.apache.myfaces.tobago/tobago-tool-annotation/1.0.40-SNAPSHOT/tobago-tool-annotation-1.0.40-SNAPSHOT.pom
[INFO] [buildnumber:create {execution: default}]
[INFO] [source:jar {execution: default-cli}]
[INFO] Building jar: <https://builds.apache.org/job/tobago-1.0.x-deploy/ws/tobago-1.0.x-deploy/tobago-tool/tobago-tool-annotation/target/tobago-tool-annotation-1.0.40-SNAPSHOT-sources.jar>
[INFO] [buildnumber:create {execution: default}]
[INFO] [remote-resources:process {execution: default}]
[INFO] [resources:resources {execution: default-resources}]
[INFO] Using 'UTF-8' encoding to copy filtered resources.
[INFO] Copying 2 resources
[INFO] Copying 3 resources
[INFO] [compiler:compile {execution: default-compile}]
[INFO] Compiling 14 source files to <https://builds.apache.org/job/tobago-1.0.x-deploy/ws/tobago-1.0.x-deploy/tobago-tool/tobago-tool-annotation/target/classes>
[INFO] [resources:testResources {execution: default-testResources}]
[INFO] Using 'UTF-8' encoding to copy filtered resources.
[INFO] skip non existing resourceDirectory <https://builds.apache.org/job/tobago-1.0.x-deploy/ws/tobago-1.0.x-deploy/tobago-tool/tobago-tool-annotation/src/test/resources>
[INFO] Copying 3 resources
[INFO] [compiler:testCompile {execution: default-testCompile}]
[INFO] No sources to compile
[INFO] [surefire:test {execution: default-test}]
[INFO] Surefire report directory: <https://builds.apache.org/job/tobago-1.0.x-deploy/ws/tobago-1.0.x-deploy/tobago-tool/tobago-tool-annotation/target/surefire-reports>

-------------------------------------------------------
 T E S T S
-------------------------------------------------------
There are no tests to run.

Results :

Tests run: 0, Failures: 0, Errors: 0, Skipped: 0

[JENKINS] Recording test results
[INFO] [jar:jar {execution: default-jar}]
[INFO] Building jar: <https://builds.apache.org/job/tobago-1.0.x-deploy/ws/tobago-1.0.x-deploy/tobago-tool/tobago-tool-annotation/target/tobago-tool-annotation-1.0.40-SNAPSHOT.jar>
[INFO] [assembly:single {execution: source-release-assembly}]
[INFO] Skipping the assembly in this project because it's not the Execution Root
[INFO] [install:install {execution: default-install}]
[INFO] Installing <https://builds.apache.org/job/tobago-1.0.x-deploy/ws/tobago-1.0.x-deploy/tobago-tool/tobago-tool-annotation/target/tobago-tool-annotation-1.0.40-SNAPSHOT.jar>
to /home/jenkins/jenkins-slave/maven-repositories/1/org/apache/myfaces/tobago/tobago-tool-annotation/1.0.40-SNAPSHOT/tobago-tool-annotation-1.0.40-SNAPSHOT.jar
[INFO] Installing <https://builds.apache.org/job/tobago-1.0.x-deploy/ws/tobago-1.0.x-deploy/tobago-tool/tobago-tool-annotation/target/tobago-tool-annotation-1.0.40-SNAPSHOT-sources.jar>
to /home/jenkins/jenkins-slave/maven-repositories/1/org/apache/myfaces/tobago/tobago-tool-annotation/1.0.40-SNAPSHOT/tobago-tool-annotation-1.0.40-SNAPSHOT-sources.jar
[INFO] [deploy:deploy {execution: default-deploy}]
[INFO] Retrieving previous build number from apache.snapshots.https
[WARNING] *** CHECKSUM FAILED - Checksum failed on download: local = '5ac77fdf6b9dd2ba679015b1c8044d27b3d4b581';
remote = '19708d1689b6edbd8852372b7280740dc4f0718c' - RETRYING
[WARNING] *** CHECKSUM FAILED - Checksum failed on download: local = '5ac77fdf6b9dd2ba679015b1c8044d27b3d4b581';
remote = '19708d1689b6edbd8852372b7280740dc4f0718c' - IGNORING
Uploading: https://repository.apache.org/content/repositories/snapshots/org/apache/myfaces/tobago/tobago-tool-annotation/1.0.40-SNAPSHOT/tobago-tool-annotation-1.0.40-SNAPSHOT.jar
22K uploaded  (tobago-tool-annotation-1.0.40-SNAPSHOT.jar)
[INFO] Retrieving previous metadata from apache.snapshots.https
[INFO] Uploading repository metadata for: 'artifact org.apache.myfaces.tobago:tobago-tool-annotation'
[INFO] Uploading project information for tobago-tool-annotation 1.0.40-SNAPSHOT
[INFO] Retrieving previous metadata from apache.snapshots.https
[WARNING] *** CHECKSUM FAILED - Checksum failed on download: local = '5ac77fdf6b9dd2ba679015b1c8044d27b3d4b581';
remote = '19708d1689b6edbd8852372b7280740dc4f0718c' - RETRYING
[WARNING] *** CHECKSUM FAILED - Checksum failed on download: local = '5ac77fdf6b9dd2ba679015b1c8044d27b3d4b581';
remote = '19708d1689b6edbd8852372b7280740dc4f0718c' - IGNORING
[INFO] Uploading repository metadata for: 'snapshot org.apache.myfaces.tobago:tobago-tool-annotation:1.0.40-SNAPSHOT'
[INFO] Retrieving previous build number from apache.snapshots.https
Uploading: https://repository.apache.org/content/repositories/snapshots/org/apache/myfaces/tobago/tobago-tool-annotation/1.0.40-SNAPSHOT/tobago-tool-annotation-1.0.40-SNAPSHOT-sources.jar
18K uploaded  (tobago-tool-annotation-1.0.40-SNAPSHOT-sources.jar)
[JENKINS] Archiving <https://builds.apache.org/job/tobago-1.0.x-deploy/ws/tobago-1.0.x-deploy/tobago-tool/tobago-tool-annotation/target/tobago-tool-annotation-1.0.40-SNAPSHOT.jar>
to /home/hudson/hudson/jobs/tobago-1.0.x-deploy/modules/org.apache.myfaces.tobago$tobago-tool-annotation/builds/2012-10-07_12-31-29/archive/org.apache.myfaces.tobago/tobago-tool-annotation/1.0.40-SNAPSHOT/tobago-tool-annotation-1.0.40-SNAPSHOT.jar
[JENKINS] Archiving <https://builds.apache.org/job/tobago-1.0.x-deploy/ws/tobago-1.0.x-deploy/tobago-tool/tobago-tool-annotation/target/tobago-tool-annotation-1.0.40-SNAPSHOT-sources.jar>
to /home/hudson/hudson/jobs/tobago-1.0.x-deploy/modules/org.apache.myfaces.tobago$tobago-tool-annotation/builds/2012-10-07_12-31-29/archive/org.apache.myfaces.tobago/tobago-tool-annotation/1.0.40-SNAPSHOT/tobago-tool-annotation-1.0.40-SNAPSHOT-sources.jar
[INFO] ------------------------------------------------------------------------
[INFO] Building Tobago Apt
[INFO]    task-segment: [clean, source:jar, deploy]
[INFO] ------------------------------------------------------------------------
[INFO] [clean:clean {execution: default-clean}]
[INFO] Preparing source:jar
[JENKINS] Archiving <https://builds.apache.org/job/tobago-1.0.x-deploy/ws/tobago-1.0.x-deploy/tobago-tool/tobago-tool-apt/pom.xml>
to /home/hudson/hudson/jobs/tobago-1.0.x-deploy/modules/org.apache.myfaces.tobago$tobago-tool-apt/builds/2012-10-07_12-31-29/archive/org.apache.myfaces.tobago/tobago-tool-apt/1.0.40-SNAPSHOT/tobago-tool-apt-1.0.40-SNAPSHOT.pom
[INFO] [buildnumber:create {execution: default}]
[INFO] [source:jar {execution: default-cli}]
[INFO] org already added, skipping
[INFO] org/apache already added, skipping
[INFO] org/apache/myfaces already added, skipping
[INFO] org/apache/myfaces/tobago already added, skipping
[INFO] Building jar: <https://builds.apache.org/job/tobago-1.0.x-deploy/ws/tobago-1.0.x-deploy/tobago-tool/tobago-tool-apt/target/tobago-tool-apt-1.0.40-SNAPSHOT-sources.jar>
[INFO] org already added, skipping
[INFO] org/apache already added, skipping
[INFO] org/apache/myfaces already added, skipping
[INFO] org/apache/myfaces/tobago already added, skipping
[INFO] [buildnumber:create {execution: default}]
[INFO] [remote-resources:process {execution: default}]
[INFO] [resources:resources {execution: default-resources}]
[INFO] Using 'UTF-8' encoding to copy filtered resources.
[INFO] Copying 3 resources
[INFO] Copying 3 resources
[INFO] [compiler:compile {execution: default-compile}]
[INFO] Compiling 17 source files to <https://builds.apache.org/job/tobago-1.0.x-deploy/ws/tobago-1.0.x-deploy/tobago-tool/tobago-tool-apt/target/classes>
[INFO] [resources:testResources {execution: default-testResources}]
[INFO] Using 'UTF-8' encoding to copy filtered resources.
[INFO] skip non existing resourceDirectory <https://builds.apache.org/job/tobago-1.0.x-deploy/ws/tobago-1.0.x-deploy/tobago-tool/tobago-tool-apt/src/test/resources>
[INFO] Copying 3 resources
[INFO] [compiler:testCompile {execution: default-testCompile}]
[INFO] No sources to compile
[INFO] [surefire:test {execution: default-test}]
[INFO] Surefire report directory: <https://builds.apache.org/job/tobago-1.0.x-deploy/ws/tobago-1.0.x-deploy/tobago-tool/tobago-tool-apt/target/surefire-reports>

-------------------------------------------------------
 T E S T S
-------------------------------------------------------
There are no tests to run.

Results :

Tests run: 0, Failures: 0, Errors: 0, Skipped: 0

[JENKINS] Recording test resultsOct 7, 2012 12:33:47 PM hudson.remoting.SynchronousCommandTransport$ReaderThread
run

SEVERE: I/O error in channel channel
java.io.StreamCorruptedException
	at java.io.ObjectInputStream.readObject0(ObjectInputStream.java:1332)
	at java.io.ObjectInputStream.readObject(ObjectInputStream.java:348)
	at hudson.remoting.Command.readFrom(Command.java:90)
	at hudson.remoting.ClassicCommandTransport.read(ClassicCommandTransport.java:59)
	at hudson.remoting.SynchronousCommandTransport$ReaderThread.run(SynchronousCommandTransport.java:48)
channel stopped
[INFO] ------------------------------------------------------------------------
[ERROR] FATAL ERROR
[INFO] ------------------------------------------------------------------------
ERROR: Maven JVM terminated unexpectedly with exit code 0


Mime
View raw message