myfaces-commits mailing list archives

Site index · List index
Message view « Date » · « Thread »
Top « Date » · « Thread »
From Apache Jenkins Server <jenk...@builds.apache.org>
Subject Build failed in Jenkins: myfaces-current12 #675
Date Thu, 08 Nov 2012 22:06:00 GMT
See <https://builds.apache.org/job/myfaces-current12/675/>

------------------------------------------
[...truncated 936 lines...]
Nov 8, 2012 10:05:14 PM javax.faces.component.UIComponentBase getRenderer
WARNING: No Renderer found for component {Component-Path : [Class: javax.faces.component.UIInput,Id:
j_id0]} (component-family=javax.faces.Input, renderer-type=javax.faces.Text)
Nov 8, 2012 10:05:14 PM javax.faces.component.UIComponentBase getClientId
WARNING: WARNING: Component j_id0 just got an automatic id, because there was no id assigned
yet. If this component was created dynamically (i.e. not by a JSP tag) you should assign it
an explicit static id or assign it the id you get from the createUniqueId from the current
UIViewRoot component right after creation! Path to Component: {Component-Path : [Class: javax.faces.component.UIInput,Id:
j_id0]}
No Renderer found for component {Component-Path : [Class: javax.faces.component.html.HtmlInputText,Id:
testId]} (component-family=javax.faces.Input, renderer-type=javax.faces.Text)
Nov 8, 2012 10:05:14 PM javax.faces.component.UIComponentBase getRenderer
WARNING: No Renderer found for component {Component-Path : [Class: javax.faces.component.html.HtmlInputText,Id:
testId]} (component-family=javax.faces.Input, renderer-type=javax.faces.Text)
Tests run: 238, Failures: 0, Errors: 0, Skipped: 0, Time elapsed: 1.724 sec

Results :

Tests run: 238, Failures: 0, Errors: 0, Skipped: 0

mojoSucceeded org.apache.maven.plugins:maven-surefire-plugin:2.5(default-test)
[JENKINS] Recording test results
mojoStarted org.apache.maven.plugins:maven-jar-plugin:2.2(default-jar)
[INFO] 
[INFO] --- maven-jar-plugin:2.2:jar (default-jar) @ myfaces-api ---
[INFO] Building jar: <https://builds.apache.org/job/myfaces-current12/ws/current12/core/api/target/myfaces-api-1.2.13-SNAPSHOT.jar>
mojoSucceeded org.apache.maven.plugins:maven-jar-plugin:2.2(default-jar)
mojoStarted org.apache.maven.plugins:maven-site-plugin:3.0(attach-descriptor)
[INFO] 
[INFO] --- maven-site-plugin:3.0:attach-descriptor (attach-descriptor) @ myfaces-api ---
mojoSucceeded org.apache.maven.plugins:maven-site-plugin:3.0(attach-descriptor)
forkedProjectStarted org.apache.myfaces.core:myfaces-api:1.2.13-SNAPSHOT
mojoStarted org.apache.myfaces.buildtools:myfaces-builder-plugin:1.0.8(default)
[INFO] 
[INFO] --- myfaces-builder-plugin:1.0.8:build-metadata (default) @ myfaces-api ---
mojoSucceeded org.apache.myfaces.buildtools:myfaces-builder-plugin:1.0.8(default)
mojoStarted org.apache.myfaces.buildtools:myfaces-builder-plugin:1.0.8(makecomp)
[INFO] 
[INFO] --- myfaces-builder-plugin:1.0.8:make-components (makecomp) @ myfaces-api ---
[INFO] Using template from file loader: <https://builds.apache.org/job/myfaces-current12/ws/current12/core/api/src/main/resources/META-INF/componentClass12.vm>
[WARNING] *******************************************************************
[WARNING] RuntimeInstance initializing.
[WARNING] Default ResourceManager initializing. (class org.apache.velocity.runtime.resource.ResourceManagerImpl)
[WARNING] FileResourceLoader : initialization starting.
[WARNING] FileResourceLoader : initialization complete.
[WARNING] RelativeClasspathResourceLoader : initialization complete.
[INFO] RelativeClasspathResourceLoader : adding path 'META-INF'
[WARNING] RelativeClasspathResourceLoader : initialization complete.
[WARNING] Default ResourceManager initialization complete.
[WARNING] Velocimacro : initialization starting.
[WARNING] Velocimacro : VM library registration complete.
[WARNING] Velocimacro : Velocimacro : initialization complete.
[WARNING] RuntimeInstance successfully initialized.
[INFO] Generating component class:javax.faces.component.UIMessage
[INFO] Generating component class:javax.faces.component.UIMessages
[INFO] Generating component class:javax.faces.component.UIParameter
[INFO] Generating component class:javax.faces.component.UISelectItem
[INFO] Generating component class:javax.faces.component.UISelectItems
[INFO] Generating component class:javax.faces.component.html.HtmlColumn
[INFO] Generating component class:javax.faces.component.html.HtmlCommandButton
[INFO] Generating component class:javax.faces.component.html.HtmlCommandLink
[INFO] Generating component class:javax.faces.component.html.HtmlDataTable
[INFO] Generating component class:javax.faces.component.html.HtmlForm
[INFO] Generating component class:javax.faces.component.html.HtmlGraphicImage
[INFO] Generating component class:javax.faces.component.html.HtmlInputSecret
[INFO] Generating component class:javax.faces.component.html.HtmlInputText
[INFO] Generating component class:javax.faces.component.html.HtmlInputTextarea
[INFO] Generating component class:javax.faces.component.html.HtmlMessage
[INFO] Generating component class:javax.faces.component.html.HtmlMessages
[INFO] Generating component class:javax.faces.component.html.HtmlOutputFormat
[INFO] Generating component class:javax.faces.component.html.HtmlOutputLabel
[INFO] Generating component class:javax.faces.component.html.HtmlOutputLink
[INFO] Generating component class:javax.faces.component.html.HtmlOutputText
[INFO] Generating component class:javax.faces.component.html.HtmlPanelGrid
[INFO] Generating component class:javax.faces.component.html.HtmlPanelGroup
[INFO] Generating component class:javax.faces.component.html.HtmlSelectBooleanCheckbox
[INFO] Generating component class:javax.faces.component.html.HtmlSelectManyCheckbox
[INFO] Generating component class:javax.faces.component.html.HtmlSelectManyListbox
[INFO] Generating component class:javax.faces.component.html.HtmlSelectManyMenu
[INFO] Generating component class:javax.faces.component.html.HtmlSelectOneListbox
[INFO] Generating component class:javax.faces.component.html.HtmlSelectOneMenu
[INFO] Generating component class:javax.faces.component.html.HtmlSelectOneRadio
mojoSucceeded org.apache.myfaces.buildtools:myfaces-builder-plugin:1.0.8(makecomp)
forkedProjectSucceeded org.apache.myfaces.core:myfaces-api:1.2.13-SNAPSHOTNov 8, 2012 10:05:19
PM hudson.maven.ExecutedMojo <init>
WARNING: Failed to getClass for org.apache.maven.plugin.source.SourceJarMojo

mojoStarted org.apache.maven.plugins:maven-source-plugin:2.0.4(attach-source)
[INFO] 
[INFO] --- maven-source-plugin:2.0.4:jar (attach-source) @ myfaces-api ---
[INFO] Building jar: <https://builds.apache.org/job/myfaces-current12/ws/current12/core/api/target/myfaces-api-1.2.13-SNAPSHOT-sources.jar>
mojoSucceeded org.apache.maven.plugins:maven-source-plugin:2.0.4(attach-source)
mojoStarted org.apache.maven.plugins:maven-jar-plugin:2.2(default)
[INFO] [INFO] Building jar: <https://builds.apache.org/job/myfaces-current12/ws/current12/core/api/target/myfaces-api-1.2.13-SNAPSHOT-tests.jar>

[INFO] --- maven-jar-plugin:2.2:test-jar (default) @ myfaces-api ---
mojoSucceeded org.apache.maven.plugins:maven-jar-plugin:2.2(default)
mojoStarted org.apache.maven.plugins:maven-checkstyle-plugin:2.6(verify-style)
[INFO] 
[INFO] --- maven-checkstyle-plugin:2.6:check (verify-style) @ myfaces-api ---
[INFO] 
mojoSucceeded org.apache.maven.plugins:maven-checkstyle-plugin:2.6(verify-style)
mojoStarted org.apache.maven.plugins:maven-install-plugin:2.3.1(default-install)[INFO] Installing
<https://builds.apache.org/job/myfaces-current12/ws/current12/core/api/target/myfaces-api-1.2.13-SNAPSHOT.jar>
to /home/jenkins/jenkins-slave/maven-repositories/0/org/apache/myfaces/core/myfaces-api/1.2.13-SNAPSHOT/myfaces-api-1.2.13-SNAPSHOT.jar

[INFO] 
[INFO] --- maven-install-plugin:2.3.1:install (default-install) @ myfaces-api ---
[INFO] Installing <https://builds.apache.org/job/myfaces-current12/ws/current12/core/api/pom.xml>
to /home/jenkins/jenkins-slave/maven-repositories/0/org/apache/myfaces/core/myfaces-api/1.2.13-SNAPSHOT/myfaces-api-1.2.13-SNAPSHOT.pom
[INFO] Installing <https://builds.apache.org/job/myfaces-current12/ws/current12/core/api/target/myfaces-api-1.2.13-SNAPSHOT-sources.jar>
to /home/jenkins/jenkins-slave/maven-repositories/0/org/apache/myfaces/core/myfaces-api/1.2.13-SNAPSHOT/myfaces-api-1.2.13-SNAPSHOT-sources.jar
[INFO] Installing <https://builds.apache.org/job/myfaces-current12/ws/current12/core/api/target/myfaces-api-1.2.13-SNAPSHOT-tests.jar>
to /home/jenkins/jenkins-slave/maven-repositories/0/org/apache/myfaces/core/myfaces-api/1.2.13-SNAPSHOT/myfaces-api-1.2.13-SNAPSHOT-tests.jar
mojoSucceeded org.apache.maven.plugins:maven-install-plugin:2.3.1(default-install)
projectSucceeded org.apache.myfaces.core:myfaces-api:1.2.13-SNAPSHOT
projectStarted org.apache.myfaces.core:myfaces-impl:1.2.13-SNAPSHOT
[INFO]                                                                         
[INFO] ------------------------------------------------------------------------
[INFO] Building Apache MyFaces JSF-1.2 Core Impl 1.2.13-SNAPSHOT
[INFO] ------------------------------------------------------------------------
Downloading: http://tomcat.apache.org/dev/dist/m2-repository/org/apache/myfaces/shared/myfaces-shared-impl/3.0.12-SNAPSHOT/maven-metadata.xml
Downloading: http://download.java.net/maven/2/org/apache/myfaces/shared/myfaces-shared-impl/3.0.12-SNAPSHOT/maven-metadata.xml
Downloading: http://repository.apache.org/snapshots/org/apache/myfaces/shared/myfaces-shared-impl/3.0.12-SNAPSHOT/maven-metadata.xml
[WARNING] Could not transfer metadata org.apache.myfaces.shared:myfaces-shared-impl:3.0.12-SNAPSHOT/maven-metadata.xml
from/to tomcat (http://tomcat.apache.org/dev/dist/m2-repository): Error transferring file:
Connection reset
Downloading: http://tomcat.apache.org/dev/dist/m2-repository/org/apache/myfaces/shared/myfaces-shared-impl/3.0.12-SNAPSHOT/maven-metadata.xml
[WARNING] Could not transfer metadata org.apache.myfaces.shared:myfaces-shared-impl:3.0.12-SNAPSHOT/maven-metadata.xml
from/to tomcat (http://tomcat.apache.org/dev/dist/m2-repository): Error transferring file:
Connection reset
Downloading: http://download.java.net/maven/2/org/apache/myfaces/shared/myfaces-shared-project/3.0.12-SNAPSHOT/maven-metadata.xml
Downloading: http://tomcat.apache.org/dev/dist/m2-repository/org/apache/myfaces/shared/myfaces-shared-project/3.0.12-SNAPSHOT/maven-metadata.xml
Downloading: http://repository.apache.org/snapshots/org/apache/myfaces/shared/myfaces-shared-project/3.0.12-SNAPSHOT/maven-metadata.xml
[WARNING] Could not transfer metadata org.apache.myfaces.shared:myfaces-shared-project:3.0.12-SNAPSHOT/maven-metadata.xml
from/to tomcat (http://tomcat.apache.org/dev/dist/m2-repository): Error transferring file:
Connection reset
Downloading: http://download.java.net/maven/2/cactus/cactus/13-1.7.2/cactus-13-1.7.2.pom
Downloading: http://tomcat.apache.org/dev/dist/m2-repository/cactus/cactus/13-1.7.2/cactus-13-1.7.2.pom
Downloading: http://repo1.maven.org/maven2/cactus/cactus/13-1.7.2/cactus-13-1.7.2.pom
projectFailed org.apache.myfaces.core:myfaces-impl:1.2.13-SNAPSHOT
sessionEnded
[INFO] ------------------------------------------------------------------------
[INFO] Reactor Summary:
[INFO] 
[INFO] Apache MyFaces Shared For JSF 1.2 - Project ....... SUCCESS [28.574s]
[INFO] Apache MyFaces Shared For JSF 1.2 - Core .......... SUCCESS [24.329s]
[INFO] MyFaces Shared Impl ............................... SUCCESS [8.834s]
[INFO] MyFaces Shared Tomahawk ........................... SUCCESS [7.301s]
[INFO] Apache MyFaces JSF-1.2 Core Project ............... SUCCESS [2.215s]
[INFO] Apache Myfaces JSF Core-1.2 API ................... SUCCESS [18.098s]
[INFO] Apache MyFaces JSF-1.2 Core Impl .................. FAILURE [3.832s]
[INFO] Build Project ..................................... SKIPPED
[INFO] ------------------------------------------------------------------------
[INFO] BUILD FAILURE
[INFO] ------------------------------------------------------------------------
[INFO] Total time: 1:37.354s
[INFO] Finished at: Thu Nov 08 22:05:25 UTC 2012
[INFO] Final Memory: 40M/194M
[INFO] ------------------------------------------------------------------------
Projects to build: [MavenProject: org.apache.myfaces.shared:myfaces-shared-project:3.0.13-SNAPSHOT
@ <https://builds.apache.org/job/myfaces-current12/ws/current12/shared/pom.xml,> MavenProject:
org.apache.myfaces.shared:myfaces-shared-core:3.0.13-SNAPSHOT @ <https://builds.apache.org/job/myfaces-current12/ws/current12/shared/core/pom.xml,>
MavenProject: org.apache.myfaces.shared:myfaces-shared-impl:3.0.13-SNAPSHOT @ <https://builds.apache.org/job/myfaces-current12/ws/current12/shared/shared-impl/pom.xml,>
MavenProject: org.apache.myfaces.shared:myfaces-shared-tomahawk:3.0.13-SNAPSHOT @ <https://builds.apache.org/job/myfaces-current12/ws/current12/shared/shared-tomahawk/pom.xml,>
MavenProject: org.apache.myfaces.core:myfaces-core-project:1.2.13-SNAPSHOT @ <https://builds.apache.org/job/myfaces-current12/ws/current12/core/pom.xml,>
MavenProject: org.apache.myfaces.core:myfaces-api:1.2.13-SNAPSHOT @ <https://builds.apache.org/job/myfaces-current12/ws/current12/core/api/pom.xml,>
MavenProject: org.apache.myfaces.core:myfaces-impl:1.2.13-SNAPSHOT @ <https://builds.apache.org/job/myfaces-current12/ws/current12/core/impl/pom.xml,>
MavenProject: org.apache.myfaces:myfaces-base:1.2.10-SNAPSHOT @ <https://builds.apache.org/job/myfaces-current12/ws/current12/pom.xml]>
[JENKINS] Archiving <https://builds.apache.org/job/myfaces-current12/ws/current12/shared/shared-impl/pom.xml>
to /home/hudson/hudson/jobs/myfaces-current12/modules/org.apache.myfaces.shared$myfaces-shared-impl/builds/2012-11-08_22-03-27/archive/org.apache.myfaces.shared/myfaces-shared-impl/3.0.13-SNAPSHOT/myfaces-shared-impl-3.0.13-SNAPSHOT.pom
[JENKINS] Archiving <https://builds.apache.org/job/myfaces-current12/ws/current12/shared/shared-impl/target/myfaces-shared-impl-3.0.13-SNAPSHOT.jar>
to /home/hudson/hudson/jobs/myfaces-current12/modules/org.apache.myfaces.shared$myfaces-shared-impl/builds/2012-11-08_22-03-27/archive/org.apache.myfaces.shared/myfaces-shared-impl/3.0.13-SNAPSHOT/myfaces-shared-impl-3.0.13-SNAPSHOT.jar
[JENKINS] Archiving <https://builds.apache.org/job/myfaces-current12/ws/current12/shared/shared-impl/target/myfaces-shared-impl-3.0.13-SNAPSHOT-sources.jar>
to /home/hudson/hudson/jobs/myfaces-current12/modules/org.apache.myfaces.shared$myfaces-shared-impl/builds/2012-11-08_22-03-27/archive/org.apache.myfaces.shared/myfaces-shared-impl/3.0.13-SNAPSHOT/myfaces-shared-impl-3.0.13-SNAPSHOT-sources.jar
[JENKINS] Archiving <https://builds.apache.org/job/myfaces-current12/ws/current12/shared/core/pom.xml>
to /home/hudson/hudson/jobs/myfaces-current12/modules/org.apache.myfaces.shared$myfaces-shared-core/builds/2012-11-08_22-03-27/archive/org.apache.myfaces.shared/myfaces-shared-core/3.0.13-SNAPSHOT/myfaces-shared-core-3.0.13-SNAPSHOT.pom
[JENKINS] Archiving <https://builds.apache.org/job/myfaces-current12/ws/current12/shared/core/target/myfaces-shared-core-3.0.13-SNAPSHOT.jar>
to /home/hudson/hudson/jobs/myfaces-current12/modules/org.apache.myfaces.shared$myfaces-shared-core/builds/2012-11-08_22-03-27/archive/org.apache.myfaces.shared/myfaces-shared-core/3.0.13-SNAPSHOT/myfaces-shared-core-3.0.13-SNAPSHOT.jar
[JENKINS] Archiving <https://builds.apache.org/job/myfaces-current12/ws/current12/shared/core/target/myfaces-shared-core-3.0.13-SNAPSHOT-sources.jar>
to /home/hudson/hudson/jobs/myfaces-current12/modules/org.apache.myfaces.shared$myfaces-shared-core/builds/2012-11-08_22-03-27/archive/org.apache.myfaces.shared/myfaces-shared-core/3.0.13-SNAPSHOT/myfaces-shared-core-3.0.13-SNAPSHOT-sources.jar
[JENKINS] Archiving <https://builds.apache.org/job/myfaces-current12/ws/current12/shared/pom.xml>
to /home/hudson/hudson/jobs/myfaces-current12/modules/org.apache.myfaces.shared$myfaces-shared-project/builds/2012-11-08_22-03-27/archive/org.apache.myfaces.shared/myfaces-shared-project/3.0.13-SNAPSHOT/myfaces-shared-project-3.0.13-SNAPSHOT.pom
[JENKINS] Archiving <https://builds.apache.org/job/myfaces-current12/ws/current12/shared/target/myfaces-shared-project-3.0.13-SNAPSHOT-site.xml>
to /home/hudson/hudson/jobs/myfaces-current12/modules/org.apache.myfaces.shared$myfaces-shared-project/builds/2012-11-08_22-03-27/archive/org.apache.myfaces.shared/myfaces-shared-project/3.0.13-SNAPSHOT/myfaces-shared-project-3.0.13-SNAPSHOT-site.xml
[JENKINS] Archiving <https://builds.apache.org/job/myfaces-current12/ws/current12/pom.xml>
to /home/hudson/hudson/jobs/myfaces-current12/modules/org.apache.myfaces$myfaces-base/builds/2012-11-08_22-03-27/archive/org.apache.myfaces/myfaces-base/1.2.10-SNAPSHOT/myfaces-base-1.2.10-SNAPSHOT.pom
[JENKINS] Archiving <https://builds.apache.org/job/myfaces-current12/ws/current12/core/api/pom.xml>
to /home/hudson/hudson/jobs/myfaces-current12/modules/org.apache.myfaces.core$myfaces-api/builds/2012-11-08_22-03-27/archive/org.apache.myfaces.core/myfaces-api/1.2.13-SNAPSHOT/myfaces-api-1.2.13-SNAPSHOT.pom
[JENKINS] Archiving <https://builds.apache.org/job/myfaces-current12/ws/current12/core/api/target/myfaces-api-1.2.13-SNAPSHOT.jar>
to /home/hudson/hudson/jobs/myfaces-current12/modules/org.apache.myfaces.core$myfaces-api/builds/2012-11-08_22-03-27/archive/org.apache.myfaces.core/myfaces-api/1.2.13-SNAPSHOT/myfaces-api-1.2.13-SNAPSHOT.jar
[JENKINS] Archiving <https://builds.apache.org/job/myfaces-current12/ws/current12/core/api/target/myfaces-api-1.2.13-SNAPSHOT-sources.jar>
to /home/hudson/hudson/jobs/myfaces-current12/modules/org.apache.myfaces.core$myfaces-api/builds/2012-11-08_22-03-27/archive/org.apache.myfaces.core/myfaces-api/1.2.13-SNAPSHOT/myfaces-api-1.2.13-SNAPSHOT-sources.jar
[JENKINS] Archiving <https://builds.apache.org/job/myfaces-current12/ws/current12/core/api/target/myfaces-api-1.2.13-SNAPSHOT-tests.jar>
to /home/hudson/hudson/jobs/myfaces-current12/modules/org.apache.myfaces.core$myfaces-api/builds/2012-11-08_22-03-27/archive/org.apache.myfaces.core/myfaces-api/1.2.13-SNAPSHOT/myfaces-api-1.2.13-SNAPSHOT-tests.jar
[JENKINS] Archiving <https://builds.apache.org/job/myfaces-current12/ws/current12/core/impl/pom.xml>
to /home/hudson/hudson/jobs/myfaces-current12/modules/org.apache.myfaces.core$myfaces-impl/builds/2012-11-08_22-03-27/archive/org.apache.myfaces.core/myfaces-impl/1.2.13-SNAPSHOT/myfaces-impl-1.2.13-SNAPSHOT.pom
[JENKINS] Archiving <https://builds.apache.org/job/myfaces-current12/ws/current12/shared/shared-tomahawk/pom.xml>
to /home/hudson/hudson/jobs/myfaces-current12/modules/org.apache.myfaces.shared$myfaces-shared-tomahawk/builds/2012-11-08_22-03-27/archive/org.apache.myfaces.shared/myfaces-shared-tomahawk/3.0.13-SNAPSHOT/myfaces-shared-tomahawk-3.0.13-SNAPSHOT.pom
[JENKINS] Archiving <https://builds.apache.org/job/myfaces-current12/ws/current12/shared/shared-tomahawk/target/myfaces-shared-tomahawk-3.0.13-SNAPSHOT.jar>
to /home/hudson/hudson/jobs/myfaces-current12/modules/org.apache.myfaces.shared$myfaces-shared-tomahawk/builds/2012-11-08_22-03-27/archive/org.apache.myfaces.shared/myfaces-shared-tomahawk/3.0.13-SNAPSHOT/myfaces-shared-tomahawk-3.0.13-SNAPSHOT.jar
[JENKINS] Archiving <https://builds.apache.org/job/myfaces-current12/ws/current12/shared/shared-tomahawk/target/myfaces-shared-tomahawk-3.0.13-SNAPSHOT-sources.jar>
to /home/hudson/hudson/jobs/myfaces-current12/modules/org.apache.myfaces.shared$myfaces-shared-tomahawk/builds/2012-11-08_22-03-27/archive/org.apache.myfaces.shared/myfaces-shared-tomahawk/3.0.13-SNAPSHOT/myfaces-shared-tomahawk-3.0.13-SNAPSHOT-sources.jar
[JENKINS] Archiving <https://builds.apache.org/job/myfaces-current12/ws/current12/core/pom.xml>
to /home/hudson/hudson/jobs/myfaces-current12/modules/org.apache.myfaces.core$myfaces-core-project/builds/2012-11-08_22-03-27/archive/org.apache.myfaces.core/myfaces-core-project/1.2.13-SNAPSHOT/myfaces-core-project-1.2.13-SNAPSHOT.pom
[JENKINS] Archiving <https://builds.apache.org/job/myfaces-current12/ws/current12/core/target/myfaces-core-project-1.2.13-SNAPSHOT-site.xml>
to /home/hudson/hudson/jobs/myfaces-current12/modules/org.apache.myfaces.core$myfaces-core-project/builds/2012-11-08_22-03-27/archive/org.apache.myfaces.core/myfaces-core-project/1.2.13-SNAPSHOT/myfaces-core-project-1.2.13-SNAPSHOT-site.xml
Waiting for Jenkins to finish collecting data
mavenExecutionResult exceptions not empty
message : Failed to execute goal on project myfaces-impl: Could not resolve dependencies for
project org.apache.myfaces.core:myfaces-impl:jar:1.2.13-SNAPSHOT: Failed to collect dependencies
for [org.apache.myfaces.core:myfaces-api:jar:1.2.13-SNAPSHOT (compile), org.apache.myfaces.shared:myfaces-shared-impl:jar:3.0.12-SNAPSHOT
(provided), javax.servlet:servlet-api:jar:2.5 (provided), javax.servlet.jsp:jsp-api:jar:2.1
(provided), javax.servlet:jstl:jar:1.2 (provided), portlet-api:portlet-api:jar:1.0 (provided),
org.apache.geronimo.specs:geronimo-annotation_1.0_spec:jar:1.0 (provided), org.apache.geronimo.specs:geronimo-jpa_3.0_spec:jar:1.0
(compile?), org.apache.geronimo.specs:geronimo-ejb_3.0_spec:jar:1.0 (compile?), org.apache.myfaces.buildtools:myfaces-builder-annotations:jar:1.0.7
(provided), commons-collections:commons-collections:jar:3.2 (compile), commons-logging:commons-logging:jar:1.1.1
(compile), commons-discovery:commons-discovery:jar:0.4 (compile), commons-codec:commons-codec:jar:1.3
(compile), commons-beanutils:commons-beanutils:jar:1.8.3 (compile), commons-digester:commons-digester:jar:1.8
(compile), org.apache.tomcat:catalina:jar:6.0.29 (compile?), com.google.code.guice:guice:jar:1.0
(compile?), org.testng:testng:jar:jdk15:5.1 (test), org.apache.myfaces.core:myfaces-api:jar:tests:1.2.13-SNAPSHOT
(test), org.apache.shale:shale-test:jar:1.0.4 (test), cactus:cactus:jar:13-1.7.2 (test), org.easymock:easymock:jar:2.3
(test), org.easymock:easymockclassextension:jar:2.3 (test)]
cause : Could not resolve dependencies for project org.apache.myfaces.core:myfaces-impl:jar:1.2.13-SNAPSHOT:
Failed to collect dependencies for [org.apache.myfaces.core:myfaces-api:jar:1.2.13-SNAPSHOT
(compile), org.apache.myfaces.shared:myfaces-shared-impl:jar:3.0.12-SNAPSHOT (provided), javax.servlet:servlet-api:jar:2.5
(provided), javax.servlet.jsp:jsp-api:jar:2.1 (provided), javax.servlet:jstl:jar:1.2 (provided),
portlet-api:portlet-api:jar:1.0 (provided), org.apache.geronimo.specs:geronimo-annotation_1.0_spec:jar:1.0
(provided), org.apache.geronimo.specs:geronimo-jpa_3.0_spec:jar:1.0 (compile?), org.apache.geronimo.specs:geronimo-ejb_3.0_spec:jar:1.0
(compile?), org.apache.myfaces.buildtools:myfaces-builder-annotations:jar:1.0.7 (provided),
commons-collections:commons-collections:jar:3.2 (compile), commons-logging:commons-logging:jar:1.1.1
(compile), commons-discovery:commons-discovery:jar:0.4 (compile), commons-codec:commons-codec:jar:1.3
(compile), commons-beanutils:commons-beanutils:jar:1.8.3 (compile), commons-digester:commons-digester:jar:1.8
(compile), org.apache.tomcat:catalina:jar:6.0.29 (compile?), com.google.code.guice:guice:jar:1.0
(compile?), org.testng:testng:jar:jdk15:5.1 (test), org.apache.myfaces.core:myfaces-api:jar:tests:1.2.13-SNAPSHOT
(test), org.apache.shale:shale-test:jar:1.0.4 (test), cactus:cactus:jar:13-1.7.2 (test), org.easymock:easymock:jar:2.3
(test), org.easymock:easymockclassextension:jar:2.3 (test)]
Stack trace : 
org.apache.maven.lifecycle.LifecycleExecutionException: Failed to execute goal on project
myfaces-impl: Could not resolve dependencies for project org.apache.myfaces.core:myfaces-impl:jar:1.2.13-SNAPSHOT:
Failed to collect dependencies for [org.apache.myfaces.core:myfaces-api:jar:1.2.13-SNAPSHOT
(compile), org.apache.myfaces.shared:myfaces-shared-impl:jar:3.0.12-SNAPSHOT (provided), javax.servlet:servlet-api:jar:2.5
(provided), javax.servlet.jsp:jsp-api:jar:2.1 (provided), javax.servlet:jstl:jar:1.2 (provided),
portlet-api:portlet-api:jar:1.0 (provided), org.apache.geronimo.specs:geronimo-annotation_1.0_spec:jar:1.0
(provided), org.apache.geronimo.specs:geronimo-jpa_3.0_spec:jar:1.0 (compile?), org.apache.geronimo.specs:geronimo-ejb_3.0_spec:jar:1.0
(compile?), org.apache.myfaces.buildtools:myfaces-builder-annotations:jar:1.0.7 (provided),
commons-collections:commons-collections:jar:3.2 (compile), commons-logging:commons-logging:jar:1.1.1
(compile), commons-discovery:commons-discovery:jar:0.4 (compile), commons-codec:commons-codec:jar:1.3
(compile), commons-beanutils:commons-beanutils:jar:1.8.3 (compile), commons-digester:commons-digester:jar:1.8
(compile), org.apache.tomcat:catalina:jar:6.0.29 (compile?), com.google.code.guice:guice:jar:1.0
(compile?), org.testng:testng:jar:jdk15:5.1 (test), org.apache.myfaces.core:myfaces-api:jar:tests:1.2.13-SNAPSHOT
(test), org.apache.shale:shale-test:jar:1.0.4 (test), cactus:cactus:jar:13-1.7.2 (test), org.easymock:easymock:jar:2.3
(test), org.easymock:easymockclassextension:jar:2.3 (test)]
	at org.apache.maven.lifecycle.internal.LifecycleDependencyResolver.getDependencies(LifecycleDependencyResolver.java:196)
	at org.apache.maven.lifecycle.internal.LifecycleDependencyResolver.resolveProjectDependencies(LifecycleDependencyResolver.java:108)
	at org.apache.maven.lifecycle.internal.MojoExecutor.ensureDependenciesAreResolved(MojoExecutor.java:258)
	at org.apache.maven.lifecycle.internal.MojoExecutor.execute(MojoExecutor.java:201)
	at org.apache.maven.lifecycle.internal.MojoExecutor.execute(MojoExecutor.java:153)
	at org.apache.maven.lifecycle.internal.MojoExecutor.execute(MojoExecutor.java:145)
	at org.apache.maven.lifecycle.internal.LifecycleModuleBuilder.buildProject(LifecycleModuleBuilder.java:84)
	at org.apache.maven.lifecycle.internal.LifecycleModuleBuilder.buildProject(LifecycleModuleBuilder.java:59)
	at org.apache.maven.lifecycle.internal.LifecycleStarter.singleThreadedBuild(LifecycleStarter.java:183)
	at org.apache.maven.lifecycle.internal.LifecycleStarter.execute(LifecycleStarter.java:161)
	at org.apache.maven.DefaultMaven.doExecute(DefaultMaven.java:319)
	at org.apache.maven.DefaultMaven.execute(DefaultMaven.java:156)
	at org.jvnet.hudson.maven3.launcher.Maven3Launcher.main(Maven3Launcher.java:79)
	at sun.reflect.NativeMethodAccessorImpl.invoke0(Native Method)
	at sun.reflect.NativeMethodAccessorImpl.invoke(NativeMethodAccessorImpl.java:39)
	at sun.reflect.DelegatingMethodAccessorImpl.invoke(DelegatingMethodAccessorImpl.java:25)
	at java.lang.reflect.Method.invoke(Method.java:597)
	at org.codehaus.plexus.classworlds.launcher.Launcher.launchStandard(Launcher.java:329)
	at org.codehaus.plexus.classworlds.launcher.Launcher.launch(Launcher.java:239)
	at org.jvnet.hudson.maven3.agent.Maven3Main.launch(Maven3Main.java:158)
	at hudson.maven.Maven3Builder.call(Maven3Builder.java:98)
	at hudson.maven.Maven3Builder.call(Maven3Builder.java:64)
	at hudson.remoting.UserRequest.perform(UserRequest.java:118)
	at hudson.remoting.UserRequest.perform(UserRequest.java:48)
	at hudson.remoting.Request$2.run(Request.java:326)
	at hudson.remoting.InterceptingExecutorService$1.call(InterceptingExecutorService.java:72)
	at java.util.concurrent.FutureTask$Sync.innerRun(FutureTask.java:303)
	at java.util.concurrent.FutureTask.run(FutureTask.java:138)
	at java.util.concurrent.ThreadPoolExecutor$Worker.runTask(ThreadPoolExecutor.java:886)
	at java.util.concurrent.ThreadPoolExecutor$Worker.run(ThreadPoolExecutor.java:908)
	at java.lang.Thread.run(Thread.java:662)
Caused by: org.apache.maven.project.DependencyResolutionException: Could not resolve dependencies
for project org.apache.myfaces.core:myfaces-impl:jar:1.2.13-SNAPSHOT: Failed to collect dependencies
for [org.apache.myfaces.core:myfaces-api:jar:1.2.13-SNAPSHOT (compile), org.apache.myfaces.shared:myfaces-shared-impl:jar:3.0.12-SNAPSHOT
(provided), javax.servlet:servlet-api:jar:2.5 (provided), javax.servlet.jsp:jsp-api:jar:2.1
(provided), javax.servlet:jstl:jar:1.2 (provided), portlet-api:portlet-api:jar:1.0 (provided),
org.apache.geronimo.specs:geronimo-annotation_1.0_spec:jar:1.0 (provided), org.apache.geronimo.specs:geronimo-jpa_3.0_spec:jar:1.0
(compile?), org.apache.geronimo.specs:geronimo-ejb_3.0_spec:jar:1.0 (compile?), org.apache.myfaces.buildtools:myfaces-builder-annotations:jar:1.0.7
(provided), commons-collections:commons-collections:jar:3.2 (compile), commons-logging:commons-logging:jar:1.1.1
(compile), commons-discovery:commons-discovery:jar:0.4 (compile), commons-codec:commons-codec:jar:1.3
(compile), commons-beanutils:commons-beanutils:jar:1.8.3 (compile), commons-digester:commons-digester:jar:1.8
(compile), org.apache.tomcat:catalina:jar:6.0.29 (compile?), com.google.code.guice:guice:jar:1.0
(compile?), org.testng:testng:jar:jdk15:5.1 (test), org.apache.myfaces.core:myfaces-api:jar:tests:1.2.13-SNAPSHOT
(test), org.apache.shale:shale-test:jar:1.0.4 (test), cactus:cactus:jar:13-1.7.2 (test), org.easymock:easymock:jar:2.3
(test), org.easymock:easymockclassextension:jar:2.3 (test)]
	at org.apache.maven.project.DefaultProjectDependenciesResolver.resolve(DefaultProjectDependenciesResolver.java:139)
	at org.apache.maven.lifecycle.internal.LifecycleDependencyResolver.getDependencies(LifecycleDependencyResolver.java:171)
	... 30 more
Caused by: org.sonatype.aether.collection.DependencyCollectionException: Failed to collect
dependencies for [org.apache.myfaces.core:myfaces-api:jar:1.2.13-SNAPSHOT (compile), org.apache.myfaces.shared:myfaces-shared-impl:jar:3.0.12-SNAPSHOT
(provided), javax.servlet:servlet-api:jar:2.5 (provided), javax.servlet.jsp:jsp-api:jar:2.1
(provided), javax.servlet:jstl:jar:1.2 (provided), portlet-api:portlet-api:jar:1.0 (provided),
org.apache.geronimo.specs:geronimo-annotation_1.0_spec:jar:1.0 (provided), org.apache.geronimo.specs:geronimo-jpa_3.0_spec:jar:1.0
(compile?), org.apache.geronimo.specs:geronimo-ejb_3.0_spec:jar:1.0 (compile?), org.apache.myfaces.buildtools:myfaces-builder-annotations:jar:1.0.7
(provided), commons-collections:commons-collections:jar:3.2 (compile), commons-logging:commons-logging:jar:1.1.1
(compile), commons-discovery:commons-discovery:jar:0.4 (compile), commons-codec:commons-codec:jar:1.3
(compile), commons-beanutils:commons-beanutils:jar:1.8.3 (compile), commons-digester:commons-digester:jar:1.8
(compile), org.apache.tomcat:catalina:jar:6.0.29 (compile?), com.google.code.guice:guice:jar:1.0
(compile?), org.testng:testng:jar:jdk15:5.1 (test), org.apache.myfaces.core:myfaces-api:jar:tests:1.2.13-SNAPSHOT
(test), org.apache.shale:shale-test:jar:1.0.4 (test), cactus:cactus:jar:13-1.7.2 (test), org.easymock:easymock:jar:2.3
(test), org.easymock:easymockclassextension:jar:2.3 (test)]
	at org.sonatype.aether.impl.internal.DefaultDependencyCollector.collectDependencies(DefaultDependencyCollector.java:262)
	at org.sonatype.aether.impl.internal.DefaultRepositorySystem.collectDependencies(DefaultRepositorySystem.java:345)
	at org.apache.maven.project.DefaultProjectDependenciesResolver.resolve(DefaultProjectDependenciesResolver.java:131)
	... 31 more
Caused by: org.sonatype.aether.resolution.ArtifactDescriptorException: Failed to read artifact
descriptor for cactus:cactus:jar:13-1.7.2
	at org.apache.maven.repository.internal.DefaultArtifactDescriptorReader.loadPom(DefaultArtifactDescriptorReader.java:282)
	at org.apache.maven.repository.internal.DefaultArtifactDescriptorReader.readArtifactDescriptor(DefaultArtifactDescriptorReader.java:172)
	at org.sonatype.aether.impl.internal.DefaultDependencyCollector.process(DefaultDependencyCollector.java:419)
	at org.sonatype.aether.impl.internal.DefaultDependencyCollector.collectDependencies(DefaultDependencyCollector.java:243)
	... 33 more
Caused by: org.sonatype.aether.resolution.ArtifactResolutionException: Could not transfer
artifact cactus:cactus:pom:13-1.7.2 from/to tomcat (http://tomcat.apache.org/dev/dist/m2-repository):
Error transferring file: Connection reset
	at org.sonatype.aether.impl.internal.DefaultArtifactResolver.resolve(DefaultArtifactResolver.java:541)
	at org.sonatype.aether.impl.internal.DefaultArtifactResolver.resolveArtifacts(DefaultArtifactResolver.java:220)
	at org.sonatype.aether.impl.internal.DefaultArtifactResolver.resolveArtifact(DefaultArtifactResolver.java:197)
	at org.apache.maven.repository.internal.DefaultArtifactDescriptorReader.loadPom(DefaultArtifactDescriptorReader.java:267)
	... 36 more
Caused by: org.sonatype.aether.transfer.ArtifactTransferException: Could not transfer artifact
cactus:cactus:pom:13-1.7.2 from/to tomcat (http://tomcat.apache.org/dev/dist/m2-repository):
Error transferring file: Connection reset
	at org.sonatype.aether.connector.wagon.WagonRepositoryConnector$4.wrap(WagonRepositoryConnector.java:949)
	at org.sonatype.aether.connector.wagon.WagonRepositoryConnector$4.wrap(WagonRepositoryConnector.java:940)
	at org.sonatype.aether.connector.wagon.WagonRepositoryConnector$GetTask.flush(WagonRepositoryConnector.java:695)
	at org.sonatype.aether.connector.wagon.WagonRepositoryConnector$GetTask.flush(WagonRepositoryConnector.java:689)
	at org.sonatype.aether.connector.wagon.WagonRepositoryConnector.get(WagonRepositoryConnector.java:445)
	at org.sonatype.aether.impl.internal.DefaultArtifactResolver.resolve(DefaultArtifactResolver.java:460)
	... 39 more
Caused by: org.apache.maven.wagon.TransferFailedException: Error transferring file: Connection
reset
	at org.apache.maven.wagon.providers.http.LightweightHttpWagon.fillInputData(LightweightHttpWagon.java:143)
	at org.apache.maven.wagon.StreamWagon.getInputStream(StreamWagon.java:116)
	at org.apache.maven.wagon.StreamWagon.getIfNewer(StreamWagon.java:88)
	at org.apache.maven.wagon.StreamWagon.get(StreamWagon.java:61)
	at org.sonatype.aether.connector.wagon.WagonRepositoryConnector$GetTask.run(WagonRepositoryConnector.java:608)
	at org.sonatype.aether.util.concurrency.RunnableErrorForwarder$1.run(RunnableErrorForwarder.java:64)
	... 3 more
Caused by: java.net.SocketException: Connection reset
	at java.net.SocketInputStream.read(SocketInputStream.java:168)
	at java.io.BufferedInputStream.fill(BufferedInputStream.java:218)
	at java.io.BufferedInputStream.read1(BufferedInputStream.java:258)
	at java.io.BufferedInputStream.read(BufferedInputStream.java:317)
	at sun.net.www.http.HttpClient.parseHTTPHeader(HttpClient.java:695)
	at sun.net.www.http.HttpClient.parseHTTP(HttpClient.java:640)
	at sun.net.www.http.HttpClient.parseHTTP(HttpClient.java:660)
	at sun.net.www.protocol.http.HttpURLConnection.getInputStream(HttpURLConnection.java:1195)
	at java.net.HttpURLConnection.getResponseCode(HttpURLConnection.java:379)
	at org.apache.maven.wagon.providers.http.LightweightHttpWagon.fillInputData(LightweightHttpWagon.java:115)
	... 8 more
Sending e-mails to: commits@myfaces.apache.org grantsmith@apache.org
channel stopped

Mime
View raw message