myfaces-commits mailing list archives

Site index · List index
Message view « Date » · « Thread »
Top « Date » · « Thread »
From Apache Jenkins Server <jenk...@builds.apache.org>
Subject Build failed in Jenkins: tobago-1.0.x-deploy #514
Date Mon, 21 Jan 2013 23:17:17 GMT
See <https://builds.apache.org/job/tobago-1.0.x-deploy/514/>

------------------------------------------
[...truncated 2459 lines...]
Uploading: https://repository.apache.org/content/repositories/snapshots/org/apache/myfaces/tobago/tobago/1.0.40-SNAPSHOT/tobago-1.0.40-SNAPSHOT.pom
42K uploaded  (tobago-1.0.40-SNAPSHOT.pom)
[INFO] Retrieving previous metadata from apache.snapshots.https
[WARNING] *** CHECKSUM FAILED - Checksum failed on download: local = '0b07114e04bb7bc5e8b336e992ab6e208ec4e482';
remote = 'aaef330c134c0175589167d25d51c89e90164072' - RETRYING
[WARNING] *** CHECKSUM FAILED - Checksum failed on download: local = '0b07114e04bb7bc5e8b336e992ab6e208ec4e482';
remote = 'aaef330c134c0175589167d25d51c89e90164072' - IGNORING
[INFO] Uploading repository metadata for: 'snapshot org.apache.myfaces.tobago:tobago:1.0.40-SNAPSHOT'
[INFO] Retrieving previous metadata from apache.snapshots.https
[INFO] Uploading repository metadata for: 'artifact org.apache.myfaces.tobago:tobago'
[INFO] Retrieving previous build number from apache.snapshots.https
Uploading: https://repository.apache.org/content/repositories/snapshots/org/apache/myfaces/tobago/tobago/1.0.40-SNAPSHOT/tobago-1.0.40-SNAPSHOT-site.xml
3K uploaded  (tobago-1.0.40-SNAPSHOT-site.xml)
[INFO] Retrieving previous build number from apache.snapshots.https
Uploading: https://repository.apache.org/content/repositories/snapshots/org/apache/myfaces/tobago/tobago/1.0.40-SNAPSHOT/tobago-1.0.40-SNAPSHOT-source-release.zip
2944K uploaded  (tobago-1.0.40-SNAPSHOT-source-release.zip)
[JENKINS] Archiving <https://builds.apache.org/job/tobago-1.0.x-deploy/ws/tobago-1.0.x-deploy/target/tobago-1.0.40-SNAPSHOT-site.xml>
to /home/hudson/hudson/jobs/tobago-1.0.x-deploy/modules/org.apache.myfaces.tobago$tobago/builds/2013-01-21_23-15-23/archive/org.apache.myfaces.tobago/tobago/1.0.40-SNAPSHOT/tobago-1.0.40-SNAPSHOT-site.xml
[JENKINS] Archiving <https://builds.apache.org/job/tobago-1.0.x-deploy/ws/tobago-1.0.x-deploy/target/tobago-1.0.40-SNAPSHOT-source-release.zip>
to /home/hudson/hudson/jobs/tobago-1.0.x-deploy/modules/org.apache.myfaces.tobago$tobago/builds/2013-01-21_23-15-23/archive/org.apache.myfaces.tobago/tobago/1.0.40-SNAPSHOT/tobago-1.0.40-SNAPSHOT-source-release.zip
[INFO] ------------------------------------------------------------------------
[INFO] Building Tobago Tool
[INFO]    task-segment: [clean, source:jar, deploy]
[INFO] ------------------------------------------------------------------------
[INFO] [clean:clean {execution: default-clean}]
[INFO] Preparing source:jar
[JENKINS] Archiving <https://builds.apache.org/job/tobago-1.0.x-deploy/ws/tobago-1.0.x-deploy/tobago-tool/pom.xml>
to /home/hudson/hudson/jobs/tobago-1.0.x-deploy/modules/org.apache.myfaces.tobago$tobago-tool/builds/2013-01-21_23-15-24/archive/org.apache.myfaces.tobago/tobago-tool/1.0.40-SNAPSHOT/tobago-tool-1.0.40-SNAPSHOT.pom
[INFO] [buildnumber:create {execution: default}]
[INFO] [source:jar {execution: default-cli}]
[INFO] [buildnumber:create {execution: default}]
[INFO] [remote-resources:process {execution: default}]
[INFO] [site:attach-descriptor {execution: default-attach-descriptor}]
[INFO] [assembly:single {execution: source-release-assembly}]
[INFO] Skipping the assembly in this project because it's not the Execution Root
[INFO] [install:install {execution: default-install}]
[INFO] Installing <https://builds.apache.org/job/tobago-1.0.x-deploy/ws/tobago-1.0.x-deploy/tobago-tool/pom.xml>
to /home/jenkins/jenkins-slave/maven-repositories/0/org/apache/myfaces/tobago/tobago-tool/1.0.40-SNAPSHOT/tobago-tool-1.0.40-SNAPSHOT.pom
[INFO] [deploy:deploy {execution: default-deploy}]
[INFO] Retrieving previous build number from apache.snapshots.https
[WARNING] *** CHECKSUM FAILED - Checksum failed on download: local = 'c69802db0d40fe7544abcfa4b762471457d42d9c';
remote = '58ae805d9883b9f63b89c96396ed62470e5f3fea' - RETRYING
[WARNING] *** CHECKSUM FAILED - Checksum failed on download: local = 'c69802db0d40fe7544abcfa4b762471457d42d9c';
remote = '58ae805d9883b9f63b89c96396ed62470e5f3fea' - IGNORING
Uploading: https://repository.apache.org/content/repositories/snapshots/org/apache/myfaces/tobago/tobago-tool/1.0.40-SNAPSHOT/tobago-tool-1.0.40-SNAPSHOT.pom
1K uploaded  (tobago-tool-1.0.40-SNAPSHOT.pom)
[INFO] Retrieving previous metadata from apache.snapshots.https
[INFO] Uploading repository metadata for: 'artifact org.apache.myfaces.tobago:tobago-tool'
[INFO] Retrieving previous metadata from apache.snapshots.https
[WARNING] *** CHECKSUM FAILED - Checksum failed on download: local = 'c69802db0d40fe7544abcfa4b762471457d42d9c';
remote = '58ae805d9883b9f63b89c96396ed62470e5f3fea' - RETRYING
[WARNING] *** CHECKSUM FAILED - Checksum failed on download: local = 'c69802db0d40fe7544abcfa4b762471457d42d9c';
remote = '58ae805d9883b9f63b89c96396ed62470e5f3fea' - IGNORING
[INFO] Uploading repository metadata for: 'snapshot org.apache.myfaces.tobago:tobago-tool:1.0.40-SNAPSHOT'
[INFO] ------------------------------------------------------------------------
[INFO] Building Maven Apt Plugin
[INFO]    task-segment: [clean, source:jar, deploy]
[INFO] ------------------------------------------------------------------------
[INFO] [clean:clean {execution: default-clean}]
[INFO] Preparing source:jar
[JENKINS] Archiving <https://builds.apache.org/job/tobago-1.0.x-deploy/ws/tobago-1.0.x-deploy/tobago-tool/maven-apt-plugin/pom.xml>
to /home/hudson/hudson/jobs/tobago-1.0.x-deploy/modules/org.apache.myfaces.tobago$maven-apt-plugin/builds/2013-01-21_23-15-24/archive/org.apache.myfaces.tobago/maven-apt-plugin/1.0.40-SNAPSHOT/maven-apt-plugin-1.0.40-SNAPSHOT.pom
[INFO] [buildnumber:create {execution: default}]
[INFO] [source:jar {execution: default-cli}]
[INFO] Building jar: <https://builds.apache.org/job/tobago-1.0.x-deploy/ws/tobago-1.0.x-deploy/tobago-tool/maven-apt-plugin/target/maven-apt-plugin-1.0.40-SNAPSHOT-sources.jar>
[INFO] [buildnumber:create {execution: default}]
[INFO] [plugin:descriptor {execution: default-descriptor}]
[INFO] Using 'UTF-8' encoding to read mojo metadata.
[INFO] Applying mojo extractor for language: java
[INFO] Mojo extractor for language: java found 2 mojo descriptors.
[INFO] Applying mojo extractor for language: bsh
[INFO] Mojo extractor for language: bsh found 0 mojo descriptors.
[INFO] [remote-resources:process {execution: default}]
[INFO] [resources:resources {execution: default-resources}]
[INFO] Using 'UTF-8' encoding to copy filtered resources.
[INFO] Copying 2 resources
[INFO] Copying 3 resources
[INFO] [compiler:compile {execution: default-compile}]
[INFO] Compiling 4 source files to <https://builds.apache.org/job/tobago-1.0.x-deploy/ws/tobago-1.0.x-deploy/tobago-tool/maven-apt-plugin/target/classes>
[INFO] [resources:testResources {execution: default-testResources}]
[INFO] Using 'UTF-8' encoding to copy filtered resources.
[INFO] skip non existing resourceDirectory <https://builds.apache.org/job/tobago-1.0.x-deploy/ws/tobago-1.0.x-deploy/tobago-tool/maven-apt-plugin/src/test/resources>
[INFO] Copying 3 resources
[INFO] [compiler:testCompile {execution: default-testCompile}]
[INFO] No sources to compile
[INFO] [surefire:test {execution: default-test}]
[INFO] Surefire report directory: <https://builds.apache.org/job/tobago-1.0.x-deploy/ws/tobago-1.0.x-deploy/tobago-tool/maven-apt-plugin/target/surefire-reports>

-------------------------------------------------------
 T E S T S
-------------------------------------------------------
There are no tests to run.

Results :

Tests run: 0, Failures: 0, Errors: 0, Skipped: 0

[JENKINS] Recording test results
[INFO] [jar:jar {execution: default-jar}]
[INFO] Building jar: <https://builds.apache.org/job/tobago-1.0.x-deploy/ws/tobago-1.0.x-deploy/tobago-tool/maven-apt-plugin/target/maven-apt-plugin-1.0.40-SNAPSHOT.jar>
[INFO] [plugin:addPluginArtifactMetadata {execution: default-addPluginArtifactMetadata}]
[INFO] [assembly:single {execution: source-release-assembly}]
[INFO] Skipping the assembly in this project because it's not the Execution Root
[INFO] [install:install {execution: default-install}]
[INFO] Installing <https://builds.apache.org/job/tobago-1.0.x-deploy/ws/tobago-1.0.x-deploy/tobago-tool/maven-apt-plugin/target/maven-apt-plugin-1.0.40-SNAPSHOT.jar>
to /home/jenkins/jenkins-slave/maven-repositories/0/org/apache/myfaces/tobago/maven-apt-plugin/1.0.40-SNAPSHOT/maven-apt-plugin-1.0.40-SNAPSHOT.jar
[INFO] Installing <https://builds.apache.org/job/tobago-1.0.x-deploy/ws/tobago-1.0.x-deploy/tobago-tool/maven-apt-plugin/target/maven-apt-plugin-1.0.40-SNAPSHOT-sources.jar>
to /home/jenkins/jenkins-slave/maven-repositories/0/org/apache/myfaces/tobago/maven-apt-plugin/1.0.40-SNAPSHOT/maven-apt-plugin-1.0.40-SNAPSHOT-sources.jar
[INFO] [deploy:deploy {execution: default-deploy}]
[INFO] Retrieving previous build number from apache.snapshots.https
[WARNING] *** CHECKSUM FAILED - Checksum failed on download: local = '8df929323ba38fee29e362b3652c3bd66c7dbeac';
remote = '084b9070221bc4489bc18c4e989f86e4fb3215b3' - RETRYING
[WARNING] *** CHECKSUM FAILED - Checksum failed on download: local = '8df929323ba38fee29e362b3652c3bd66c7dbeac';
remote = '084b9070221bc4489bc18c4e989f86e4fb3215b3' - IGNORING
Uploading: https://repository.apache.org/content/repositories/snapshots/org/apache/myfaces/tobago/maven-apt-plugin/1.0.40-SNAPSHOT/maven-apt-plugin-1.0.40-SNAPSHOT.jar
25K uploaded  (maven-apt-plugin-1.0.40-SNAPSHOT.jar)
[INFO] Retrieving previous metadata from apache.snapshots.https
[WARNING] *** CHECKSUM FAILED - Checksum failed on download: local = '8df929323ba38fee29e362b3652c3bd66c7dbeac';
remote = '084b9070221bc4489bc18c4e989f86e4fb3215b3' - RETRYING
[WARNING] *** CHECKSUM FAILED - Checksum failed on download: local = '8df929323ba38fee29e362b3652c3bd66c7dbeac';
remote = '084b9070221bc4489bc18c4e989f86e4fb3215b3' - IGNORING
[INFO] Uploading repository metadata for: 'snapshot org.apache.myfaces.tobago:maven-apt-plugin:1.0.40-SNAPSHOT'
[INFO] Retrieving previous metadata from apache.snapshots.https
[INFO] Uploading repository metadata for: 'artifact org.apache.myfaces.tobago:maven-apt-plugin'
[INFO] Uploading project information for maven-apt-plugin 1.0.40-SNAPSHOT
[INFO] Retrieving previous metadata from apache.snapshots.https
[INFO] Uploading repository metadata for: 'org.apache.myfaces.tobago'
[INFO] Retrieving previous build number from apache.snapshots.https
Uploading: https://repository.apache.org/content/repositories/snapshots/org/apache/myfaces/tobago/maven-apt-plugin/1.0.40-SNAPSHOT/maven-apt-plugin-1.0.40-SNAPSHOT-sources.jar
15K uploaded  (maven-apt-plugin-1.0.40-SNAPSHOT-sources.jar)
[JENKINS] Archiving <https://builds.apache.org/job/tobago-1.0.x-deploy/ws/tobago-1.0.x-deploy/tobago-tool/maven-apt-plugin/target/maven-apt-plugin-1.0.40-SNAPSHOT.jar>
to /home/hudson/hudson/jobs/tobago-1.0.x-deploy/modules/org.apache.myfaces.tobago$maven-apt-plugin/builds/2013-01-21_23-15-24/archive/org.apache.myfaces.tobago/maven-apt-plugin/1.0.40-SNAPSHOT/maven-apt-plugin-1.0.40-SNAPSHOT.jar
[JENKINS] Archiving <https://builds.apache.org/job/tobago-1.0.x-deploy/ws/tobago-1.0.x-deploy/tobago-tool/maven-apt-plugin/target/maven-apt-plugin-1.0.40-SNAPSHOT-sources.jar>
to /home/hudson/hudson/jobs/tobago-1.0.x-deploy/modules/org.apache.myfaces.tobago$maven-apt-plugin/builds/2013-01-21_23-15-24/archive/org.apache.myfaces.tobago/maven-apt-plugin/1.0.40-SNAPSHOT/maven-apt-plugin-1.0.40-SNAPSHOT-sources.jar
[INFO] ------------------------------------------------------------------------
[INFO] Building Maven Tobago Theme Plugin
[INFO]    task-segment: [clean, source:jar, deploy]
[INFO] ------------------------------------------------------------------------
[INFO] [clean:clean {execution: default-clean}]
[INFO] Preparing source:jar
[JENKINS] Archiving <https://builds.apache.org/job/tobago-1.0.x-deploy/ws/tobago-1.0.x-deploy/tobago-tool/maven-theme-plugin/pom.xml>
to /home/hudson/hudson/jobs/tobago-1.0.x-deploy/modules/org.apache.myfaces.tobago$maven-theme-plugin/builds/2013-01-21_23-15-24/archive/org.apache.myfaces.tobago/maven-theme-plugin/1.0.40-SNAPSHOT/maven-theme-plugin-1.0.40-SNAPSHOT.pom
[INFO] [buildnumber:create {execution: default}]
[INFO] [source:jar {execution: default-cli}]
[INFO] Building jar: <https://builds.apache.org/job/tobago-1.0.x-deploy/ws/tobago-1.0.x-deploy/tobago-tool/maven-theme-plugin/target/maven-theme-plugin-1.0.40-SNAPSHOT-sources.jar>
[INFO] [buildnumber:create {execution: default}]
[INFO] [plugin:descriptor {execution: default-descriptor}]
[INFO] Using 'UTF-8' encoding to read mojo metadata.
[INFO] Applying mojo extractor for language: java
[WARNING] org.apache.myfaces.tobago.maven.plugin.UnPackThemeMojo#archiverManager:
[WARNING]   The syntax
[WARNING]     @parameter expression="${component.<role>#<roleHint>}"
[WARNING]   is deprecated, please use
[WARNING]     @component role="<role>" roleHint="<roleHint>"
[WARNING]   instead.
[WARNING] org.apache.myfaces.tobago.maven.plugin.PackThemeMojo#archiver:
[WARNING]   The syntax
[WARNING]     @parameter expression="${component.<role>#<roleHint>}"
[WARNING]   is deprecated, please use
[WARNING]     @component role="<role>" roleHint="<roleHint>"
[WARNING]   instead.
[INFO] Mojo extractor for language: java found 2 mojo descriptors.
[INFO] Applying mojo extractor for language: bsh
[INFO] Mojo extractor for language: bsh found 0 mojo descriptors.
[INFO] [remote-resources:process {execution: default}]
[INFO] [resources:resources {execution: default-resources}]
[INFO] Using 'UTF-8' encoding to copy filtered resources.
[INFO] Copying 2 resources
[INFO] Copying 3 resources
[INFO] [compiler:compile {execution: default-compile}]
[INFO] Compiling 3 source files to <https://builds.apache.org/job/tobago-1.0.x-deploy/ws/tobago-1.0.x-deploy/tobago-tool/maven-theme-plugin/target/classes>
[INFO] [resources:testResources {execution: default-testResources}]
[INFO] Using 'UTF-8' encoding to copy filtered resources.
[INFO] skip non existing resourceDirectory <https://builds.apache.org/job/tobago-1.0.x-deploy/ws/tobago-1.0.x-deploy/tobago-tool/maven-theme-plugin/src/test/resources>
[INFO] Copying 3 resources
[INFO] [compiler:testCompile {execution: default-testCompile}]
[INFO] No sources to compile
[INFO] [surefire:test {execution: default-test}]
[INFO] Surefire report directory: <https://builds.apache.org/job/tobago-1.0.x-deploy/ws/tobago-1.0.x-deploy/tobago-tool/maven-theme-plugin/target/surefire-reports>

-------------------------------------------------------
 T E S T S
-------------------------------------------------------
There are no tests to run.

Results :

Tests run: 0, Failures: 0, Errors: 0, Skipped: 0

[JENKINS] Recording test results
[INFO] [jar:jar {execution: default-jar}]
[INFO] Building jar: <https://builds.apache.org/job/tobago-1.0.x-deploy/ws/tobago-1.0.x-deploy/tobago-tool/maven-theme-plugin/target/maven-theme-plugin-1.0.40-SNAPSHOT.jar>
[INFO] [plugin:addPluginArtifactMetadata {execution: default-addPluginArtifactMetadata}]
[INFO] [assembly:single {execution: source-release-assembly}]
[INFO] Skipping the assembly in this project because it's not the Execution Root
[INFO] [install:install {execution: default-install}]
[INFO] Installing <https://builds.apache.org/job/tobago-1.0.x-deploy/ws/tobago-1.0.x-deploy/tobago-tool/maven-theme-plugin/target/maven-theme-plugin-1.0.40-SNAPSHOT.jar>
to /home/jenkins/jenkins-slave/maven-repositories/0/org/apache/myfaces/tobago/maven-theme-plugin/1.0.40-SNAPSHOT/maven-theme-plugin-1.0.40-SNAPSHOT.jar
[INFO] Installing <https://builds.apache.org/job/tobago-1.0.x-deploy/ws/tobago-1.0.x-deploy/tobago-tool/maven-theme-plugin/target/maven-theme-plugin-1.0.40-SNAPSHOT-sources.jar>
to /home/jenkins/jenkins-slave/maven-repositories/0/org/apache/myfaces/tobago/maven-theme-plugin/1.0.40-SNAPSHOT/maven-theme-plugin-1.0.40-SNAPSHOT-sources.jar
[INFO] [deploy:deploy {execution: default-deploy}]
[INFO] Retrieving previous build number from apache.snapshots.https
[WARNING] *** CHECKSUM FAILED - Checksum failed on download: local = 'e3acee16fa38f85e22819bb75b5d67401dd6e9b3';
remote = '8b969892dcb14b1b8d9e2c21813a281f2dc44f7f' - RETRYING
[WARNING] *** CHECKSUM FAILED - Checksum failed on download: local = 'e3acee16fa38f85e22819bb75b5d67401dd6e9b3';
remote = '8b969892dcb14b1b8d9e2c21813a281f2dc44f7f' - IGNORING
Uploading: https://repository.apache.org/content/repositories/snapshots/org/apache/myfaces/tobago/maven-theme-plugin/1.0.40-SNAPSHOT/maven-theme-plugin-1.0.40-SNAPSHOT.jar
19K uploaded  (maven-theme-plugin-1.0.40-SNAPSHOT.jar)
[INFO] Retrieving previous metadata from apache.snapshots.https
[INFO] Uploading repository metadata for: 'artifact org.apache.myfaces.tobago:maven-theme-plugin'
[INFO] Retrieving previous metadata from apache.snapshots.https
[WARNING] *** CHECKSUM FAILED - Checksum failed on download: local = 'e3acee16fa38f85e22819bb75b5d67401dd6e9b3';
remote = '8b969892dcb14b1b8d9e2c21813a281f2dc44f7f' - RETRYING
[WARNING] *** CHECKSUM FAILED - Checksum failed on download: local = 'e3acee16fa38f85e22819bb75b5d67401dd6e9b3';
remote = '8b969892dcb14b1b8d9e2c21813a281f2dc44f7f' - IGNORING
[INFO] Uploading repository metadata for: 'snapshot org.apache.myfaces.tobago:maven-theme-plugin:1.0.40-SNAPSHOT'
[INFO] Uploading project information for maven-theme-plugin 1.0.40-SNAPSHOT
[INFO] Retrieving previous metadata from apache.snapshots.https
[INFO] Uploading repository metadata for: 'org.apache.myfaces.tobago'
[INFO] Retrieving previous build number from apache.snapshots.https
Uploading: https://repository.apache.org/content/repositories/snapshots/org/apache/myfaces/tobago/maven-theme-plugin/1.0.40-SNAPSHOT/maven-theme-plugin-1.0.40-SNAPSHOT-sources.jar
10K uploaded  (maven-theme-plugin-1.0.40-SNAPSHOT-sources.jar)
[JENKINS] Archiving <https://builds.apache.org/job/tobago-1.0.x-deploy/ws/tobago-1.0.x-deploy/tobago-tool/maven-theme-plugin/target/maven-theme-plugin-1.0.40-SNAPSHOT.jar>
to /home/hudson/hudson/jobs/tobago-1.0.x-deploy/modules/org.apache.myfaces.tobago$maven-theme-plugin/builds/2013-01-21_23-15-24/archive/org.apache.myfaces.tobago/maven-theme-plugin/1.0.40-SNAPSHOT/maven-theme-plugin-1.0.40-SNAPSHOT.jar
[JENKINS] Archiving <https://builds.apache.org/job/tobago-1.0.x-deploy/ws/tobago-1.0.x-deploy/tobago-tool/maven-theme-plugin/target/maven-theme-plugin-1.0.40-SNAPSHOT-sources.jar>
to /home/hudson/hudson/jobs/tobago-1.0.x-deploy/modules/org.apache.myfaces.tobago$maven-theme-plugin/builds/2013-01-21_23-15-24/archive/org.apache.myfaces.tobago/maven-theme-plugin/1.0.40-SNAPSHOT/maven-theme-plugin-1.0.40-SNAPSHOT-sources.jar
[INFO] ------------------------------------------------------------------------
[INFO] Building Tobago Annotation
[INFO]    task-segment: [clean, source:jar, deploy]
[INFO] ------------------------------------------------------------------------
[INFO] [clean:clean {execution: default-clean}]
[INFO] Preparing source:jar
[JENKINS] Archiving <https://builds.apache.org/job/tobago-1.0.x-deploy/ws/tobago-1.0.x-deploy/tobago-tool/tobago-tool-annotation/pom.xml>
to /home/hudson/hudson/jobs/tobago-1.0.x-deploy/modules/org.apache.myfaces.tobago$tobago-tool-annotation/builds/2013-01-21_23-15-25/archive/org.apache.myfaces.tobago/tobago-tool-annotation/1.0.40-SNAPSHOT/tobago-tool-annotation-1.0.40-SNAPSHOT.pom
[INFO] [buildnumber:create {execution: default}]
[INFO] [source:jar {execution: default-cli}]
[INFO] Building jar: <https://builds.apache.org/job/tobago-1.0.x-deploy/ws/tobago-1.0.x-deploy/tobago-tool/tobago-tool-annotation/target/tobago-tool-annotation-1.0.40-SNAPSHOT-sources.jar>
[INFO] [buildnumber:create {execution: default}]
[INFO] [remote-resources:process {execution: default}]
[INFO] [resources:resources {execution: default-resources}]
[INFO] Using 'UTF-8' encoding to copy filtered resources.
[INFO] Copying 2 resources
[INFO] Copying 3 resources
[INFO] [compiler:compile {execution: default-compile}]
[INFO] Compiling 14 source files to <https://builds.apache.org/job/tobago-1.0.x-deploy/ws/tobago-1.0.x-deploy/tobago-tool/tobago-tool-annotation/target/classes>
[INFO] [resources:testResources {execution: default-testResources}]
[INFO] Using 'UTF-8' encoding to copy filtered resources.
[INFO] skip non existing resourceDirectory <https://builds.apache.org/job/tobago-1.0.x-deploy/ws/tobago-1.0.x-deploy/tobago-tool/tobago-tool-annotation/src/test/resources>
[INFO] Copying 3 resources
[INFO] [compiler:testCompile {execution: default-testCompile}]
[INFO] No sources to compile
[INFO] [surefire:test {execution: default-test}]
[INFO] Surefire report directory: <https://builds.apache.org/job/tobago-1.0.x-deploy/ws/tobago-1.0.x-deploy/tobago-tool/tobago-tool-annotation/target/surefire-reports>

-------------------------------------------------------
 T E S T S
-------------------------------------------------------
There are no tests to run.

Results :

Tests run: 0, Failures: 0, Errors: 0, Skipped: 0

[JENKINS] Recording test results
Jan 21, 2013 11:17:14 PM hudson.remoting.SynchronousCommandTransport$ReaderThread run
SEVERE: I/O error in channel channel
java.io.StreamCorruptedException
	at java.io.ObjectInputStream.readObject0(ObjectInputStream.java:1332)
	at java.io.ObjectInputStream.readObject(ObjectInputStream.java:348)
	at hudson.remoting.Command.readFrom(Command.java:92)
	at hudson.remoting.ClassicCommandTransport.read(ClassicCommandTransport.java:59)
	at hudson.remoting.SynchronousCommandTransport$ReaderThread.run(SynchronousCommandTransport.java:48)
channel stopped
[INFO] ------------------------------------------------------------------------
[ERROR] FATAL ERROR
[INFO] ------------------------------------------------------------------------
ERROR: Maven JVM terminated unexpectedly with exit code 0


Mime
View raw message