myfaces-commits mailing list archives

Site index · List index
Message view « Date » · « Thread »
Top « Date » · « Thread »
From Apache Jenkins Server <jenk...@builds.apache.org>
Subject Build failed in Jenkins: tobago-trunk #942
Date Tue, 12 Feb 2013 09:13:41 GMT
See <https://builds.apache.org/job/tobago-trunk/942/changes>

Changes:

[lofwyr] TOBAGO-1212: Using JSR 269: Pluggable Annotation Processing API
 - Removing old Annotation Processors, Factories and Visitors

------------------------------------------
[...truncated 63061 lines...]

Results :

Tests run: 0, Failures: 0, Errors: 0, Skipped: 0

[JENKINS] Recording test results
[INFO] [jar:jar {execution: default-jar}]
[INFO] Building jar: <https://builds.apache.org/job/tobago-trunk/ws/tobago-trunk/tobago-theme/tobago-theme-charlotteville/target/tobago-theme-charlotteville-1.6.0-beta-3-SNAPSHOT.jar>
[INFO] [checkstyle:check {execution: verify-style}]
[INFO] 
[INFO] [install:install {execution: default-install}]
[INFO] Installing <https://builds.apache.org/job/tobago-trunk/ws/tobago-trunk/tobago-theme/tobago-theme-charlotteville/target/tobago-theme-charlotteville-1.6.0-beta-3-SNAPSHOT.jar>
to /home/jenkins/jenkins-slave/maven-repositories/1/org/apache/myfaces/tobago/tobago-theme-charlotteville/1.6.0-beta-3-SNAPSHOT/tobago-theme-charlotteville-1.6.0-beta-3-SNAPSHOT.jar
[JENKINS] Archiving <https://builds.apache.org/job/tobago-trunk/ws/tobago-trunk/tobago-theme/tobago-theme-charlotteville/pom.xml>
to /home/hudson/hudson/jobs/tobago-trunk/modules/org.apache.myfaces.tobago$tobago-theme-charlotteville/builds/2013-02-12_09-07-24/archive/org.apache.myfaces.tobago/tobago-theme-charlotteville/1.6.0-beta-3-SNAPSHOT/tobago-theme-charlotteville-1.6.0-beta-3-SNAPSHOT.pom
[JENKINS] Archiving <https://builds.apache.org/job/tobago-trunk/ws/tobago-trunk/tobago-theme/tobago-theme-charlotteville/target/tobago-theme-charlotteville-1.6.0-beta-3-SNAPSHOT.jar>
to /home/hudson/hudson/jobs/tobago-trunk/modules/org.apache.myfaces.tobago$tobago-theme-charlotteville/builds/2013-02-12_09-07-24/archive/org.apache.myfaces.tobago/tobago-theme-charlotteville/1.6.0-beta-3-SNAPSHOT/tobago-theme-charlotteville-1.6.0-beta-3-SNAPSHOT.jar
[INFO] ------------------------------------------------------------------------
[INFO] Building Tobago Deprecation
[INFO]    task-segment: [clean, animal-sniffer:check, checkstyle:check, install]
[INFO] ------------------------------------------------------------------------
[INFO] [clean:clean {execution: default-clean}]
[INFO] [animal-sniffer:check {execution: default-cli}]
[INFO] Checking unresolved references to org.codehaus.mojo.signature:java15:1.0
[INFO] [checkstyle:check {execution: default-cli}]
[INFO] 
[INFO] [enforcer:enforce {execution: enforce}]
[INFO] [remote-resources:process {execution: default}]
[debug] execute contextualize
[INFO] [resources:resources {execution: default-resources}]
[INFO] Using 'UTF-8' encoding to copy filtered resources.
[INFO] skip non existing resourceDirectory <https://builds.apache.org/job/tobago-trunk/ws/tobago-trunk/tobago-extension/tobago-deprecation/src/main/resources>
[INFO] Copying 3 resources
[INFO] [compiler:compile {execution: default-compile}]
[INFO] Compiling 16 source files to <https://builds.apache.org/job/tobago-trunk/ws/tobago-trunk/tobago-extension/tobago-deprecation/target/classes>
[debug] execute contextualize
[INFO] [resources:testResources {execution: default-testResources}]
[INFO] Using 'UTF-8' encoding to copy filtered resources.
[INFO] skip non existing resourceDirectory <https://builds.apache.org/job/tobago-trunk/ws/tobago-trunk/tobago-extension/tobago-deprecation/src/test/resources>
[INFO] Copying 3 resources
[INFO] [compiler:testCompile {execution: default-testCompile}]
[INFO] No sources to compile
[INFO] [surefire:test {execution: default-test}]
[INFO] Surefire report directory: <https://builds.apache.org/job/tobago-trunk/ws/tobago-trunk/tobago-extension/tobago-deprecation/target/surefire-reports>

-------------------------------------------------------
 T E S T S
-------------------------------------------------------
[JENKINS] Recording test results
Results :

Tests run: 0, Failures: 0, Errors: 0, Skipped: 0


[INFO] [jar:jar {execution: default-jar}]
[INFO] Building jar: <https://builds.apache.org/job/tobago-trunk/ws/tobago-trunk/tobago-extension/tobago-deprecation/target/tobago-deprecation-1.6.0-beta-3-SNAPSHOT.jar>
[INFO] [checkstyle:check {execution: verify-style}]
[INFO] 
[INFO] [install:install {execution: default-install}]
[INFO] Installing <https://builds.apache.org/job/tobago-trunk/ws/tobago-trunk/tobago-extension/tobago-deprecation/target/tobago-deprecation-1.6.0-beta-3-SNAPSHOT.jar>
to /home/jenkins/jenkins-slave/maven-repositories/1/org/apache/myfaces/tobago/tobago-deprecation/1.6.0-beta-3-SNAPSHOT/tobago-deprecation-1.6.0-beta-3-SNAPSHOT.jar
[JENKINS] Archiving <https://builds.apache.org/job/tobago-trunk/ws/tobago-trunk/tobago-extension/tobago-deprecation/pom.xml>
to /home/hudson/hudson/jobs/tobago-trunk/modules/org.apache.myfaces.tobago$tobago-deprecation/builds/2013-02-12_09-07-24/archive/org.apache.myfaces.tobago/tobago-deprecation/1.6.0-beta-3-SNAPSHOT/tobago-deprecation-1.6.0-beta-3-SNAPSHOT.pom
[JENKINS] Archiving <https://builds.apache.org/job/tobago-trunk/ws/tobago-trunk/tobago-extension/tobago-deprecation/target/tobago-deprecation-1.6.0-beta-3-SNAPSHOT.jar>
to /home/hudson/hudson/jobs/tobago-trunk/modules/org.apache.myfaces.tobago$tobago-deprecation/builds/2013-02-12_09-07-24/archive/org.apache.myfaces.tobago/tobago-deprecation/1.6.0-beta-3-SNAPSHOT/tobago-deprecation-1.6.0-beta-3-SNAPSHOT.jar
[INFO] ------------------------------------------------------------------------
[INFO] Building Tobago Facelets
[INFO]    task-segment: [clean, animal-sniffer:check, checkstyle:check, install]
[INFO] ------------------------------------------------------------------------
[INFO] [clean:clean {execution: default-clean}]
[INFO] [animal-sniffer:check {execution: default-cli}]
[INFO] Checking unresolved references to org.codehaus.mojo.signature:java15:1.0
[INFO] [checkstyle:check {execution: default-cli}]
[INFO] 
[INFO] [enforcer:enforce {execution: enforce}]
[INFO] [dependency:unpack {execution: unpack-sources}]
[INFO] Configured Artifact: org.apache.myfaces.tobago:tobago-core:sources:1.6.0-beta-3-SNAPSHOT:jar
[INFO] Unpacking /home/jenkins/jenkins-slave/maven-repositories/1/org/apache/myfaces/tobago/tobago-core/1.6.0-beta-3-SNAPSHOT/tobago-core-1.6.0-beta-3-SNAPSHOT-sources.jar
to <https://builds.apache.org/job/tobago-trunk/ws/tobago-trunk/tobago-extension/tobago-facelets/target/tobago-core-sources>
with includes "org/apache/myfaces/tobago/internal/taglib/declaration/**/*.java,org/apache/myfaces/tobago/internal/taglib/component/**/*.java"
and excludes ""
[INFO] [remote-resources:process {execution: default}]
[debug] execute contextualize
[INFO] [resources:resources {execution: default-resources}]
[INFO] Using 'UTF-8' encoding to copy filtered resources.
[INFO] Copying 24 resources
[INFO] Copying 3 resources
[INFO] [compiler:compile {execution: default-compile}]
[INFO] Compiling 46 source files to <https://builds.apache.org/job/tobago-trunk/ws/tobago-trunk/tobago-extension/tobago-facelets/target/classes>
[debug] execute contextualize
[INFO] [resources:testResources {execution: default-testResources}]
[INFO] Using 'UTF-8' encoding to copy filtered resources.
[INFO] skip non existing resourceDirectory <https://builds.apache.org/job/tobago-trunk/ws/tobago-trunk/tobago-extension/tobago-facelets/src/test/resources>
[INFO] Copying 3 resources
[INFO] [compiler:testCompile {execution: default-testCompile}]
[INFO] No sources to compile
[INFO] [surefire:test {execution: default-test}]
[INFO] Surefire report directory: <https://builds.apache.org/job/tobago-trunk/ws/tobago-trunk/tobago-extension/tobago-facelets/target/surefire-reports>

-------------------------------------------------------
 T E S T S
-------------------------------------------------------

Results :

Tests run: 0, Failures: 0, Errors: 0, Skipped: 0

[JENKINS] Recording test results
[INFO] [jar:jar {execution: default-jar}]
[INFO] Building jar: <https://builds.apache.org/job/tobago-trunk/ws/tobago-trunk/tobago-extension/tobago-facelets/target/tobago-facelets-1.6.0-beta-3-SNAPSHOT.jar>
[INFO] [checkstyle:check {execution: verify-style}]
[INFO] 
[INFO] [install:install {execution: default-install}]
[INFO] Installing <https://builds.apache.org/job/tobago-trunk/ws/tobago-trunk/tobago-extension/tobago-facelets/target/tobago-facelets-1.6.0-beta-3-SNAPSHOT.jar>
to /home/jenkins/jenkins-slave/maven-repositories/1/org/apache/myfaces/tobago/tobago-facelets/1.6.0-beta-3-SNAPSHOT/tobago-facelets-1.6.0-beta-3-SNAPSHOT.jar
[JENKINS] Archiving <https://builds.apache.org/job/tobago-trunk/ws/tobago-trunk/tobago-extension/tobago-facelets/pom.xml>
to /home/hudson/hudson/jobs/tobago-trunk/modules/org.apache.myfaces.tobago$tobago-facelets/builds/2013-02-12_09-07-24/archive/org.apache.myfaces.tobago/tobago-facelets/1.6.0-beta-3-SNAPSHOT/tobago-facelets-1.6.0-beta-3-SNAPSHOT.pom
[JENKINS] Archiving <https://builds.apache.org/job/tobago-trunk/ws/tobago-trunk/tobago-extension/tobago-facelets/target/tobago-facelets-1.6.0-beta-3-SNAPSHOT.jar>
to /home/hudson/hudson/jobs/tobago-trunk/modules/org.apache.myfaces.tobago$tobago-facelets/builds/2013-02-12_09-07-24/archive/org.apache.myfaces.tobago/tobago-facelets/1.6.0-beta-3-SNAPSHOT/tobago-facelets-1.6.0-beta-3-SNAPSHOT.jar
[INFO] ------------------------------------------------------------------------
[INFO] Building Tobago Fileupload
[INFO]    task-segment: [clean, animal-sniffer:check, checkstyle:check, install]
[INFO] ------------------------------------------------------------------------
[INFO] [clean:clean {execution: default-clean}]
[INFO] [animal-sniffer:check {execution: default-cli}]
[INFO] Checking unresolved references to org.codehaus.mojo.signature:java15:1.0
[INFO] [checkstyle:check {execution: default-cli}]
[INFO] 
[INFO] [enforcer:enforce {execution: enforce}]
[INFO] [remote-resources:process {execution: default}]
[debug] execute contextualize
[INFO] [resources:resources {execution: default-resources}]
[INFO] Using 'UTF-8' encoding to copy filtered resources.
[INFO] Copying 1 resource
[INFO] Copying 3 resources
[INFO] [compiler:compile {execution: default-compile}]
[INFO] Compiling 1 source file to <https://builds.apache.org/job/tobago-trunk/ws/tobago-trunk/tobago-extension/tobago-fileupload/target/classes>
[debug] execute contextualize
[INFO] [resources:testResources {execution: default-testResources}]
[INFO] Using 'UTF-8' encoding to copy filtered resources.
[INFO] skip non existing resourceDirectory <https://builds.apache.org/job/tobago-trunk/ws/tobago-trunk/tobago-extension/tobago-fileupload/src/test/resources>
[INFO] Copying 3 resources
[INFO] [compiler:testCompile {execution: default-testCompile}]
[INFO] No sources to compile
[INFO] [surefire:test {execution: default-test}]
[INFO] Surefire report directory: <https://builds.apache.org/job/tobago-trunk/ws/tobago-trunk/tobago-extension/tobago-fileupload/target/surefire-reports>

-------------------------------------------------------
 T E S T S
-------------------------------------------------------

Results :

Tests run: 0, Failures: 0, Errors: 0, Skipped: 0

[JENKINS] Recording test results
[INFO] [jar:jar {execution: default-jar}]
[INFO] Building jar: <https://builds.apache.org/job/tobago-trunk/ws/tobago-trunk/tobago-extension/tobago-fileupload/target/tobago-fileupload-1.6.0-beta-3-SNAPSHOT.jar>
[INFO] [checkstyle:check {execution: verify-style}]
[INFO] 
[INFO] [install:install {execution: default-install}]
[INFO] Installing <https://builds.apache.org/job/tobago-trunk/ws/tobago-trunk/tobago-extension/tobago-fileupload/target/tobago-fileupload-1.6.0-beta-3-SNAPSHOT.jar>
to /home/jenkins/jenkins-slave/maven-repositories/1/org/apache/myfaces/tobago/tobago-fileupload/1.6.0-beta-3-SNAPSHOT/tobago-fileupload-1.6.0-beta-3-SNAPSHOT.jar
[JENKINS] Archiving <https://builds.apache.org/job/tobago-trunk/ws/tobago-trunk/tobago-extension/tobago-fileupload/pom.xml>
to /home/hudson/hudson/jobs/tobago-trunk/modules/org.apache.myfaces.tobago$tobago-fileupload/builds/2013-02-12_09-07-24/archive/org.apache.myfaces.tobago/tobago-fileupload/1.6.0-beta-3-SNAPSHOT/tobago-fileupload-1.6.0-beta-3-SNAPSHOT.pom
[JENKINS] Archiving <https://builds.apache.org/job/tobago-trunk/ws/tobago-trunk/tobago-extension/tobago-fileupload/target/tobago-fileupload-1.6.0-beta-3-SNAPSHOT.jar>
to /home/hudson/hudson/jobs/tobago-trunk/modules/org.apache.myfaces.tobago$tobago-fileupload/builds/2013-02-12_09-07-24/archive/org.apache.myfaces.tobago/tobago-fileupload/1.6.0-beta-3-SNAPSHOT/tobago-fileupload-1.6.0-beta-3-SNAPSHOT.jar
[INFO] ------------------------------------------------------------------------
[INFO] Building Tobago Sandbox
[INFO]    task-segment: [clean, animal-sniffer:check, checkstyle:check, install]
[INFO] ------------------------------------------------------------------------
[INFO] [clean:clean {execution: default-clean}]
[INFO] [animal-sniffer:check {execution: default-cli}]
[INFO] Checking unresolved references to org.codehaus.mojo.signature:java15:1.0
[INFO] [checkstyle:check {execution: default-cli}]
[INFO] 
[INFO] [enforcer:enforce {execution: enforce}]
[INFO] [build-helper:add-source {execution: add-source}]
[INFO] Source directory: <https://builds.apache.org/job/tobago-trunk/ws/tobago-trunk/tobago-extension/tobago-sandbox/target/generated-component>
added.
[INFO] [dependency:unpack {execution: unpack-sources}]
[INFO] Configured Artifact: org.apache.myfaces.tobago:tobago-core:sources:1.6.0-beta-3-SNAPSHOT:jar
[INFO] Unpacking /home/jenkins/jenkins-slave/maven-repositories/1/org/apache/myfaces/tobago/tobago-core/1.6.0-beta-3-SNAPSHOT/tobago-core-1.6.0-beta-3-SNAPSHOT-sources.jar
to <https://builds.apache.org/job/tobago-trunk/ws/tobago-trunk/tobago-extension/tobago-sandbox/target/tobago-core-sources>
with includes "org/apache/myfaces/tobago/internal/taglib/declaration/**/*" and excludes ""
[INFO] [processor:process {execution: process}]
[INFO] Source directory: <https://builds.apache.org/job/tobago-trunk/ws/tobago-trunk/tobago-extension/tobago-sandbox/target/generated>
added
[WARNING] source directory [<https://builds.apache.org/job/tobago-trunk/ws/tobago-trunk/tobago-extension/tobago-sandbox/target/generated-component]>
doesn't exist! Processor task will be skipped!
[INFO] Adding compiler arg: -AjsfVersion=1.2
[INFO] Adding compiler arg: -AsourceFacesConfig=<https://builds.apache.org/job/tobago-trunk/ws/tobago-trunk/tobago-extension/tobago-sandbox/src/main/faces-config/faces-config.xml>
[INFO] Adding compiler arg: -AtargetFacesConfig=META-INF/faces-config.xml
[INFO] Adding compiler arg: -AtargetReference=META-INF
[INFO] Adding compiler arg: -AtargetTld=META-INF
[INFO] javac option: -cp
[INFO] javac option: /home/jenkins/jenkins-slave/maven-repositories/1/org/slf4j/slf4j-jdk14/1.6.6/slf4j-jdk14-1.6.6.jar:/home/jenkins/jenkins-slave/maven-repositories/1/org/slf4j/slf4j-api/1.6.6/slf4j-api-1.6.6.jar:/home/jenkins/jenkins-slave/maven-repositories/1/org/codehaus/plexus/plexus-utils/3.0.1/plexus-utils-3.0.1.jar:/home/jenkins/jenkins-slave/maven-repositories/1/org/apache/maven/plugin-tools/maven-plugin-annotations/3.1/maven-plugin-annotations-3.1.jar:/home/jenkins/tools/maven/apache-maven-2.2.1/lib/maven-2.2.1-uber.jar:<https://builds.apache.org/job/tobago-trunk/ws/tobago-trunk/tobago-extension/tobago-sandbox/src/main/resources>:<https://builds.apache.org/job/tobago-trunk/ws/tobago-trunk/tobago-extension/tobago-sandbox/target/classes>:<https://builds.apache.org/job/tobago-trunk/ws/tobago-trunk/tobago-tool/tobago-tool-apt/target/tobago-tool-apt-1.6.0-beta-3-SNAPSHOT.jar>:/home/jenkins/jenkins-slave/maven-repositories/1/org/apache/myfaces/core/myfaces-api/1.2.12/myfaces-api-1.2.12.jar:/home/jenkins/jenkins-slave/maven-repositories/1/ant/ant/1.6.2/ant-1.6.2.jar:/home/jenkins/jenkins-slave/maven-repositories/1/commons-io/commons-io/1.1/commons-io-1.1.jar:/home/jenkins/jenkins-slave/maven-repositories/1/commons-lang/commons-lang/2.4/commons-lang-2.4.jar:/home/jenkins/jenkins-slave/maven-repositories/1/org/codehaus/modello/modello-plugin-java/1.5/modello-plugin-java-1.5.jar:/home/jenkins/jenkins-slave/maven-repositories/1/org/codehaus/plexus/plexus-utils/1.0.5/plexus-utils-1.0.5.jar:/home/jenkins/jenkins-slave/maven-repositories/1/org/sonatype/plexus/plexus-build-api/0.0.7/plexus-build-api-0.0.7.jar:/home/jenkins/jenkins-slave/maven-repositories/1/org/codehaus/plexus/plexus-container-default/1.0-alpha-30/plexus-container-default-1.0-alpha-30.jar:/home/jenkins/jenkins-slave/maven-repositories/1/org/codehaus/plexus/plexus-classworlds/1.2-alpha-9/plexus-classworlds-1.2-alpha-9.jar:/home/jenkins/jenkins-slave/maven-repositories/1/org/codehaus/modello/modello-core/1.5/modello-core-1.5.jar:/home/jenkins/jenkins-slave/maven-repositories/1/classworlds/classworlds/1.1-alpha-2/classworlds-1.1-alpha-2.jar:/home/jenkins/jenkins-slave/maven-repositories/1/org/antlr/stringtemplate/3.0/stringtemplate-3.0.jar:/home/jenkins/jenkins-slave/maven-repositories/1/antlr/antlr/2.7.7/antlr-2.7.7.jar:/home/jenkins/jenkins-slave/maven-repositories/1/jdom/jdom/1.0/jdom-1.0.jar:/home/jenkins/jenkins-slave/maven-repositories/1/jaxen/jaxen/1.1/jaxen-1.1.jar:/home/jenkins/jenkins-slave/maven-repositories/1/xml-apis/xml-apis/1.0.b2/xml-apis-1.0.b2.jar:/home/jenkins/tools/java/jdk1.6.0_27-32/jre/../lib/tools.jar:<https://builds.apache.org/job/tobago-trunk/ws/tobago-trunk/tobago-tool/tobago-tool-annotation/target/tobago-tool-annotation-1.6.0-beta-3-SNAPSHOT.jar>:<https://builds.apache.org/job/tobago-trunk/ws/tobago-trunk/tobago-theme/tobago-theme-standard/target/tobago-theme-standard-1.6.0-beta-3-SNAPSHOT.jar>:<https://builds.apache.org/job/tobago-trunk/ws/tobago-trunk/tobago-core/target/tobago-core-1.6.0-beta-3-SNAPSHOT.jar>:<https://builds.apache.org/job/tobago-trunk/ws/tobago-trunk/tobago-jsf-compat/target/tobago-jsf-compat-1.6.0-beta-3-SNAPSHOT.jar>:/home/jenkins/jenkins-slave/maven-repositories/1/commons-beanutils/commons-beanutils/1.8.3/commons-beanutils-1.8.3.jar:/home/jenkins/jenkins-slave/maven-repositories/1/commons-collections/commons-collections/3.2.1/commons-collections-3.2.1.jar:/home/jenkins/jenkins-slave/maven-repositories/1/commons-digester/commons-digester/1.8.1/commons-digester-1.8.1.jar:/home/jenkins/jenkins-slave/maven-repositories/1/commons-fileupload/commons-fileupload/1.2.2/commons-fileupload-1.2.2.jar:/home/jenkins/jenkins-slave/maven-repositories/1/commons-codec/commons-codec/1.4/commons-codec-1.4.jar:/home/jenkins/jenkins-slave/maven-repositories/1/com/google/code/gson/gson/2.2.2/gson-2.2.2.jar:<https://builds.apache.org/job/tobago-trunk/ws/tobago-trunk/tobago-extension/tobago-taglib-extension/target/tobago-taglib-extension-1.6.0-beta-3-SNAPSHOT.jar>:/home/jenkins/jenkins-slave/maven-repositories/1/javax/servlet/jsp/jsp-api/2.1/jsp-api-2.1.jar:/home/jenkins/jenkins-slave/maven-repositories/1/javax/servlet/servlet-api/2.5/servlet-api-2.5.jar:/home/jenkins/jenkins-slave/maven-repositories/1/javax/el/el-api/1.0/el-api-1.0.jar:/home/jenkins/jenkins-slave/maven-repositories/1/fop/fop/0.20.5/fop-0.20.5.jar:/home/jenkins/jenkins-slave/maven-repositories/1/batik/batik-1.5-fop/0.20-5/batik-1.5-fop-0.20-5.jar:/home/jenkins/jenkins-slave/maven-repositories/1/xalan/xalan/2.4.1/xalan-2.4.1.jar:/home/jenkins/jenkins-slave/maven-repositories/1/xerces/xercesImpl/2.2.1/xercesImpl-2.2.1.jar:/home/jenkins/jenkins-slave/maven-repositories/1/avalon-framework/avalon-framework/20020627/avalon-framework-20020627.jar:<https://builds.apache.org/job/tobago-trunk/ws/tobago-trunk/tobago-extension/tobago-facelets/target/tobago-facelets-1.6.0-beta-3-SNAPSHOT.jar>:/home/jenkins/jenkins-slave/maven-repositories/1/com/sun/facelets/jsf-facelets/1.1.14/jsf-facelets-1.1.14.jar:/home/jenkins/jenkins-slave/maven-repositories/1/org/slf4j/jcl-over-slf4j/1.6.6/jcl-over-slf4j-1.6.6.jar:
[INFO] javac option: -proc:only
[INFO] javac option: -AjsfVersion=1.2
[INFO] javac option: -AsourceFacesConfig=<https://builds.apache.org/job/tobago-trunk/ws/tobago-trunk/tobago-extension/tobago-sandbox/src/main/faces-config/faces-config.xml>
[INFO] javac option: -AtargetFacesConfig=META-INF/faces-config.xml
[INFO] javac option: -AtargetReference=META-INF
[INFO] javac option: -AtargetTld=META-INF
[INFO] javac option: -processor
[INFO] javac option: org.apache.myfaces.tobago.apt.processor.ClassesGenerator,org.apache.myfaces.tobago.apt.processor.TldGenerator,org.apache.myfaces.tobago.apt.processor.FacesConfigGenerator,org.apache.myfaces.tobago.apt.processor.ReferenceGenerator
[INFO] javac option: -d
[INFO] javac option: <https://builds.apache.org/job/tobago-trunk/ws/tobago-trunk/tobago-extension/tobago-sandbox/target/classes>
[INFO] javac option: -s
[INFO] javac option: <https://builds.apache.org/job/tobago-trunk/ws/tobago-trunk/tobago-extension/tobago-sandbox/target/generated>
[INFO] diagnostic warning: No SupportedSourceVersion annotation found on org.apache.myfaces.tobago.apt.processor.ClassesGenerator,
returning RELEASE_6.
[INFO] diagnostic Note: Generating the classes *Tag, *Component, *Renderer
[INFO] diagnostic Note: Options:
[INFO] diagnostic Note: jsfVersion: 1.2
[INFO] diagnostic Note: tagVersion: 1.2
redefinition of template: TextAlignProperty
[INFO] diagnostic Note: Writing to file: <https://builds.apache.org/job/tobago-trunk/ws/tobago-trunk/tobago-extension/tobago-sandbox/target/generated/org/apache/myfaces/tobago/renderkit/NumberSliderRenderer.java>
[INFO] diagnostic Note: Writing to file: <https://builds.apache.org/job/tobago-trunk/ws/tobago-trunk/tobago-extension/tobago-sandbox/target/generated/org/apache/myfaces/tobago/internal/taglib/NumberSliderTag.java>
[INFO] diagnostic Note: Writing to file: <https://builds.apache.org/job/tobago-trunk/ws/tobago-trunk/tobago-extension/tobago-sandbox/target/generated/org/apache/myfaces/tobago/component/UINumberSlider.java>
[INFO] diagnostic warning: No SupportedSourceVersion annotation found on org.apache.myfaces.tobago.apt.processor.TldGenerator,
returning RELEASE_6.
[INFO] diagnostic Note: Generating the *.tld
[INFO] diagnostic Note: Options:
[INFO] diagnostic Note: jsfVersion: 1.2
[INFO] diagnostic Note: targetTld: META-INF
[INFO] diagnostic Note: Replacing: org.apache.myfaces.tobago.internal.taglib.sandbox.NumberSliderTagDeclaration
-> org.apache.myfaces.tobago.internal.taglib.NumberSliderTag
[INFO] diagnostic Note: Writing to file: <https://builds.apache.org/job/tobago-trunk/ws/tobago-trunk/tobago-extension/tobago-sandbox/target/generated/META-INF/org/apache/myfaces/tobago/internal/taglib/sandbox/tobago-sandbox.tld>
[INFO] diagnostic warning: No SupportedSourceVersion annotation found on org.apache.myfaces.tobago.apt.processor.FacesConfigGenerator,
returning RELEASE_6.
[INFO] diagnostic Note: Generating the faces-config.xml
[INFO] diagnostic Note: Options:
[INFO] diagnostic Note: sourceFacesConfig: <https://builds.apache.org/job/tobago-trunk/ws/tobago-trunk/tobago-extension/tobago-sandbox/src/main/faces-config/faces-config.xml>
[INFO] diagnostic Note: targetFacesConfig: META-INF/faces-config.xml
[INFO] diagnostic Note: jsfVersion: 1.2
[INFO] diagnostic Note: Writing to file: <https://builds.apache.org/job/tobago-trunk/ws/tobago-trunk/tobago-extension/tobago-sandbox/target/generated/META-INF/faces-config.xml>
[INFO] diagnostic warning: No SupportedSourceVersion annotation found on org.apache.myfaces.tobago.apt.processor.ReferenceGenerator,
returning RELEASE_6.
[INFO] diagnostic Note: Generating the faces-config.xml
[INFO] diagnostic Note: Options:
[INFO] diagnostic Note: targetReference: META-INF
[INFO] diagnostic Note: Replacing: org.apache.myfaces.tobago.internal.taglib.sandbox.NumberSliderTagDeclaration
-> org.apache.myfaces.tobago.internal.taglib.NumberSliderTag
[INFO] diagnostic Note: Writing to file: <https://builds.apache.org/job/tobago-trunk/ws/tobago-trunk/tobago-extension/tobago-sandbox/target/generated/META-INF/org/apache/myfaces/tobago/internal/taglib/sandbox/tobago-sandbox.xml>
[INFO] [remote-resources:process {execution: default}]
[debug] execute contextualize
[INFO] [resources:resources {execution: default-resources}]
[INFO] Using 'UTF-8' encoding to copy filtered resources.
[INFO] Copying 10 resources
[INFO] Copying 3 resources
[INFO] [compiler:compile {execution: default-compile}]
[INFO] Compiling 14 source files to <https://builds.apache.org/job/tobago-trunk/ws/tobago-trunk/tobago-extension/tobago-sandbox/target/classes>
[INFO] -------------------------------------------------------------
[ERROR] COMPILATION ERROR : 
[INFO] -------------------------------------------------------------
[ERROR] <https://builds.apache.org/job/tobago-trunk/ws/tobago-trunk/tobago-extension/tobago-sandbox/target/generated/org/apache/myfaces/tobago/component/UINumberSlider.java>:[42,7]
org.apache.myfaces.tobago.component.UINumberSlider is not abstract and does not override abstract
method isDisabled() in org.apache.myfaces.tobago.component.AbstractUINumberSlider
[INFO] 1 error
[INFO] -------------------------------------------------------------
[JENKINS] Archiving <https://builds.apache.org/job/tobago-trunk/ws/tobago-trunk/tobago-extension/tobago-sandbox/pom.xml>
to /home/hudson/hudson/jobs/tobago-trunk/modules/org.apache.myfaces.tobago$tobago-sandbox/builds/2013-02-12_09-07-24/archive/org.apache.myfaces.tobago/tobago-sandbox/1.6.0-beta-3-SNAPSHOT/tobago-sandbox-1.6.0-beta-3-SNAPSHOT.pom
[INFO] ------------------------------------------------------------------------
[ERROR] BUILD FAILURE
[INFO] ------------------------------------------------------------------------
[INFO] Compilation failure
<https://builds.apache.org/job/tobago-trunk/ws/tobago-trunk/tobago-extension/tobago-sandbox/target/generated/org/apache/myfaces/tobago/component/UINumberSlider.java>:[42,7]
org.apache.myfaces.tobago.component.UINumberSlider is not abstract and does not override abstract
method isDisabled() in org.apache.myfaces.tobago.component.AbstractUINumberSlider

[INFO] ------------------------------------------------------------------------
[INFO] For more information, run Maven with the -e switch
[INFO] ------------------------------------------------------------------------
[INFO] Total time: 5 minutes 33 seconds
[INFO] Finished at: Tue Feb 12 09:13:31 UTC 2013
[INFO] Final Memory: 139M/518M
[INFO] ------------------------------------------------------------------------
Sending e-mails to: commits@myfaces.apache.org
channel stopped
Updating TOBAGO-1212

Mime
View raw message