myfaces-commits mailing list archives

Site index · List index
Message view « Date » · « Thread »
Top « Date » · « Thread »
From Apache Jenkins Server <jenk...@builds.apache.org>
Subject Build failed in Jenkins: myfaces-current-2.0 #1923
Date Wed, 12 Jun 2013 13:36:43 GMT
See <https://builds.apache.org/job/myfaces-current-2.0/1923/>

------------------------------------------
[...truncated 3937 lines...]
  Found PropertyDescriptor java.beans.PropertyDescriptor@2b820150descriptor(class=org.apache.myfaces.view.facelets.bean.Department,
name=name
  Found BeanInfo java.beans.GenericBeanInfo@10aeb17
  Found PropertyDescriptor java.beans.PropertyDescriptor@f731ca5bdescriptor(class=org.apache.myfaces.view.facelets.bean.Department,
name=name
  Found BeanInfo java.beans.GenericBeanInfo@10aeb17
Tests run: 1, Failures: 0, Errors: 0, Skipped: 0, Time elapsed: 0.129 sec
Running org.apache.myfaces.view.facelets.tag.composite.CompositeComponentMethodExpressionTestCase
Tests run: 14, Failures: 0, Errors: 0, Skipped: 0, Time elapsed: 1.839 sec
Running org.apache.myfaces.view.facelets.TagTestCase
Tests run: 2, Failures: 0, Errors: 0, Skipped: 0, Time elapsed: 0.162 sec
Running org.apache.myfaces.view.facelets.tag.composite.CompositeComponentAttributeTestCase
  Found PropertyDescriptor java.beans.PropertyDescriptor@f731ca5bdescriptor(class=org.apache.myfaces.view.facelets.tag.composite.MockAttributeBean,
name=styleClass
  Found BeanInfo java.beans.GenericBeanInfo@1ac05bc
  Found PropertyDescriptor java.beans.PropertyDescriptor@df47bd88descriptor(class=org.apache.myfaces.view.facelets.tag.composite.MockAttributeBean,
name=style
  Found BeanInfo java.beans.GenericBeanInfo@1ac05bc
  Found PropertyDescriptor java.beans.PropertyDescriptor@b7a0ccf6descriptor(class=org.apache.myfaces.view.facelets.tag.composite.CompositeTestComponent,
name=javaProperty
  Found BeanInfo java.beans.GenericBeanInfo@acacc3
  Found PropertyDescriptor java.beans.PropertyDescriptor@7c8df235descriptor(class=org.apache.myfaces.view.facelets.tag.composite.MockAttributeBean,
name=javaProperty
  Found BeanInfo java.beans.GenericBeanInfo@1ac05bc
  Found PropertyDescriptor java.beans.PropertyDescriptor@8fa512d8descriptor(class=org.apache.myfaces.view.facelets.tag.composite.CompositeTestComponent,
name=javaProperty
  Found BeanInfo java.beans.GenericBeanInfo@acacc3
  Found PropertyDescriptor java.beans.PropertyDescriptor@7c8df235descriptor(class=org.apache.myfaces.view.facelets.tag.composite.MockAttributeBean,
name=javaProperty
  Found BeanInfo java.beans.GenericBeanInfo@1ac05bc
  Found PropertyDescriptor java.beans.PropertyDescriptor@8fa512d8descriptor(class=org.apache.myfaces.view.facelets.tag.composite.MockAttributeBean,
name=style
  Found BeanInfo java.beans.GenericBeanInfo@1ac05bc
  Found PropertyDescriptor java.beans.PropertyDescriptor@b7a0ccf6descriptor(class=org.apache.myfaces.view.facelets.tag.composite.MockAttributeBean,
name=styleClass
  Found BeanInfo java.beans.GenericBeanInfo@1ac05bc
  Found PropertyDescriptor java.beans.PropertyDescriptor@df47bd88descriptor(class=org.apache.myfaces.view.facelets.tag.composite.MockAttributeBean,
name=styleClass
  Found BeanInfo java.beans.GenericBeanInfo@1ac05bc
  Found PropertyDescriptor java.beans.PropertyDescriptor@df47bd88descriptor(class=org.apache.myfaces.view.facelets.tag.composite.MockAttributeBean,
name=style
  Found BeanInfo java.beans.GenericBeanInfo@1ac05bc
  Found PropertyDescriptor java.beans.PropertyDescriptor@b7a0ccf6descriptor(class=org.apache.myfaces.view.facelets.tag.composite.CompositeTestComponent,
name=javaProperty
  Found BeanInfo java.beans.GenericBeanInfo@acacc3
  Found PropertyDescriptor java.beans.PropertyDescriptor@7c8df235descriptor(class=org.apache.myfaces.view.facelets.tag.composite.MockAttributeBean,
name=javaProperty
  Found BeanInfo java.beans.GenericBeanInfo@1ac05bc
  Found PropertyDescriptor java.beans.PropertyDescriptor@8fa512d8descriptor(class=org.apache.myfaces.view.facelets.tag.composite.CompositeTestComponent,
name=javaProperty
  Found BeanInfo java.beans.GenericBeanInfo@acacc3
  Found PropertyDescriptor java.beans.PropertyDescriptor@7c8df235descriptor(class=org.apache.myfaces.view.facelets.tag.composite.MockAttributeBean,
name=javaProperty
  Found BeanInfo java.beans.GenericBeanInfo@1ac05bc
  Found PropertyDescriptor java.beans.PropertyDescriptor@8fa512d8descriptor(class=org.apache.myfaces.view.facelets.tag.composite.MockAttributeBean,
name=style
  Found BeanInfo java.beans.GenericBeanInfo@1ac05bc
  Found PropertyDescriptor java.beans.PropertyDescriptor@b7a0ccf6descriptor(class=org.apache.myfaces.view.facelets.tag.composite.MockAttributeBean,
name=styleClass
  Found BeanInfo java.beans.GenericBeanInfo@1ac05bc
actionListener
validate
valueChange
Tests run: 7, Failures: 0, Errors: 0, Skipped: 0, Time elapsed: 0.864 sec
Running org.apache.myfaces.renderkit.html.behavior.HtmlCommandButtonClientBehaviorRendererTest
Tests run: 3, Failures: 0, Errors: 0, Skipped: 0, Time elapsed: 0.067 sec
Running org.apache.myfaces.view.facelets.tag.ui.template.IncludeTestCase
Tests run: 1, Failures: 0, Errors: 0, Skipped: 0, Time elapsed: 0.099 sec
Running org.apache.myfaces.renderkit.html.behavior.HtmlOutputLinkClientBehaviorRendererTest
Tests run: 3, Failures: 0, Errors: 0, Skipped: 0, Time elapsed: 0.099 sec
Running org.apache.myfaces.renderkit.html.HtmlFormRendererTest
Tests run: 3, Failures: 0, Errors: 0, Skipped: 0, Time elapsed: 0.003 sec
Running org.apache.myfaces.application.StateManagerImplTest
No state saving method defined, assuming default server state saving
Tests run: 2, Failures: 0, Errors: 0, Skipped: 0, Time elapsed: 0.007 sec
Running org.apache.myfaces.renderkit.html.HtmlCheckboxRendererTest
Tests run: 4, Failures: 0, Errors: 0, Skipped: 0, Time elapsed: 0.004 sec
Running org.apache.myfaces.application.viewstate.ClientSideStateCacheTest
Tests run: 3, Failures: 0, Errors: 0, Skipped: 0, Time elapsed: 0.003 sec
Running org.apache.myfaces.view.jsp.JspViewDeclarationLanguageTest
Tests run: 3, Failures: 0, Errors: 0, Skipped: 0, Time elapsed: 0.269 sec
Running org.apache.myfaces.view.facelets.compiler.WhitespaceTestCase
  Found PropertyDescriptor java.beans.PropertyDescriptor@df47bd88descriptor(class=org.apache.myfaces.view.facelets.compiler.WhitespaceTestCase,
name=target
  Found BeanInfo java.beans.GenericBeanInfo@1c29cb8
  Found PropertyDescriptor java.beans.PropertyDescriptor@a751f70descriptor(class=org.apache.myfaces.view.facelets.compiler.WhitespaceTestCase,
name=target
  Found BeanInfo java.beans.GenericBeanInfo@1c29cb8
  Found PropertyDescriptor java.beans.PropertyDescriptor@a751f70descriptor(class=org.apache.myfaces.view.facelets.compiler.WhitespaceTestCase,
name=target
  Found BeanInfo java.beans.GenericBeanInfo@1c29cb8
  Found PropertyDescriptor java.beans.PropertyDescriptor@a751f70descriptor(class=org.apache.myfaces.view.facelets.compiler.WhitespaceTestCase,
name=target
  Found BeanInfo java.beans.GenericBeanInfo@1c29cb8
  Found PropertyDescriptor java.beans.PropertyDescriptor@a751f70Jun 12, 2013 1:25:19 PM org.apache.myfaces.shared.renderkit.html.HtmlGridRendererBase
renderChildren
WARNING: PanelGrid {Component-Path : [Class: javax.faces.component.UIViewRoot,ViewId: panelGrid.xml][Class:
javax.faces.component.html.HtmlPanelGrid,Id: j_id_1]} has not enough children. Child count
should be a multiple of the columns attribute.
Tests run: 2, Failures: 0, Errors: 0, Skipped: 0, Time elapsed: 0.254 sec
Running org.apache.myfaces.context.ExecutePhaseClientIdsTest
Tests run: 4, Failures: 0, Errors: 0, Skipped: 0, Time elapsed: 0.003 sec
Running org.apache.myfaces.el.unified.resolver.GuiceResolverTestCase
Tests run: 1, Failures: 0, Errors: 0, Skipped: 0, Time elapsed: 0.445 sec
Running org.apache.myfaces.el.convert.ValueExpressionToValueBindingTest
Tests run: 12, Failures: 0, Errors: 0, Skipped: 0, Time elapsed: 0.04 sec
Running org.apache.myfaces.renderkit.html.behavior.HtmlGraphicImageClientBehaviorRendererTest
Tests run: 3, Failures: 0, Errors: 0, Skipped: 0, Time elapsed: 0.045 sec
Running org.apache.myfaces.context.servlet.ServletExternalContextImplTest
Tests run: 3, Failures: 0, Errors: 0, Skipped: 0, Time elapsed: 0.003 sec

Results :

Tests run: 689, Failures: 0, Errors: 0, Skipped: 0

[JENKINS] Recording test results
[INFO] [surefire:test {execution: isolateCLTests}]
[INFO] Surefire report directory: <https://builds.apache.org/job/myfaces-current-2.0/ws/current20/core/impl/target/surefire-reports>

-------------------------------------------------------
 T E S T S
-------------------------------------------------------
Running org.apache.myfaces.spi.FactoryFinderProviderTest
Tests run: 1, Failures: 0, Errors: 0, Skipped: 0, Time elapsed: 1.698 sec

Results :

Tests run: 1, Failures: 0, Errors: 0, Skipped: 0

[JENKINS] Recording test results
[INFO] [jar:jar {execution: default-jar}]
[INFO] Building jar: <https://builds.apache.org/job/myfaces-current-2.0/ws/current20/core/impl/target/myfaces-impl-2.0.19-SNAPSHOT.jar>
[INFO] Preparing source:jar
[WARNING] Removing: jar from forked lifecycle, to prevent recursive invocation.
[JENKINS] Archiving <https://builds.apache.org/job/myfaces-current-2.0/ws/current20/core/impl/pom.xml>
to /home/hudson/hudson/jobs/myfaces-current-2.0/modules/org.apache.myfaces.core$myfaces-impl/builds/2013-06-12_12-54-12/archive/org.apache.myfaces.core/myfaces-impl/2.0.19-SNAPSHOT/myfaces-impl-2.0.19-SNAPSHOT.pom
[JENKINS] Archiving <https://builds.apache.org/job/myfaces-current-2.0/ws/current20/core/impl/target/myfaces-impl-2.0.19-SNAPSHOT.jar>
to /home/hudson/hudson/jobs/myfaces-current-2.0/modules/org.apache.myfaces.core$myfaces-impl/builds/2013-06-12_12-54-12/archive/org.apache.myfaces.core/myfaces-impl/2.0.19-SNAPSHOT/myfaces-impl-2.0.19-SNAPSHOT.jar
[INFO] [myfaces-builder:build-metadata {execution: makemyfacesmetadata}]
[INFO] model is up to date
[INFO] [myfaces-builder:make-config {execution: makeWebConfigParamsLogger}]
[INFO] generated file WebConfigParamsLogger.java is up to date
[INFO] [myfaces-builder:make-config {execution: makefacesconfig}]
[INFO] generated file standard-faces-config.xml is up to date
[INFO] [myfaces-builder:make-tags {execution: make_tags}]
[INFO] generated component tag files are up to date
[INFO] [myfaces-builder:make-config {execution: makecoretld}]
[INFO] generated file myfaces_core.tld is up to date
[INFO] [myfaces-builder:make-config {execution: makehtmltld}]
[INFO] generated file myfaces_html.tld is up to date
[INFO] [myfaces-builder:make-config {execution: make_core_facelet_tld}]
[INFO] generated file myfaces_facelets_core.tld is up to date
[INFO] [myfaces-builder:make-config {execution: make_html_facelet_tld}]
[INFO] generated file myfaces_facelets_html.tld is up to date
[INFO] [myfaces-builder:make-config {execution: make_c_facelet_tld}]
[INFO] generated file myfaces_facelets_c.tld is up to date
[INFO] [myfaces-builder:make-config {execution: make_ui_facelet_tld}]
[INFO] generated file myfaces_facelets_ui.tld is up to date
[INFO] [myfaces-builder:make-config {execution: make_composite_facelet_tld}]
[INFO] generated file myfaces_facelets_composite.tld is up to date
[INFO] [myfaces-builder:make-config {execution: make_fn_facelet_tld}]
[INFO] generated file myfaces_facelet_fn.tld is up to date
[INFO] [source:jar {execution: attach-source}]
[INFO] Building jar: <https://builds.apache.org/job/myfaces-current-2.0/ws/current20/core/impl/target/myfaces-impl-2.0.19-SNAPSHOT-sources.jar>
[INFO] [jar:test-jar {execution: default}]
[INFO] Building jar: <https://builds.apache.org/job/myfaces-current-2.0/ws/current20/core/impl/target/myfaces-impl-2.0.19-SNAPSHOT-tests.jar>
[INFO] [shade:shade {execution: default}]
[INFO] Excluding org.apache.myfaces.core:myfaces-api:jar:2.0.19-SNAPSHOT from the shaded jar.
[INFO] Excluding org.apache.myfaces.core.internal:myfaces-impl-shared-public:jar:2.0.19-SNAPSHOT
from the shaded jar.
[INFO] Excluding commons-codec:commons-codec:jar:1.3 from the shaded jar.
[INFO] Including org.apache.myfaces.core.internal:myfaces-impl-shared:jar:2.0.19-SNAPSHOT
in the shaded jar.
[INFO] snapshot org.apache.myfaces.core.internal:myfaces-impl-shared:2.0.19-SNAPSHOT: checking
for updates from tomcat
[INFO] snapshot org.apache.myfaces.core.internal:myfaces-impl-shared:2.0.19-SNAPSHOT: checking
for updates from apache.snapshots
[INFO] Including org.apache.myfaces.core.internal:myfaces-impl-ee6:jar:2.0.19-SNAPSHOT in
the shaded jar.
[INFO] snapshot org.apache.myfaces.core.internal:myfaces-impl-ee6:2.0.19-SNAPSHOT: checking
for updates from tomcat
[INFO] snapshot org.apache.myfaces.core.internal:myfaces-impl-ee6:2.0.19-SNAPSHOT: checking
for updates from apache.snapshots
[INFO] Excluding org.apache.geronimo.specs:geronimo-validation_1.0_spec:jar:1.1 from the shaded
jar.
[INFO] Excluding org.apache.geronimo.specs:geronimo-jpa_3.0_spec:jar:1.1.1 from the shaded
jar.
[INFO] Excluding org.apache.geronimo.specs:geronimo-ejb_3.0_spec:jar:1.0.1 from the shaded
jar.
[INFO] Excluding commons-collections:commons-collections:jar:3.2 from the shaded jar.
[INFO] Excluding commons-beanutils:commons-beanutils:jar:1.8.3 from the shaded jar.
[INFO] Excluding commons-logging:commons-logging:jar:1.1.1 from the shaded jar.
[INFO] Excluding commons-digester:commons-digester:jar:1.8 from the shaded jar.
[INFO] Excluding org.apache.tomcat:catalina:jar:6.0.29 from the shaded jar.
[INFO] Excluding org.apache.tomcat:servlet-api:jar:6.0.29 from the shaded jar.
[INFO] Excluding org.apache.tomcat:juli:jar:6.0.29 from the shaded jar.
[INFO] Excluding org.apache.tomcat:annotations-api:jar:6.0.29 from the shaded jar.
[INFO] Excluding org.apache.tomcat:tomcat-catalina:jar:7.0.0 from the shaded jar.
[INFO] Excluding org.apache.tomcat:tomcat-servlet-api:jar:7.0.0 from the shaded jar.
[INFO] Excluding org.apache.tomcat:tomcat-juli:jar:7.0.0 from the shaded jar.
[INFO] Excluding org.apache.tomcat:tomcat-annotations-api:jar:7.0.0 from the shaded jar.
[INFO] Excluding org.apache.tomcat:tomcat-api:jar:7.0.0 from the shaded jar.
[INFO] Excluding org.apache.tomcat:tomcat-util:jar:7.0.0 from the shaded jar.
[INFO] Excluding com.google.code.guice:guice:jar:1.0 from the shaded jar.
[INFO] Replacing original artifact with shaded artifact.
[INFO] Replacing <https://builds.apache.org/job/myfaces-current-2.0/ws/current20/core/impl/target/myfaces-impl-2.0.19-SNAPSHOT.jar>
with <https://builds.apache.org/job/myfaces-current-2.0/ws/current20/core/impl/target/myfaces-impl-2.0.19-SNAPSHOT-shaded.jar>
[INFO] Replacing <https://builds.apache.org/job/myfaces-current-2.0/ws/current20/core/impl/target/myfaces-impl-2.0.19-SNAPSHOT-sources.jar>
with <https://builds.apache.org/job/myfaces-current-2.0/ws/current20/core/impl/target/myfaces-impl-2.0.19-SNAPSHOT-shaded-sources.jar>
[INFO] [checkstyle:check {execution: verify-style}]
[INFO] 
[INFO] [install:install {execution: default-install}]
[INFO] Installing <https://builds.apache.org/job/myfaces-current-2.0/ws/current20/core/impl/target/myfaces-impl-2.0.19-SNAPSHOT.jar>
to /export/home/hudson/hudson-slave/maven-repositories/1/org/apache/myfaces/core/myfaces-impl/2.0.19-SNAPSHOT/myfaces-impl-2.0.19-SNAPSHOT.jar
[INFO] Installing <https://builds.apache.org/job/myfaces-current-2.0/ws/current20/core/impl/target/myfaces-impl-2.0.19-SNAPSHOT-sources.jar>
to /export/home/hudson/hudson-slave/maven-repositories/1/org/apache/myfaces/core/myfaces-impl/2.0.19-SNAPSHOT/myfaces-impl-2.0.19-SNAPSHOT-sources.jar
[INFO] Installing <https://builds.apache.org/job/myfaces-current-2.0/ws/current20/core/impl/target/myfaces-impl-2.0.19-SNAPSHOT-tests.jar>
to /export/home/hudson/hudson-slave/maven-repositories/1/org/apache/myfaces/core/myfaces-impl/2.0.19-SNAPSHOT/myfaces-impl-2.0.19-SNAPSHOT-tests.jar
[INFO] Installing <https://builds.apache.org/job/myfaces-current-2.0/ws/current20/core/impl/target/myfaces-impl-2.0.19-SNAPSHOT-sources.jar>
to /export/home/hudson/hudson-slave/maven-repositories/1/org/apache/myfaces/core/myfaces-impl/2.0.19-SNAPSHOT/myfaces-impl-2.0.19-SNAPSHOT-sources.jar
[INFO] [deploy:deploy {execution: default-deploy}]
[INFO] Retrieving previous build number from apache.snapshots.https
[WARNING] *** CHECKSUM FAILED - Checksum failed on download: local = '313e1a4fcd02e61113472eee293b33c3814859cf';
remote = '9831af48b98f875d71bab308d936e0a24d216465' - RETRYING
[WARNING] *** CHECKSUM FAILED - Checksum failed on download: local = '313e1a4fcd02e61113472eee293b33c3814859cf';
remote = '9831af48b98f875d71bab308d936e0a24d216465' - IGNORING
Uploading: https://repository.apache.org/content/repositories/snapshots/org/apache/myfaces/core/myfaces-impl/2.0.19-SNAPSHOT/myfaces-impl-2.0.19-20130612.130006-16.jar
1907K uploaded  (myfaces-impl-2.0.19-20130612.130006-16.jar)
[INFO] Uploading project information for myfaces-impl 2.0.19-20130612.130006-16
[INFO] Retrieving previous metadata from apache.snapshots.https
[INFO] Uploading repository metadata for: 'artifact org.apache.myfaces.core:myfaces-impl'
[INFO] Retrieving previous metadata from apache.snapshots.https
[WARNING] *** CHECKSUM FAILED - Checksum failed on download: local = '313e1a4fcd02e61113472eee293b33c3814859cf';
remote = '9831af48b98f875d71bab308d936e0a24d216465' - RETRYING
[WARNING] *** CHECKSUM FAILED - Checksum failed on download: local = '313e1a4fcd02e61113472eee293b33c3814859cf';
remote = '9831af48b98f875d71bab308d936e0a24d216465' - IGNORING
[INFO] Uploading repository metadata for: 'snapshot org.apache.myfaces.core:myfaces-impl:2.0.19-SNAPSHOT'
[INFO] Retrieving previous build number from apache.snapshots.https
Uploading: https://repository.apache.org/content/repositories/snapshots/org/apache/myfaces/core/myfaces-impl/2.0.19-SNAPSHOT/myfaces-impl-2.0.19-20130612.130006-16-sources.jar
1720K uploaded  (myfaces-impl-2.0.19-20130612.130006-16-sources.jar)
[INFO] Retrieving previous build number from apache.snapshots.https
Uploading: https://repository.apache.org/content/repositories/snapshots/org/apache/myfaces/core/myfaces-impl/2.0.19-SNAPSHOT/myfaces-impl-2.0.19-20130612.130006-16-tests.jar
946K uploaded  (myfaces-impl-2.0.19-20130612.130006-16-tests.jar)
[INFO] Retrieving previous build number from apache.snapshots.https
Uploading: https://repository.apache.org/content/repositories/snapshots/org/apache/myfaces/core/myfaces-impl/2.0.19-SNAPSHOT/myfaces-impl-2.0.19-20130612.130006-16-sources.jar
1720K uploaded  (myfaces-impl-2.0.19-20130612.130006-16-sources.jar)
[JENKINS] Archiving <https://builds.apache.org/job/myfaces-current-2.0/ws/current20/core/impl/target/myfaces-impl-2.0.19-SNAPSHOT.jar>
to /home/hudson/hudson/jobs/myfaces-current-2.0/modules/org.apache.myfaces.core$myfaces-impl/builds/2013-06-12_12-54-12/archive/org.apache.myfaces.core/myfaces-impl/2.0.19-20130612.130006-16/myfaces-impl-2.0.19-20130612.130006-16.jar
[JENKINS] Archiving <https://builds.apache.org/job/myfaces-current-2.0/ws/current20/core/impl/target/myfaces-impl-2.0.19-SNAPSHOT-sources.jar>
to /home/hudson/hudson/jobs/myfaces-current-2.0/modules/org.apache.myfaces.core$myfaces-impl/builds/2013-06-12_12-54-12/archive/org.apache.myfaces.core/myfaces-impl/2.0.19-20130612.130006-16/myfaces-impl-2.0.19-20130612.130006-16-sources.jar
[JENKINS] Archiving <https://builds.apache.org/job/myfaces-current-2.0/ws/current20/core/impl/target/myfaces-impl-2.0.19-SNAPSHOT-tests.jar>
to /home/hudson/hudson/jobs/myfaces-current-2.0/modules/org.apache.myfaces.core$myfaces-impl/builds/2013-06-12_12-54-12/archive/org.apache.myfaces.core/myfaces-impl/2.0.19-20130612.130006-16/myfaces-impl-2.0.19-20130612.130006-16-tests.jar
[INFO] ------------------------------------------------------------------------
[INFO] Building Apache MyFaces JSF-2.0 Core OSGi Bundle
[INFO]    task-segment: [clean, deploy]
[INFO] ------------------------------------------------------------------------
[INFO] [clean:clean {execution: default-clean}]
[INFO] Deleting <https://builds.apache.org/job/myfaces-current-2.0/ws/current20/core/bundle/target>
[INFO] [remote-resources:process {execution: default}]
[debug] execute contextualize
[INFO] [resources:resources {execution: default-resources}]
[INFO] Using 'UTF-8' encoding to copy filtered resources.
[INFO] skip non existing resourceDirectory <https://builds.apache.org/job/myfaces-current-2.0/ws/current20/core/bundle/src/main/resources>
[INFO] Copying 3 resources
[INFO] [compiler:compile {execution: default-compile}]
[INFO] No sources to compile
[debug] execute contextualize
[INFO] [resources:testResources {execution: default-testResources}]
[INFO] Using 'UTF-8' encoding to copy filtered resources.
[INFO] skip non existing resourceDirectory <https://builds.apache.org/job/myfaces-current-2.0/ws/current20/core/bundle/src/test/resources>
[INFO] Copying 3 resources
[INFO] [compiler:testCompile {execution: default-testCompile}]
[INFO] No sources to compile
[INFO] [surefire:test {execution: default-test}]
[INFO] Surefire report directory: <https://builds.apache.org/job/myfaces-current-2.0/ws/current20/core/bundle/target/surefire-reports>

-------------------------------------------------------
 T E S T S
-------------------------------------------------------

Results :

Tests run: 0, Failures: 0, Errors: 0, Skipped: 0

[JENKINS] Recording test results
[JENKINS] Archiving <https://builds.apache.org/job/myfaces-current-2.0/ws/current20/core/bundle/pom.xml>
to /home/hudson/hudson/jobs/myfaces-current-2.0/modules/org.apache.myfaces.core$myfaces-bundle/builds/2013-06-12_12-54-13/archive/org.apache.myfaces.core/myfaces-bundle/2.0.19-SNAPSHOT/myfaces-bundle-2.0.19-SNAPSHOT.pom
[INFO] ------------------------------------------------------------------------
[ERROR] BUILD ERROR
[INFO] ------------------------------------------------------------------------
[INFO] Error while executing forked tests.; nested exception is java.io.IOException: Cannot
run program "/bin/sh" (in directory "<https://builds.apache.org/job/myfaces-current-2.0/ws/current20/core/bundle")>:
error=12, Not enough space

[INFO] ------------------------------------------------------------------------
[INFO] For more information, run Maven with the -e switch
[INFO] ------------------------------------------------------------------------
[INFO] Total time: 37 minutes 41 seconds
[INFO] Finished at: Wed Jun 12 13:36:08 GMT+00:00 2013
[INFO] Final Memory: 149M/470M
[INFO] ------------------------------------------------------------------------
channel stopped

Mime
View raw message