myfaces-commits mailing list archives

Site index · List index
Message view « Date » · « Thread »
Top « Date » · « Thread »
From Apache Jenkins Server <jenk...@builds.apache.org>
Subject Build failed in Jenkins: ExtVal for JSF 1.2 (nightly) #185
Date Sun, 09 Jun 2013 00:08:52 GMT
See <https://builds.apache.org/job/ExtVal%20for%20JSF%201.2%20(nightly)/185/>

------------------------------------------
[...truncated 594 lines...]
[INFO] Packaging webapp
[INFO] Assembling webapp[examples-hello_bean-validation] in [<https://builds.apache.org/job/ExtVal%20for%20JSF%201.2%20(nightly)/ws/trunk/examples/hello_bean-validation/target/examples-hello_bean-validation-1.2.7-SNAPSHOT]>
[INFO] Processing war project
[INFO] Copying webapp resources[<https://builds.apache.org/job/ExtVal%20for%20JSF%201.2%20(nightly)/ws/trunk/examples/hello_bean-validation/src/main/webapp]>
[INFO] Webapp assembled in[81 msecs]
[INFO] Building war: <https://builds.apache.org/job/ExtVal%20for%20JSF%201.2%20(nightly)/ws/trunk/examples/hello_bean-validation/target/examples-hello_bean-validation-1.2.7-SNAPSHOT.war>
[INFO] Preparing source:jar
[JENKINS] Archiving <https://builds.apache.org/job/ExtVal%20for%20JSF%201.2%20(nightly)/ws/trunk/examples/hello_bean-validation/pom.xml>
to /home/hudson/hudson/jobs/ExtVal for JSF 1.2 (nightly)/modules/org.apache.myfaces.extensions.validator.examples$examples-hello_bean-validation/builds/2013-06-09_00-04-49/archive/org.apache.myfaces.extensions.validator.examples/examples-hello_bean-validation/1.2.7-SNAPSHOT/examples-hello_bean-validation-1.2.7-SNAPSHOT.pom[WARNING]
Removing: jar from forked lifecycle, to prevent recursive invocation.

[WARNING] DEPRECATED [tasks]: Use target instead
[JENKINS] Archiving <https://builds.apache.org/job/ExtVal%20for%20JSF%201.2%20(nightly)/ws/trunk/examples/hello_bean-validation/target/examples-hello_bean-validation-1.2.7-SNAPSHOT.war>
to /home/hudson/hudson/jobs/ExtVal for JSF 1.2 (nightly)/modules/org.apache.myfaces.extensions.validator.examples$examples-hello_bean-validation/builds/2013-06-09_00-04-49/archive/org.apache.myfaces.extensions.validator.examples/examples-hello_bean-validation/1.2.7-SNAPSHOT/examples-hello_bean-validation-1.2.7-SNAPSHOT.war
[INFO] [antrun:run {execution: javadoc.resources}]
[WARNING] Parameter tasks is deprecated, use target instead
[INFO] Executing tasks

main:
[INFO] Executed tasks
[INFO] [source:jar {execution: attach-sources}]
[INFO] META-INF already added, skipping
[INFO] META-INF/LICENSE already added, skipping
[INFO] META-INF/NOTICE already added, skipping
[INFO] META-INF/DEPENDENCIES already added, skipping
[INFO] Building jar: <https://builds.apache.org/job/ExtVal%20for%20JSF%201.2%20(nightly)/ws/trunk/examples/hello_bean-validation/target/examples-hello_bean-validation-1.2.7-SNAPSHOT-sources.jar>
[INFO] META-INF already added, skipping
[INFO] META-INF/LICENSE already added, skipping
[INFO] META-INF/NOTICE already added, skipping
[INFO] META-INF/DEPENDENCIES already added, skipping
[INFO] [checkstyle:check {execution: verify-style}]
[INFO] 
[INFO] [install:install {execution: default-install}]
[INFO] Installing <https://builds.apache.org/job/ExtVal%20for%20JSF%201.2%20(nightly)/ws/trunk/examples/hello_bean-validation/target/examples-hello_bean-validation-1.2.7-SNAPSHOT.war>
to /home/jenkins/jenkins-slave/maven-repositories/0/org/apache/myfaces/extensions/validator/examples/examples-hello_bean-validation/1.2.7-SNAPSHOT/examples-hello_bean-validation-1.2.7-SNAPSHOT.war
[INFO] Installing <https://builds.apache.org/job/ExtVal%20for%20JSF%201.2%20(nightly)/ws/trunk/examples/hello_bean-validation/target/examples-hello_bean-validation-1.2.7-SNAPSHOT-sources.jar>
to /home/jenkins/jenkins-slave/maven-repositories/0/org/apache/myfaces/extensions/validator/examples/examples-hello_bean-validation/1.2.7-SNAPSHOT/examples-hello_bean-validation-1.2.7-SNAPSHOT-sources.jar
[JENKINS] Archiving <https://builds.apache.org/job/ExtVal%20for%20JSF%201.2%20(nightly)/ws/trunk/examples/hello_bean-validation/target/examples-hello_bean-validation-1.2.7-SNAPSHOT-sources.jar>
to /home/hudson/hudson/jobs/ExtVal for JSF 1.2 (nightly)/modules/org.apache.myfaces.extensions.validator.examples$examples-hello_bean-validation/builds/2013-06-09_00-04-49/archive/org.apache.myfaces.extensions.validator.examples/examples-hello_bean-validation/1.2.7-SNAPSHOT/examples-hello_bean-validation-1.2.7-SNAPSHOT-sources.jar
[INFO] ------------------------------------------------------------------------
[INFO] Building MyFaces Extensions-Validator examples feature-set 01
[INFO]    task-segment: [clean, install]
[INFO] ------------------------------------------------------------------------
[INFO] [clean:clean {execution: default-clean}]
[INFO] Deleting <https://builds.apache.org/job/ExtVal%20for%20JSF%201.2%20(nightly)/ws/trunk/examples/feature-set_01/target>
[WARNING] DEPRECATED [tasks]: Use target instead
[INFO] [antrun:run {execution: javadoc.resources}]
[WARNING] Parameter tasks is deprecated, use target instead
[INFO] Executing tasks

main:
[INFO] Executed tasks
[INFO] [remote-resources:process {execution: default}]
[debug] execute contextualize
[INFO] [resources:resources {execution: default-resources}]
[INFO] Using 'UTF-8' encoding to copy filtered resources.
[INFO] Copying 0 resource to META-INF
[INFO] skip non existing resourceDirectory <https://builds.apache.org/job/ExtVal%20for%20JSF%201.2%20(nightly)/ws/trunk/examples/feature-set_01/src/main/resources>
[INFO] Copying 3 resources
[INFO] [compiler:compile {execution: default-compile}]
[INFO] Compiling 2 source files to <https://builds.apache.org/job/ExtVal%20for%20JSF%201.2%20(nightly)/ws/trunk/examples/feature-set_01/target/classes>
[debug] execute contextualize
[INFO] [resources:testResources {execution: default-testResources}]
[INFO] Using 'UTF-8' encoding to copy filtered resources.
[INFO] skip non existing resourceDirectory <https://builds.apache.org/job/ExtVal%20for%20JSF%201.2%20(nightly)/ws/trunk/examples/feature-set_01/src/test/resources>
[INFO] Copying 3 resources
[INFO] [compiler:testCompile {execution: default-testCompile}]
[INFO] No sources to compile
[INFO] [surefire:test {execution: default-test}]
[INFO] Surefire report directory: <https://builds.apache.org/job/ExtVal%20for%20JSF%201.2%20(nightly)/ws/trunk/examples/feature-set_01/target/surefire-reports>

-------------------------------------------------------
 T E S T S
-------------------------------------------------------

Results :

Tests run: 0, Failures: 0, Errors: 0, Skipped: 0

[JENKINS] Recording test results
[INFO] [war:war {execution: default-war}]
[INFO] Packaging webapp
[INFO] Assembling webapp[examples-feature-set_01] in [<https://builds.apache.org/job/ExtVal%20for%20JSF%201.2%20(nightly)/ws/trunk/examples/feature-set_01/target/examples-feature-set_01-1.2.7-SNAPSHOT]>
[INFO] Processing war project
[INFO] Copying webapp resources[<https://builds.apache.org/job/ExtVal%20for%20JSF%201.2%20(nightly)/ws/trunk/examples/feature-set_01/src/main/webapp]>
[INFO] Webapp assembled in[118 msecs]
[INFO] Building war: <https://builds.apache.org/job/ExtVal%20for%20JSF%201.2%20(nightly)/ws/trunk/examples/feature-set_01/target/examples-feature-set_01-1.2.7-SNAPSHOT.war>
[INFO] Preparing source:jar
[WARNING] Removing: jar from forked lifecycle, to prevent recursive invocation.
[WARNING] DEPRECATED [tasks]: Use target instead
[JENKINS] Archiving <https://builds.apache.org/job/ExtVal%20for%20JSF%201.2%20(nightly)/ws/trunk/examples/feature-set_01/pom.xml>
to /home/hudson/hudson/jobs/ExtVal for JSF 1.2 (nightly)/modules/org.apache.myfaces.extensions.validator.examples$examples-feature-set_01/builds/2013-06-09_00-04-49/archive/org.apache.myfaces.extensions.validator.examples/examples-feature-set_01/1.2.7-SNAPSHOT/examples-feature-set_01-1.2.7-SNAPSHOT.pom
[JENKINS] Archiving <https://builds.apache.org/job/ExtVal%20for%20JSF%201.2%20(nightly)/ws/trunk/examples/feature-set_01/target/examples-feature-set_01-1.2.7-SNAPSHOT.war>
to /home/hudson/hudson/jobs/ExtVal for JSF 1.2 (nightly)/modules/org.apache.myfaces.extensions.validator.examples$examples-feature-set_01/builds/2013-06-09_00-04-49/archive/org.apache.myfaces.extensions.validator.examples/examples-feature-set_01/1.2.7-SNAPSHOT/examples-feature-set_01-1.2.7-SNAPSHOT.war
[INFO] [antrun:run {execution: javadoc.resources}]
[WARNING] Parameter tasks is deprecated, use target instead
[INFO] Executing tasks

main:
[INFO] Executed tasks
[INFO] [source:jar {execution: attach-sources}]
[INFO] META-INF already added, skipping
[INFO] META-INF/LICENSE already added, skipping
[INFO] META-INF/NOTICE already added, skipping
[INFO] META-INF/DEPENDENCIES already added, skipping
[INFO] Building jar: <https://builds.apache.org/job/ExtVal%20for%20JSF%201.2%20(nightly)/ws/trunk/examples/feature-set_01/target/examples-feature-set_01-1.2.7-SNAPSHOT-sources.jar>
[INFO] META-INF already added, skipping
[INFO] META-INF/LICENSE already added, skipping
[INFO] META-INF/NOTICE already added, skipping
[INFO] META-INF/DEPENDENCIES already added, skipping
[INFO] [checkstyle:check {execution: verify-style}]
[INFO] 
[INFO] [install:install {execution: default-install}]
[INFO] Installing <https://builds.apache.org/job/ExtVal%20for%20JSF%201.2%20(nightly)/ws/trunk/examples/feature-set_01/target/examples-feature-set_01-1.2.7-SNAPSHOT.war>
to /home/jenkins/jenkins-slave/maven-repositories/0/org/apache/myfaces/extensions/validator/examples/examples-feature-set_01/1.2.7-SNAPSHOT/examples-feature-set_01-1.2.7-SNAPSHOT.war
[INFO] Installing <https://builds.apache.org/job/ExtVal%20for%20JSF%201.2%20(nightly)/ws/trunk/examples/feature-set_01/target/examples-feature-set_01-1.2.7-SNAPSHOT-sources.jar>
to /home/jenkins/jenkins-slave/maven-repositories/0/org/apache/myfaces/extensions/validator/examples/examples-feature-set_01/1.2.7-SNAPSHOT/examples-feature-set_01-1.2.7-SNAPSHOT-sources.jar
[JENKINS] Archiving <https://builds.apache.org/job/ExtVal%20for%20JSF%201.2%20(nightly)/ws/trunk/examples/feature-set_01/target/examples-feature-set_01-1.2.7-SNAPSHOT-sources.jar>
to /home/hudson/hudson/jobs/ExtVal for JSF 1.2 (nightly)/modules/org.apache.myfaces.extensions.validator.examples$examples-feature-set_01/builds/2013-06-09_00-04-49/archive/org.apache.myfaces.extensions.validator.examples/examples-feature-set_01/1.2.7-SNAPSHOT/examples-feature-set_01-1.2.7-SNAPSHOT-sources.jar
[INFO] ------------------------------------------------------------------------
[INFO] Building MyFaces Extensions-Validator examples feature-set 02
[INFO]    task-segment: [clean, install]
[INFO] ------------------------------------------------------------------------
[INFO] [clean:clean {execution: default-clean}]
[INFO] Deleting <https://builds.apache.org/job/ExtVal%20for%20JSF%201.2%20(nightly)/ws/trunk/examples/feature-set_02/target>
[WARNING] DEPRECATED [tasks]: Use target instead
[INFO] [antrun:run {execution: javadoc.resources}]
[WARNING] Parameter tasks is deprecated, use target instead
[INFO] Executing tasks

main:
[INFO] Executed tasks
[INFO] [remote-resources:process {execution: default}]
[debug] execute contextualize
[INFO] [resources:resources {execution: default-resources}]
[INFO] Using 'UTF-8' encoding to copy filtered resources.
[INFO] Copying 0 resource to META-INF
[INFO] skip non existing resourceDirectory <https://builds.apache.org/job/ExtVal%20for%20JSF%201.2%20(nightly)/ws/trunk/examples/feature-set_02/src/main/resources>
[INFO] Copying 3 resources
[INFO] [compiler:compile {execution: default-compile}]
[INFO] Compiling 4 source files to <https://builds.apache.org/job/ExtVal%20for%20JSF%201.2%20(nightly)/ws/trunk/examples/feature-set_02/target/classes>
[debug] execute contextualize
[INFO] [resources:testResources {execution: default-testResources}]
[INFO] Using 'UTF-8' encoding to copy filtered resources.
[INFO] skip non existing resourceDirectory <https://builds.apache.org/job/ExtVal%20for%20JSF%201.2%20(nightly)/ws/trunk/examples/feature-set_02/src/test/resources>
[INFO] Copying 3 resources
[INFO] [compiler:testCompile {execution: default-testCompile}]
[INFO] No sources to compile
[INFO] [surefire:test {execution: default-test}]
[INFO] Surefire report directory: <https://builds.apache.org/job/ExtVal%20for%20JSF%201.2%20(nightly)/ws/trunk/examples/feature-set_02/target/surefire-reports>

-------------------------------------------------------
 T E S T S
-------------------------------------------------------

Results :

Tests run: 0, Failures: 0, Errors: 0, Skipped: 0

[JENKINS] Recording test results
[INFO] [war:war {execution: default-war}]
[INFO] Packaging webapp
[INFO] Assembling webapp[examples-feature-set_02] in [<https://builds.apache.org/job/ExtVal%20for%20JSF%201.2%20(nightly)/ws/trunk/examples/feature-set_02/target/examples-feature-set_02-1.2.7-SNAPSHOT]>
[INFO] Processing war project
[INFO] Copying webapp resources[<https://builds.apache.org/job/ExtVal%20for%20JSF%201.2%20(nightly)/ws/trunk/examples/feature-set_02/src/main/webapp]>
[INFO] Webapp assembled in[83 msecs]
[INFO] Building war: <https://builds.apache.org/job/ExtVal%20for%20JSF%201.2%20(nightly)/ws/trunk/examples/feature-set_02/target/examples-feature-set_02-1.2.7-SNAPSHOT.war>
[INFO] Preparing source:jar
[WARNING] Removing: jar from forked lifecycle, to prevent recursive invocation.
[WARNING] DEPRECATED [tasks]: Use target instead
[JENKINS] Archiving <https://builds.apache.org/job/ExtVal%20for%20JSF%201.2%20(nightly)/ws/trunk/examples/feature-set_02/pom.xml>
to /home/hudson/hudson/jobs/ExtVal for JSF 1.2 (nightly)/modules/org.apache.myfaces.extensions.validator.examples$examples-feature-set_02/builds/2013-06-09_00-04-50/archive/org.apache.myfaces.extensions.validator.examples/examples-feature-set_02/1.2.7-SNAPSHOT/examples-feature-set_02-1.2.7-SNAPSHOT.pom
[JENKINS] Archiving <https://builds.apache.org/job/ExtVal%20for%20JSF%201.2%20(nightly)/ws/trunk/examples/feature-set_02/target/examples-feature-set_02-1.2.7-SNAPSHOT.war>
to /home/hudson/hudson/jobs/ExtVal for JSF 1.2 (nightly)/modules/org.apache.myfaces.extensions.validator.examples$examples-feature-set_02/builds/2013-06-09_00-04-50/archive/org.apache.myfaces.extensions.validator.examples/examples-feature-set_02/1.2.7-SNAPSHOT/examples-feature-set_02-1.2.7-SNAPSHOT.war
[INFO] [antrun:run {execution: javadoc.resources}]
[WARNING] Parameter tasks is deprecated, use target instead
[INFO] Executing tasks

main:
[INFO] Executed tasks
[INFO] [source:jar {execution: attach-sources}]
[INFO] META-INF already added, skipping
[INFO] META-INF/LICENSE already added, skipping
[INFO] META-INF/NOTICE already added, skipping
[INFO] META-INF/DEPENDENCIES already added, skipping
[INFO] Building jar: <https://builds.apache.org/job/ExtVal%20for%20JSF%201.2%20(nightly)/ws/trunk/examples/feature-set_02/target/examples-feature-set_02-1.2.7-SNAPSHOT-sources.jar>
[INFO] META-INF already added, skipping
[INFO] META-INF/LICENSE already added, skipping
[INFO] META-INF/NOTICE already added, skipping
[INFO] META-INF/DEPENDENCIES already added, skipping
[INFO] [checkstyle:check {execution: verify-style}]
[INFO] 
[INFO] [install:install {execution: default-install}]
[INFO] Installing <https://builds.apache.org/job/ExtVal%20for%20JSF%201.2%20(nightly)/ws/trunk/examples/feature-set_02/target/examples-feature-set_02-1.2.7-SNAPSHOT.war>
to /home/jenkins/jenkins-slave/maven-repositories/0/org/apache/myfaces/extensions/validator/examples/examples-feature-set_02/1.2.7-SNAPSHOT/examples-feature-set_02-1.2.7-SNAPSHOT.war
[INFO] Installing <https://builds.apache.org/job/ExtVal%20for%20JSF%201.2%20(nightly)/ws/trunk/examples/feature-set_02/target/examples-feature-set_02-1.2.7-SNAPSHOT-sources.jar>
to /home/jenkins/jenkins-slave/maven-repositories/0/org/apache/myfaces/extensions/validator/examples/examples-feature-set_02/1.2.7-SNAPSHOT/examples-feature-set_02-1.2.7-SNAPSHOT-sources.jar
[JENKINS] Archiving <https://builds.apache.org/job/ExtVal%20for%20JSF%201.2%20(nightly)/ws/trunk/examples/feature-set_02/target/examples-feature-set_02-1.2.7-SNAPSHOT-sources.jar>
to /home/hudson/hudson/jobs/ExtVal for JSF 1.2 (nightly)/modules/org.apache.myfaces.extensions.validator.examples$examples-feature-set_02/builds/2013-06-09_00-04-50/archive/org.apache.myfaces.extensions.validator.examples/examples-feature-set_02/1.2.7-SNAPSHOT/examples-feature-set_02-1.2.7-SNAPSHOT-sources.jar
[INFO] 
[INFO] 
[INFO] ------------------------------------------------------------------------
[INFO] Reactor Summary:
[INFO] ------------------------------------------------------------------------
[INFO] Apache MyFaces Extensions-Validator Module ............ SUCCESS [16.982s]
[INFO] MyFaces Extensions-Validator Core ..................... SUCCESS [12.893s]
[INFO] MyFaces Extensions-Validator Validation-Modules ....... SUCCESS [0.672s]
[INFO] MyFaces Extensions-Validator Property-Validation-Module  SUCCESS [6.564s]
[INFO] MyFaces Extensions-Validator Bean-Validation-Integration-Module (JSR 303)  SUCCESS
[5.758s]
[INFO] MyFaces Extensions-Validator Component-Support Modules  SUCCESS [0.612s]
[INFO] MyFaces Extensions-Validator Trinidad Support Module .. SUCCESS [4.937s]
[INFO] MyFaces Extensions-Validator Generic Support Module ... SUCCESS [4.066s]
[INFO] MyFaces Extensions-Validator examples project ......... SUCCESS [0.703s]
[INFO] MyFaces Extensions-Validator examples hello world ..... SUCCESS [16.541s]
[INFO] MyFaces Extensions-Validator examples hello bean-validation  SUCCESS [23.892s]
[INFO] MyFaces Extensions-Validator examples feature-set 01 .. SUCCESS [52.876s]
[INFO] MyFaces Extensions-Validator examples feature-set 02 .. SUCCESS [42.979s]
[INFO] ------------------------------------------------------------------------
[INFO] ------------------------------------------------------------------------
[INFO] BUILD SUCCESSFUL
[INFO] ------------------------------------------------------------------------
[INFO] Total time: 3 minutes 30 seconds
[INFO] Finished at: Sun Jun 09 00:08:48 UTC 2013
[INFO] Final Memory: 87M/176M
[INFO] ------------------------------------------------------------------------
channel stopped
Maven RedeployPublisher use remote ubuntu1 maven settings from : /home/jenkins/.m2/settings.xml
[INFO] Deployment in https://repository.apache.org/content/repositories/snapshots (id=apache.snapshots.https,uniqueVersion=false)
Deploying the main artifact myfaces-extval-core-1.2.7-SNAPSHOT.jar
Deploying the main artifact myfaces-extval-core-1.2.7-SNAPSHOT-sources.jar
[INFO] Deployment in https://repository.apache.org/content/repositories/snapshots (id=apache.snapshots.https,uniqueVersion=false)
Deploying the main artifact myfaces-extval-module-1.2.7-SNAPSHOT.pom
ERROR: Error retrieving previous build number for artifact 'org.apache.myfaces.extensions.validator:myfaces-extval-module:pom':
repository metadata for: 'snapshot org.apache.myfaces.extensions.validator:myfaces-extval-module:1.2.7-SNAPSHOT'
could not be retrieved from repository: apache.snapshots.https due to an error: Error copying
temporary file to the final destination: File /home/hudson/.m2/repository/org/apache/myfaces/extensions/validator/myfaces-extval-module/1.2.7-SNAPSHOT/maven-metadata-apache.snapshots.https.xml.tmp
does not exist
org.apache.maven.artifact.deployer.ArtifactDeploymentException: Error retrieving previous
build number for artifact 'org.apache.myfaces.extensions.validator:myfaces-extval-module:pom':
repository metadata for: 'snapshot org.apache.myfaces.extensions.validator:myfaces-extval-module:1.2.7-SNAPSHOT'
could not be retrieved from repository: apache.snapshots.https due to an error: Error copying
temporary file to the final destination: File /home/hudson/.m2/repository/org/apache/myfaces/extensions/validator/myfaces-extval-module/1.2.7-SNAPSHOT/maven-metadata-apache.snapshots.https.xml.tmp
does not exist
	at hudson.maven.artifact.transform.SnapshotTransformation.transformForDeployment(SnapshotTransformation.java:110)
	at hudson.maven.artifact.transform.DefaultArtifactTransformationManager.transformForDeployment(DefaultArtifactTransformationManager.java:69)
	at hudson.maven.artifact.deployer.DefaultArtifactDeployer.deploy(DefaultArtifactDeployer.java:92)
	at hudson.maven.reporters.MavenArtifactRecord.deploy(MavenArtifactRecord.java:190)
	at hudson.maven.RedeployPublisher.perform(RedeployPublisher.java:176)
	at hudson.tasks.BuildStepMonitor$1.perform(BuildStepMonitor.java:19)
	at hudson.model.AbstractBuild$AbstractBuildExecution.perform(AbstractBuild.java:810)
	at hudson.model.AbstractBuild$AbstractBuildExecution.performAllBuildSteps(AbstractBuild.java:785)
	at hudson.maven.MavenModuleSetBuild$MavenModuleSetBuildExecution.post2(MavenModuleSetBuild.java:946)
	at hudson.model.AbstractBuild$AbstractBuildExecution.post(AbstractBuild.java:732)
	at hudson.model.Run.execute(Run.java:1593)
	at hudson.maven.MavenModuleSetBuild.run(MavenModuleSetBuild.java:477)
	at hudson.model.ResourceController.execute(ResourceController.java:88)
	at hudson.model.Executor.run(Executor.java:236)
Caused by: org.apache.maven.artifact.repository.metadata.RepositoryMetadataResolutionException:
repository metadata for: 'snapshot org.apache.myfaces.extensions.validator:myfaces-extval-module:1.2.7-SNAPSHOT'
could not be retrieved from repository: apache.snapshots.https due to an error: Error copying
temporary file to the final destination: File /home/hudson/.m2/repository/org/apache/myfaces/extensions/validator/myfaces-extval-module/1.2.7-SNAPSHOT/maven-metadata-apache.snapshots.https.xml.tmp
does not exist
	at org.apache.maven.artifact.repository.metadata.DefaultRepositoryMetadataManager.resolveAlways(DefaultRepositoryMetadataManager.java:400)
	at hudson.maven.artifact.transform.SnapshotTransformation.resolveLatestSnapshotBuildNumber(SnapshotTransformation.java:160)
	at hudson.maven.artifact.transform.SnapshotTransformation.transformForDeployment(SnapshotTransformation.java:104)
	... 13 more
Caused by: org.apache.maven.wagon.TransferFailedException: Error copying temporary file to
the final destination: File /home/hudson/.m2/repository/org/apache/myfaces/extensions/validator/myfaces-extval-module/1.2.7-SNAPSHOT/maven-metadata-apache.snapshots.https.xml.tmp
does not exist
	at org.apache.maven.repository.legacy.DefaultWagonManager.getRemoteFile(DefaultWagonManager.java:480)
	at org.apache.maven.repository.legacy.DefaultWagonManager.getArtifactMetadataFromDeploymentRepository(DefaultWagonManager.java:215)
	at org.apache.maven.artifact.repository.metadata.DefaultRepositoryMetadataManager.getArtifactMetadataFromDeploymentRepository(DefaultRepositoryMetadataManager.java:424)
	at org.apache.maven.artifact.repository.metadata.DefaultRepositoryMetadataManager.resolveAlways(DefaultRepositoryMetadataManager.java:396)
	... 15 more
Caused by: java.io.IOException: File /home/hudson/.m2/repository/org/apache/myfaces/extensions/validator/myfaces-extval-module/1.2.7-SNAPSHOT/maven-metadata-apache.snapshots.https.xml.tmp
does not exist
	at org.codehaus.plexus.util.FileUtils.copyFile(FileUtils.java:1038)
	at org.apache.maven.repository.legacy.DefaultWagonManager.getRemoteFile(DefaultWagonManager.java:474)
	... 18 more
[INFO] Deployment failed after 2.5 sec
Build step 'Deploy artifacts to Maven repository' changed build result to FAILURE

Mime
View raw message