myfaces-commits mailing list archives

Site index · List index
Message view « Date » · « Thread »
Top « Date » · « Thread »
From Apache Jenkins Server <jenk...@builds.apache.org>
Subject Build failed in Jenkins: tobago-1.0.x-deploy #614
Date Mon, 17 Jun 2013 20:45:37 GMT
See <https://builds.apache.org/job/tobago-1.0.x-deploy/614/>

------------------------------------------
[...truncated 2397 lines...]
[INFO]   Theme Standard
[INFO]   Theme Scarborough
[INFO]   Theme Speyside
[INFO]   Theme Richmond
[INFO]   Theme Charlotteville
[INFO]   Tobago Extensions
[INFO]   Tobago Facelets
[INFO]   Tobago Fileupload
[INFO]   Tobago Security
[INFO]   Tobago FacesMessage Ordering Fix
[INFO]   Tobago Examples
[INFO]   Example Addressbook
[INFO]   Example Addressbook Library
[INFO]   Example Addressbook Webapp
[INFO]   Example Blank
[INFO]   Data for Examples
[INFO]   Example Demo
[INFO]   Example Non-Faces-Request
[INFO]   Tobago Example Experimental
[INFO]   Tobago Example Test
[INFO]   Example Assembly
[INFO]   Tobago Sandbox
[INFO]   Tobago Assembly
[INFO] Searching repository for plugin with prefix: 'source'.
[INFO] ------------------------------------------------------------------------
[INFO] Building Apache Tobago
[INFO]    task-segment: [clean, source:jar, deploy]
[INFO] ------------------------------------------------------------------------
[INFO] [clean:clean {execution: default-clean}]
[INFO] Preparing source:jar
[JENKINS] Archiving <https://builds.apache.org/job/tobago-1.0.x-deploy/ws/tobago-1.0.x-deploy/pom.xml>
to /home/hudson/hudson/jobs/tobago-1.0.x-deploy/modules/org.apache.myfaces.tobago$tobago/builds/2013-06-17_20-41-31/archive/org.apache.myfaces.tobago/tobago/1.0.41-SNAPSHOT/tobago-1.0.41-SNAPSHOT.pom
[INFO] [buildnumber:create {execution: default}]
[INFO] Checking for local modifications: skipped.
[INFO] Updating project files from SCM: skipped.
[INFO] Executing: /bin/sh -c cd <https://builds.apache.org/job/tobago-1.0.x-deploy/ws/tobago-1.0.x-deploy>
&& svn --non-interactive info
[INFO] Working directory: <https://builds.apache.org/job/tobago-1.0.x-deploy/ws/tobago-1.0.x-deploy>
[INFO] Storing buildNumber: 1493928 at timestamp: 1371501741890
[INFO] Executing: /bin/sh -c cd <https://builds.apache.org/job/tobago-1.0.x-deploy/ws/tobago-1.0.x-deploy>
&& svn --non-interactive info
[INFO] Working directory: <https://builds.apache.org/job/tobago-1.0.x-deploy/ws/tobago-1.0.x-deploy>
[INFO] Storing buildScmBranch: branches/tobago-1.0.x
[INFO] [source:jar {execution: default-cli}]
[INFO] [buildnumber:create {execution: default}]
[INFO] Setting property: classpath.resource.loader.class => 'org.codehaus.plexus.velocity.ContextClassLoaderResourceLoader'.
[INFO] Setting property: velocimacro.messages.on => 'false'.
[INFO] Setting property: resource.loader => 'classpath'.
[INFO] Setting property: resource.manager.logwhenfound => 'false'.
[INFO] [remote-resources:process {execution: default}]
[INFO] [site:attach-descriptor {execution: default-attach-descriptor}]
[INFO] Parent project loaded from repository.
[INFO] [assembly:single {execution: source-release-assembly}]
[INFO] tobago-1.0.41-SNAPSHOT/ already added, skipping
[INFO] Building zip: <https://builds.apache.org/job/tobago-1.0.x-deploy/ws/tobago-1.0.x-deploy/target/tobago-1.0.41-SNAPSHOT-source-release.zip>
[INFO] tobago-1.0.41-SNAPSHOT/ already added, skipping
[INFO] [install:install {execution: default-install}]
[INFO] Installing <https://builds.apache.org/job/tobago-1.0.x-deploy/ws/tobago-1.0.x-deploy/pom.xml>
to /home/jenkins/jenkins-slave/maven-repositories/0/org/apache/myfaces/tobago/tobago/1.0.41-SNAPSHOT/tobago-1.0.41-SNAPSHOT.pom
[INFO] Installing <https://builds.apache.org/job/tobago-1.0.x-deploy/ws/tobago-1.0.x-deploy/target/tobago-1.0.41-SNAPSHOT-site.xml>
to /home/jenkins/jenkins-slave/maven-repositories/0/org/apache/myfaces/tobago/tobago/1.0.41-SNAPSHOT/tobago-1.0.41-SNAPSHOT-site.xml
[INFO] Installing <https://builds.apache.org/job/tobago-1.0.x-deploy/ws/tobago-1.0.x-deploy/target/tobago-1.0.41-SNAPSHOT-source-release.zip>
to /home/jenkins/jenkins-slave/maven-repositories/0/org/apache/myfaces/tobago/tobago/1.0.41-SNAPSHOT/tobago-1.0.41-SNAPSHOT-source-release.zip
[INFO] [deploy:deploy {execution: default-deploy}]
[INFO] Retrieving previous build number from apache.snapshots.https
[WARNING] *** CHECKSUM FAILED - Checksum failed on download: local = 'bd00899fded2011011338931258b533594330628';
remote = '07978a5a24f92a4969f25c7d897c3c04386dc6dd' - RETRYING
[WARNING] *** CHECKSUM FAILED - Checksum failed on download: local = 'bd00899fded2011011338931258b533594330628';
remote = '07978a5a24f92a4969f25c7d897c3c04386dc6dd' - IGNORING
Uploading: https://repository.apache.org/content/repositories/snapshots/org/apache/myfaces/tobago/tobago/1.0.41-SNAPSHOT/tobago-1.0.41-SNAPSHOT.pom
42K uploaded  (tobago-1.0.41-SNAPSHOT.pom)
[INFO] Retrieving previous metadata from apache.snapshots.https
[WARNING] *** CHECKSUM FAILED - Checksum failed on download: local = 'bd00899fded2011011338931258b533594330628';
remote = '07978a5a24f92a4969f25c7d897c3c04386dc6dd' - RETRYING
[WARNING] *** CHECKSUM FAILED - Checksum failed on download: local = 'bd00899fded2011011338931258b533594330628';
remote = '07978a5a24f92a4969f25c7d897c3c04386dc6dd' - IGNORING
[INFO] Uploading repository metadata for: 'snapshot org.apache.myfaces.tobago:tobago:1.0.41-SNAPSHOT'
[INFO] Retrieving previous metadata from apache.snapshots.https
[INFO] Uploading repository metadata for: 'artifact org.apache.myfaces.tobago:tobago'
[INFO] Retrieving previous build number from apache.snapshots.https
Uploading: https://repository.apache.org/content/repositories/snapshots/org/apache/myfaces/tobago/tobago/1.0.41-SNAPSHOT/tobago-1.0.41-SNAPSHOT-site.xml
3K uploaded  (tobago-1.0.41-SNAPSHOT-site.xml)
[INFO] Retrieving previous build number from apache.snapshots.https
Uploading: https://repository.apache.org/content/repositories/snapshots/org/apache/myfaces/tobago/tobago/1.0.41-SNAPSHOT/tobago-1.0.41-SNAPSHOT-source-release.zip
2944K uploaded  (tobago-1.0.41-SNAPSHOT-source-release.zip)
[JENKINS] Archiving <https://builds.apache.org/job/tobago-1.0.x-deploy/ws/tobago-1.0.x-deploy/target/tobago-1.0.41-SNAPSHOT-site.xml>
to /home/hudson/hudson/jobs/tobago-1.0.x-deploy/modules/org.apache.myfaces.tobago$tobago/builds/2013-06-17_20-41-31/archive/org.apache.myfaces.tobago/tobago/1.0.41-SNAPSHOT/tobago-1.0.41-SNAPSHOT-site.xml
[JENKINS] Archiving <https://builds.apache.org/job/tobago-1.0.x-deploy/ws/tobago-1.0.x-deploy/target/tobago-1.0.41-SNAPSHOT-source-release.zip>
to /home/hudson/hudson/jobs/tobago-1.0.x-deploy/modules/org.apache.myfaces.tobago$tobago/builds/2013-06-17_20-41-31/archive/org.apache.myfaces.tobago/tobago/1.0.41-SNAPSHOT/tobago-1.0.41-SNAPSHOT-source-release.zip
[INFO] ------------------------------------------------------------------------
[INFO] Building Tobago Tool
[INFO]    task-segment: [clean, source:jar, deploy]
[INFO] ------------------------------------------------------------------------
[INFO] [clean:clean {execution: default-clean}]
[INFO] Preparing source:jar
[JENKINS] Archiving <https://builds.apache.org/job/tobago-1.0.x-deploy/ws/tobago-1.0.x-deploy/tobago-tool/pom.xml>
to /home/hudson/hudson/jobs/tobago-1.0.x-deploy/modules/org.apache.myfaces.tobago$tobago-tool/builds/2013-06-17_20-41-31/archive/org.apache.myfaces.tobago/tobago-tool/1.0.41-SNAPSHOT/tobago-tool-1.0.41-SNAPSHOT.pom
[INFO] [buildnumber:create {execution: default}]
[INFO] [source:jar {execution: default-cli}]
[INFO] [buildnumber:create {execution: default}]
[INFO] [remote-resources:process {execution: default}]
[INFO] [site:attach-descriptor {execution: default-attach-descriptor}]
[INFO] [assembly:single {execution: source-release-assembly}]
[INFO] Skipping the assembly in this project because it's not the Execution Root
[INFO] [install:install {execution: default-install}]
[INFO] Installing <https://builds.apache.org/job/tobago-1.0.x-deploy/ws/tobago-1.0.x-deploy/tobago-tool/pom.xml>
to /home/jenkins/jenkins-slave/maven-repositories/0/org/apache/myfaces/tobago/tobago-tool/1.0.41-SNAPSHOT/tobago-tool-1.0.41-SNAPSHOT.pom
[INFO] [deploy:deploy {execution: default-deploy}]
[INFO] Retrieving previous build number from apache.snapshots.https
[WARNING] *** CHECKSUM FAILED - Checksum failed on download: local = 'aff6d6e4523a4558d12b19b945fb4f88520dea03';
remote = 'e8b378006b3a9ba8337f80a87739118d4898da23' - RETRYING
[WARNING] *** CHECKSUM FAILED - Checksum failed on download: local = 'aff6d6e4523a4558d12b19b945fb4f88520dea03';
remote = 'e8b378006b3a9ba8337f80a87739118d4898da23' - IGNORING
Uploading: https://repository.apache.org/content/repositories/snapshots/org/apache/myfaces/tobago/tobago-tool/1.0.41-SNAPSHOT/tobago-tool-1.0.41-SNAPSHOT.pom
1K uploaded  (tobago-tool-1.0.41-SNAPSHOT.pom)
[INFO] Retrieving previous metadata from apache.snapshots.https
[INFO] Uploading repository metadata for: 'artifact org.apache.myfaces.tobago:tobago-tool'
[INFO] Retrieving previous metadata from apache.snapshots.https
[WARNING] *** CHECKSUM FAILED - Checksum failed on download: local = 'aff6d6e4523a4558d12b19b945fb4f88520dea03';
remote = 'e8b378006b3a9ba8337f80a87739118d4898da23' - RETRYING
[WARNING] *** CHECKSUM FAILED - Checksum failed on download: local = 'aff6d6e4523a4558d12b19b945fb4f88520dea03';
remote = 'e8b378006b3a9ba8337f80a87739118d4898da23' - IGNORING
[INFO] Uploading repository metadata for: 'snapshot org.apache.myfaces.tobago:tobago-tool:1.0.41-SNAPSHOT'
[INFO] ------------------------------------------------------------------------
[INFO] Building Maven Apt Plugin
[INFO]    task-segment: [clean, source:jar, deploy]
[INFO] ------------------------------------------------------------------------
[INFO] [clean:clean {execution: default-clean}]
[INFO] Preparing source:jar
[JENKINS] Archiving <https://builds.apache.org/job/tobago-1.0.x-deploy/ws/tobago-1.0.x-deploy/tobago-tool/maven-apt-plugin/pom.xml>
to /home/hudson/hudson/jobs/tobago-1.0.x-deploy/modules/org.apache.myfaces.tobago$maven-apt-plugin/builds/2013-06-17_20-41-31/archive/org.apache.myfaces.tobago/maven-apt-plugin/1.0.41-SNAPSHOT/maven-apt-plugin-1.0.41-SNAPSHOT.pom
[INFO] [buildnumber:create {execution: default}]
[INFO] [source:jar {execution: default-cli}]
[INFO] Building jar: <https://builds.apache.org/job/tobago-1.0.x-deploy/ws/tobago-1.0.x-deploy/tobago-tool/maven-apt-plugin/target/maven-apt-plugin-1.0.41-SNAPSHOT-sources.jar>
[INFO] [buildnumber:create {execution: default}]
[INFO] [plugin:descriptor {execution: default-descriptor}]
[INFO] Using 'UTF-8' encoding to read mojo metadata.
[INFO] Applying mojo extractor for language: java
[INFO] Mojo extractor for language: java found 2 mojo descriptors.
[INFO] Applying mojo extractor for language: bsh
[INFO] Mojo extractor for language: bsh found 0 mojo descriptors.
[INFO] [remote-resources:process {execution: default}]
[INFO] [resources:resources {execution: default-resources}]
[INFO] Using 'UTF-8' encoding to copy filtered resources.
[INFO] Copying 2 resources
[INFO] Copying 3 resources
[INFO] [compiler:compile {execution: default-compile}]
[INFO] Compiling 4 source files to <https://builds.apache.org/job/tobago-1.0.x-deploy/ws/tobago-1.0.x-deploy/tobago-tool/maven-apt-plugin/target/classes>
[INFO] [resources:testResources {execution: default-testResources}]
[INFO] Using 'UTF-8' encoding to copy filtered resources.
[INFO] skip non existing resourceDirectory <https://builds.apache.org/job/tobago-1.0.x-deploy/ws/tobago-1.0.x-deploy/tobago-tool/maven-apt-plugin/src/test/resources>
[INFO] Copying 3 resources
[INFO] [compiler:testCompile {execution: default-testCompile}]
[INFO] No sources to compile
[INFO] [surefire:test {execution: default-test}]
[INFO] Surefire report directory: <https://builds.apache.org/job/tobago-1.0.x-deploy/ws/tobago-1.0.x-deploy/tobago-tool/maven-apt-plugin/target/surefire-reports>

-------------------------------------------------------
 T E S T S
-------------------------------------------------------
There are no tests to run.

Results :

Tests run: 0, Failures: 0, Errors: 0, Skipped: 0

[JENKINS] Recording test results
[INFO] [jar:jar {execution: default-jar}]
[INFO] Building jar: <https://builds.apache.org/job/tobago-1.0.x-deploy/ws/tobago-1.0.x-deploy/tobago-tool/maven-apt-plugin/target/maven-apt-plugin-1.0.41-SNAPSHOT.jar>
[INFO] [plugin:addPluginArtifactMetadata {execution: default-addPluginArtifactMetadata}]
[INFO] [assembly:single {execution: source-release-assembly}]
[INFO] Skipping the assembly in this project because it's not the Execution Root
[INFO] [install:install {execution: default-install}]
[INFO] Installing <https://builds.apache.org/job/tobago-1.0.x-deploy/ws/tobago-1.0.x-deploy/tobago-tool/maven-apt-plugin/target/maven-apt-plugin-1.0.41-SNAPSHOT.jar>
to /home/jenkins/jenkins-slave/maven-repositories/0/org/apache/myfaces/tobago/maven-apt-plugin/1.0.41-SNAPSHOT/maven-apt-plugin-1.0.41-SNAPSHOT.jar
[INFO] Installing <https://builds.apache.org/job/tobago-1.0.x-deploy/ws/tobago-1.0.x-deploy/tobago-tool/maven-apt-plugin/target/maven-apt-plugin-1.0.41-SNAPSHOT-sources.jar>
to /home/jenkins/jenkins-slave/maven-repositories/0/org/apache/myfaces/tobago/maven-apt-plugin/1.0.41-SNAPSHOT/maven-apt-plugin-1.0.41-SNAPSHOT-sources.jar
[INFO] [deploy:deploy {execution: default-deploy}]
[INFO] Retrieving previous build number from apache.snapshots.https
[WARNING] *** CHECKSUM FAILED - Checksum failed on download: local = 'c958cf0352695f5aff840801cef4165c76ce1e0f';
remote = 'dae5d6ce936c28f441fa7e1f9166dc36c3721598' - RETRYING
[WARNING] *** CHECKSUM FAILED - Checksum failed on download: local = 'c958cf0352695f5aff840801cef4165c76ce1e0f';
remote = 'dae5d6ce936c28f441fa7e1f9166dc36c3721598' - IGNORING
Uploading: https://repository.apache.org/content/repositories/snapshots/org/apache/myfaces/tobago/maven-apt-plugin/1.0.41-SNAPSHOT/maven-apt-plugin-1.0.41-SNAPSHOT.jar
25K uploaded  (maven-apt-plugin-1.0.41-SNAPSHOT.jar)
[INFO] Retrieving previous metadata from apache.snapshots.https
[WARNING] *** CHECKSUM FAILED - Checksum failed on download: local = 'c958cf0352695f5aff840801cef4165c76ce1e0f';
remote = 'dae5d6ce936c28f441fa7e1f9166dc36c3721598' - RETRYING
[WARNING] *** CHECKSUM FAILED - Checksum failed on download: local = 'c958cf0352695f5aff840801cef4165c76ce1e0f';
remote = 'dae5d6ce936c28f441fa7e1f9166dc36c3721598' - IGNORING
[INFO] Uploading repository metadata for: 'snapshot org.apache.myfaces.tobago:maven-apt-plugin:1.0.41-SNAPSHOT'
[INFO] Retrieving previous metadata from apache.snapshots.https
[INFO] Uploading repository metadata for: 'artifact org.apache.myfaces.tobago:maven-apt-plugin'
[INFO] Uploading project information for maven-apt-plugin 1.0.41-SNAPSHOT
[INFO] Retrieving previous metadata from apache.snapshots.https
[INFO] Uploading repository metadata for: 'org.apache.myfaces.tobago'
[INFO] Retrieving previous build number from apache.snapshots.https
Uploading: https://repository.apache.org/content/repositories/snapshots/org/apache/myfaces/tobago/maven-apt-plugin/1.0.41-SNAPSHOT/maven-apt-plugin-1.0.41-SNAPSHOT-sources.jar
15K uploaded  (maven-apt-plugin-1.0.41-SNAPSHOT-sources.jar)
[JENKINS] Archiving <https://builds.apache.org/job/tobago-1.0.x-deploy/ws/tobago-1.0.x-deploy/tobago-tool/maven-apt-plugin/target/maven-apt-plugin-1.0.41-SNAPSHOT.jar>
to /home/hudson/hudson/jobs/tobago-1.0.x-deploy/modules/org.apache.myfaces.tobago$maven-apt-plugin/builds/2013-06-17_20-41-31/archive/org.apache.myfaces.tobago/maven-apt-plugin/1.0.41-SNAPSHOT/maven-apt-plugin-1.0.41-SNAPSHOT.jar
[JENKINS] Archiving <https://builds.apache.org/job/tobago-1.0.x-deploy/ws/tobago-1.0.x-deploy/tobago-tool/maven-apt-plugin/target/maven-apt-plugin-1.0.41-SNAPSHOT-sources.jar>
to /home/hudson/hudson/jobs/tobago-1.0.x-deploy/modules/org.apache.myfaces.tobago$maven-apt-plugin/builds/2013-06-17_20-41-31/archive/org.apache.myfaces.tobago/maven-apt-plugin/1.0.41-SNAPSHOT/maven-apt-plugin-1.0.41-SNAPSHOT-sources.jar
[INFO] ------------------------------------------------------------------------
[INFO] Building Maven Tobago Theme Plugin
[INFO]    task-segment: [clean, source:jar, deploy]
[INFO] ------------------------------------------------------------------------
[INFO] [clean:clean {execution: default-clean}]
[INFO] Preparing source:jar
[JENKINS] Archiving <https://builds.apache.org/job/tobago-1.0.x-deploy/ws/tobago-1.0.x-deploy/tobago-tool/maven-theme-plugin/pom.xml>
to /home/hudson/hudson/jobs/tobago-1.0.x-deploy/modules/org.apache.myfaces.tobago$maven-theme-plugin/builds/2013-06-17_20-41-31/archive/org.apache.myfaces.tobago/maven-theme-plugin/1.0.41-SNAPSHOT/maven-theme-plugin-1.0.41-SNAPSHOT.pom
[INFO] [buildnumber:create {execution: default}]
[INFO] [source:jar {execution: default-cli}]
Jun 17, 2013 8:43:25 PM hudson.remoting.SynchronousCommandTransport$ReaderThread run
SEVERE: I/O error in channel channel
java.io.StreamCorruptedException
	at java.io.ObjectInputStream.readObject0(ObjectInputStream.java:1332)
	at java.io.ObjectInputStream.readObject(ObjectInputStream.java:348)
	at hudson.remoting.Command.readFrom(Command.java:92)
	at hudson.remoting.ClassicCommandTransport.read(ClassicCommandTransport.java:59)
	at hudson.remoting.SynchronousCommandTransport$ReaderThread.run(SynchronousCommandTransport.java:48)
channel stopped
Process 1371501805202 is killed.
[INFO] ------------------------------------------------------------------------
[ERROR] FATAL ERROR
[INFO] ------------------------------------------------------------------------
[INFO] null
[INFO] ------------------------------------------------------------------------
[INFO] Trace
java.lang.reflect.UndeclaredThrowableException
	at $Proxy2.isArchivingDisabled(Unknown Source)
	at hudson.maven.MavenBuildProxy$Filter.isArchivingDisabled(MavenBuildProxy.java:227)
	at hudson.maven.reporters.MavenArtifact.archive(MavenArtifact.java:223)
	at hudson.maven.reporters.MavenArtifactArchiver.postBuild(MavenArtifactArchiver.java:108)
	at hudson.maven.Maven2Builder.postModule(Maven2Builder.java:129)
	at hudson.maven.MavenBuilder$Adapter.fireLeaveModule(MavenBuilder.java:354)
	at hudson.maven.MavenBuilder$Adapter.postBuild(MavenBuilder.java:308)
	at org.apache.maven.lifecycle.LifecycleExecutorInterceptor.execute(LifecycleExecutorInterceptor.java:68)
	at org.apache.maven.DefaultMaven.doExecute(DefaultMaven.java:328)
	at org.apache.maven.DefaultMaven.execute(DefaultMaven.java:138)
	at org.apache.maven.cli.MavenCli.main(MavenCli.java:362)
	at sun.reflect.NativeMethodAccessorImpl.invoke0(Native Method)
	at sun.reflect.NativeMethodAccessorImpl.invoke(NativeMethodAccessorImpl.java:39)
	at sun.reflect.DelegatingMethodAccessorImpl.invoke(DelegatingMethodAccessorImpl.java:25)
	at java.lang.reflect.Method.invoke(Method.java:592)
	at org.codehaus.classworlds.Launcher.launchEnhanced(Launcher.java:315)
	at org.codehaus.classworlds.Launcher.launch(Launcher.java:255)
	at hudson.maven.agent.Main.launch(Main.java:185)
	at hudson.maven.MavenBuilder.call(MavenBuilder.java:154)
	at hudson.maven.Maven2Builder.call(Maven2Builder.java:79)
	at hudson.maven.Maven2Builder.call(Maven2Builder.java:55)
	at hudson.remoting.UserRequest.perform(UserRequest.java:118)
	at hudson.remoting.UserRequest.perform(UserRequest.java:48)
	at hudson.remoting.Request$2.run(Request.java:326)
	at hudson.remoting.InterceptingExecutorService$1.call(InterceptingExecutorService.java:72)
	at java.util.concurrent.FutureTask$Sync.innerRun(FutureTask.java:269)
	at java.util.concurrent.FutureTask.run(FutureTask.java:123)
	at java.util.concurrent.ThreadPoolExecutor$Worker.runTask(ThreadPoolExecutor.java:651)
	at java.util.concurrent.ThreadPoolExecutor$Worker.run(ThreadPoolExecutor.java:676)
	at java.lang.Thread.run(Thread.java:595)
Caused by: hudson.remoting.ChannelClosedException: channel is already closed
	at hudson.remoting.Channel.send(Channel.java:494)
	at hudson.remoting.Request.call(Request.java:129)
	at hudson.remoting.Channel.call(Channel.java:672)
	at hudson.remoting.RemoteInvocationHandler.invoke(RemoteInvocationHandler.java:158)
	... 30 more
Caused by: java.io.StreamCorruptedException
	at java.io.ObjectInputStream.readObject0(ObjectInputStream.java:1332)
	at java.io.ObjectInputStream.readObject(ObjectInputStream.java:348)
	at hudson.remoting.Command.readFrom(Command.java:92)
	at hudson.remoting.ClassicCommandTransport.read(ClassicCommandTransport.java:59)
	at hudson.remoting.SynchronousCommandTransport$ReaderThread.run(SynchronousCommandTransport.java:48)
[INFO] ------------------------------------------------------------------------
[INFO] Total time: 1 minute 21 seconds
[INFO] Finished at: Mon Jun 17 20:43:25 UTC 2013
ERROR: Maven JVM terminated unexpectedly with exit code 0


Mime
View raw message