myfaces-commits mailing list archives

Site index · List index
Message view « Date » · « Thread »
Top « Date » · « Thread »
From Apache Jenkins Server <jenk...@builds.apache.org>
Subject Build failed in Jenkins: myfaces-orchestra-core #1200
Date Wed, 17 Jul 2013 00:31:49 GMT
See <https://builds.apache.org/job/myfaces-orchestra-core/1200/>

------------------------------------------
[...truncated 235 lines...]
INFO: after: Conversation Method
Jul 17, 2013 12:28:51 AM org.apache.myfaces.orchestra.conversation.MockAdvice invoke
INFO: before:Conversation Method
Jul 17, 2013 12:28:51 AM org.apache.myfaces.orchestra.conversation.MockAdvice invoke
INFO: after: Conversation Method
Jul 17, 2013 12:28:51 AM org.apache.myfaces.orchestra.conversation.MockAdvice invoke
INFO: before:Conversation Method
Jul 17, 2013 12:28:51 AM org.apache.myfaces.orchestra.conversation.MockAdvice invoke
INFO: after: Conversation Method
Jul 17, 2013 12:28:51 AM org.apache.myfaces.orchestra.conversation.MockAdvice invoke
INFO: before:Conversation Method
Jul 17, 2013 12:28:51 AM org.apache.myfaces.orchestra.conversation.MockAdvice invoke
INFO: after: Conversation Method
Jul 17, 2013 12:28:51 AM org.apache.myfaces.orchestra.conversation.MockAdvice invoke
INFO: before:Conversation Method
Jul 17, 2013 12:28:51 AM org.apache.myfaces.orchestra.conversation.MockAdvice invoke
INFO: after: Conversation Method
Jul 17, 2013 12:28:51 AM org.apache.myfaces.orchestra.conversation.MockAdvice invoke
INFO: before:Conversation Method
Jul 17, 2013 12:28:51 AM org.apache.myfaces.orchestra.conversation.MockAdvice invoke
INFO: before:Invoking
Jul 17, 2013 12:28:51 AM org.apache.myfaces.orchestra.conversation.MockAdvice invoke
INFO: after: Invoking
Jul 17, 2013 12:28:51 AM org.apache.myfaces.orchestra.conversation.MockAdvice invoke
INFO: after: Conversation Method
Jul 17, 2013 12:28:51 AM org.apache.myfaces.orchestra.conversation.MockAdvice invoke
INFO: before:Conversation Method
Jul 17, 2013 12:28:51 AM org.apache.myfaces.orchestra.conversation.MockAdvice invoke
INFO: before:Invoking
Jul 17, 2013 12:28:51 AM org.apache.myfaces.orchestra.conversation.MockAdvice invoke
INFO: after: Invoking
Jul 17, 2013 12:28:51 AM org.apache.myfaces.orchestra.conversation.MockAdvice invoke
INFO: after: Conversation Method
Jul 17, 2013 12:28:51 AM org.apache.myfaces.orchestra.conversation.MockAdvice invoke
INFO: before:Conversation Method
Jul 17, 2013 12:28:51 AM org.apache.myfaces.orchestra.conversation.MockAdvice invoke
INFO: after: Conversation Method
Jul 17, 2013 12:28:51 AM org.apache.myfaces.orchestra.conversation.MockAdvice invoke
INFO: before:Conversation Method
Jul 17, 2013 12:28:51 AM org.apache.myfaces.orchestra.conversation.MockAdvice invoke
INFO: before:Invoking
Jul 17, 2013 12:28:51 AM org.apache.myfaces.orchestra.conversation.MockAdvice invoke
INFO: after: Invoking
Jul 17, 2013 12:28:51 AM org.apache.myfaces.orchestra.conversation.MockAdvice invoke
INFO: after: Conversation Method
Jul 17, 2013 12:28:51 AM org.apache.myfaces.orchestra.conversation.MockAdvice invoke
INFO: before:Conversation Method
Jul 17, 2013 12:28:51 AM org.apache.myfaces.orchestra.conversation.MockAdvice invoke
INFO: before:Invoking
Jul 17, 2013 12:28:51 AM org.apache.myfaces.orchestra.conversation.MockAdvice invoke
INFO: after: Invoking
Jul 17, 2013 12:28:51 AM org.apache.myfaces.orchestra.conversation.MockAdvice invoke
INFO: after: Conversation Method
Tests run: 2, Failures: 0, Errors: 0, Skipped: 0, Time elapsed: 1.234 sec
Running org.apache.myfaces.orchestra.conversation.TestScope
Jul 17, 2013 12:28:51 AM org.apache.myfaces.orchestra.conversation.MockAdvice invoke
INFO: before:Conversation Method
Jul 17, 2013 12:28:51 AM org.apache.myfaces.orchestra.conversation.MockAdvice invoke
INFO: before:Invoking
Jul 17, 2013 12:28:51 AM org.apache.myfaces.orchestra.conversation.MockAdvice invoke
INFO: after: Invoking
Jul 17, 2013 12:28:51 AM org.apache.myfaces.orchestra.conversation.MockAdvice invoke
INFO: after: Conversation Method
Jul 17, 2013 12:28:51 AM org.apache.myfaces.orchestra.conversation.MockAdvice invoke
INFO: before:Conversation Method
Jul 17, 2013 12:28:51 AM org.apache.myfaces.orchestra.conversation.MockAdvice invoke
INFO: before:Invoking
Jul 17, 2013 12:28:51 AM org.apache.myfaces.orchestra.conversation.MockAdvice invoke
INFO: after: Invoking
Jul 17, 2013 12:28:51 AM org.apache.myfaces.orchestra.conversation.MockAdvice invoke
INFO: after: Conversation Method
Jul 17, 2013 12:28:51 AM org.apache.myfaces.orchestra.conversation.MockAdvice invoke
INFO: before:Conversation Method
Jul 17, 2013 12:28:51 AM org.apache.myfaces.orchestra.conversation.MockAdvice invoke
INFO: before:Invoking
Jul 17, 2013 12:28:51 AM org.apache.myfaces.orchestra.conversation.MockAdvice invoke
INFO: after: Invoking
Jul 17, 2013 12:28:51 AM org.apache.myfaces.orchestra.conversation.MockAdvice invoke
INFO: after: Conversation Method
Jul 17, 2013 12:28:51 AM org.apache.myfaces.orchestra.conversation.MockAdvice invoke
INFO: before:Conversation Method
Jul 17, 2013 12:28:51 AM org.apache.myfaces.orchestra.conversation.MockAdvice invoke
INFO: before:Invoking
Jul 17, 2013 12:28:51 AM org.apache.myfaces.orchestra.conversation.MockAdvice invoke
INFO: after: Invoking
Jul 17, 2013 12:28:51 AM org.apache.myfaces.orchestra.conversation.MockAdvice invoke
INFO: after: Conversation Method
Jul 17, 2013 12:28:51 AM org.apache.myfaces.orchestra.conversation.MockAdvice invoke
INFO: before:Conversation Method
Jul 17, 2013 12:28:51 AM org.apache.myfaces.orchestra.conversation.MockAdvice invoke
INFO: before:Invoking
Jul 17, 2013 12:28:51 AM org.apache.myfaces.orchestra.conversation.MockAdvice invoke
INFO: after: Invoking
Jul 17, 2013 12:28:51 AM org.apache.myfaces.orchestra.conversation.MockAdvice invoke
INFO: after: Conversation Method
Jul 17, 2013 12:28:51 AM org.apache.myfaces.orchestra.conversation.MockAdvice invoke
INFO: before:Conversation Method
Jul 17, 2013 12:28:51 AM org.apache.myfaces.orchestra.conversation.MockAdvice invoke
INFO: before:Invoking
Jul 17, 2013 12:28:51 AM org.apache.myfaces.orchestra.conversation.MockAdvice invoke
INFO: after: Invoking
Jul 17, 2013 12:28:51 AM org.apache.myfaces.orchestra.conversation.MockAdvice invoke
INFO: after: Conversation Method
Jul 17, 2013 12:28:51 AM org.apache.myfaces.orchestra.conversation.MockAdvice invoke
INFO: before:Conversation Method
Jul 17, 2013 12:28:51 AM org.apache.myfaces.orchestra.conversation.MockAdvice invoke
INFO: before:Invoking
Jul 17, 2013 12:28:51 AM org.apache.myfaces.orchestra.conversation.MockAdvice invoke
INFO: after: Invoking
Jul 17, 2013 12:28:51 AM org.apache.myfaces.orchestra.conversation.MockAdvice invoke
INFO: after: Conversation Method
Jul 17, 2013 12:28:51 AM org.apache.myfaces.orchestra.conversation.MockAdvice invoke
INFO: before:Conversation Method
Jul 17, 2013 12:28:51 AM org.apache.myfaces.orchestra.conversation.MockAdvice invoke
INFO: before:Invoking
Jul 17, 2013 12:28:51 AM org.apache.myfaces.orchestra.conversation.MockAdvice invoke
INFO: after: Invoking
Jul 17, 2013 12:28:51 AM org.apache.myfaces.orchestra.conversation.MockAdvice invoke
INFO: after: Conversation Method
Jul 17, 2013 12:28:51 AM org.apache.myfaces.orchestra.conversation.MockAdvice invoke
INFO: before:Conversation Method
Jul 17, 2013 12:28:51 AM org.apache.myfaces.orchestra.conversation.MockAdvice invoke
INFO: before:Invoking
Jul 17, 2013 12:28:51 AM org.apache.myfaces.orchestra.conversation.MockAdvice invoke
INFO: after: Invoking
Jul 17, 2013 12:28:51 AM org.apache.myfaces.orchestra.conversation.MockAdvice invoke
INFO: after: Conversation Method
Jul 17, 2013 12:28:51 AM org.apache.myfaces.orchestra.conversation.MockAdvice invoke
INFO: before:Invoking
Jul 17, 2013 12:28:51 AM org.apache.myfaces.orchestra.conversation.MockAdvice invoke
INFO: after: Invoking
Tests run: 3, Failures: 0, Errors: 0, Skipped: 0, Time elapsed: 0.025 sec
Jul 17, 2013 12:28:52 AM org.springframework.context.support.AbstractApplicationContext doClose
INFO: Closing org.springframework.context.support.GenericApplicationContext@17e845a: display
name [org.springframework.context.support.GenericApplicationContext@17e845a]; startup date
[Wed Jul 17 00:27:37 GMT+00:00 2013]; root of context hierarchy
Jul 17, 2013 12:28:52 AM org.springframework.context.support.AbstractApplicationContext doClose
INFO: Closing org.springframework.context.support.GenericApplicationContext@a60191: display
name [org.springframework.context.support.GenericApplicationContext@a60191]; startup date
[Wed Jul 17 00:28:50 GMT+00:00 2013]; root of context hierarchy
Jul 17, 2013 12:28:52 AM org.springframework.context.support.AbstractApplicationContext doClose
INFO: Closing org.springframework.context.support.GenericApplicationContext@14a8cd1: display
name [org.springframework.context.support.GenericApplicationContext@14a8cd1]; startup date
[Wed Jul 17 00:27:35 GMT+00:00 2013]; root of context hierarchy
Jul 17, 2013 12:28:52 AM org.springframework.context.support.AbstractApplicationContext doClose
INFO: Closing org.springframework.context.support.GenericApplicationContext@139e351: display
name [org.springframework.context.support.GenericApplicationContext@139e351]; startup date
[Wed Jul 17 00:27:37 GMT+00:00 2013]; root of context hierarchy
[TopLink Config]: 2013.07.17 12:28:52.033--ServerSession(22481221)--Connection(16761835)--Thread(Thread[Thread-4,5,main])--disconnect
[TopLink Info]: 2013.07.17 12:28:52.034--ServerSession(22481221)--Thread(Thread[Thread-4,5,main])--<https://builds.apache.org/job/myfaces-orchestra-core/ws/core/target/test-classes-default>
logout successful
[TopLink Config]: 2013.07.17 12:28:52.035--ServerSession(22481221)--Connection(25558540)--Thread(Thread[Thread-4,5,main])--disconnect
[TopLink Config]: 2013.07.17 12:28:52.035--ServerSession(22481221)--Connection(9420495)--Thread(Thread[Thread-4,5,main])--disconnect
[TopLink Config]: 2013.07.17 12:28:52.036--ServerSession(22481221)--Connection(19002963)--Thread(Thread[Thread-4,5,main])--disconnect
[TopLink Config]: 2013.07.17 12:28:52.036--ServerSession(22481221)--Connection(734385)--Thread(Thread[Thread-4,5,main])--disconnect
[TopLink Config]: 2013.07.17 12:28:52.036--ServerSession(22481221)--Connection(8279577)--Thread(Thread[Thread-4,5,main])--disconnect
[TopLink Config]: 2013.07.17 12:28:52.037--ServerSession(22481221)--Connection(10181026)--Thread(Thread[Thread-4,5,main])--disconnect
[TopLink Config]: 2013.07.17 12:28:52.037--ServerSession(22481221)--Connection(14949706)--Thread(Thread[Thread-4,5,main])--disconnect

Results :

Tests run: 15, Failures: 0, Errors: 0, Skipped: 0

[JENKINS] Recording test results
[INFO] [jar:jar {execution: default-jar}]
[INFO] Building jar: <https://builds.apache.org/job/myfaces-orchestra-core/ws/core/target/myfaces-orchestra-core-1.6-SNAPSHOT.jar>
[INFO] Preparing source:jar
[WARNING] Removing: jar from forked lifecycle, to prevent recursive invocation.
[WARNING] DEPRECATED [tasks]: Use target instead
[JENKINS] Archiving <https://builds.apache.org/job/myfaces-orchestra-core/ws/core/pom.xml>
to /home/hudson/hudson/jobs/myfaces-orchestra-core/modules/org.apache.myfaces.orchestra$myfaces-orchestra-core/builds/2013-07-17_00-19-50/archive/org.apache.myfaces.orchestra/myfaces-orchestra-core/1.6-SNAPSHOT/myfaces-orchestra-core-1.6-SNAPSHOT.pom
[JENKINS] Archiving <https://builds.apache.org/job/myfaces-orchestra-core/ws/core/target/myfaces-orchestra-core-1.6-SNAPSHOT.jar>
to /home/hudson/hudson/jobs/myfaces-orchestra-core/modules/org.apache.myfaces.orchestra$myfaces-orchestra-core/builds/2013-07-17_00-19-50/archive/org.apache.myfaces.orchestra/myfaces-orchestra-core/1.6-SNAPSHOT/myfaces-orchestra-core-1.6-SNAPSHOT.jar
[INFO] [antrun:run {execution: javadoc.resources}]
[WARNING] Parameter tasks is deprecated, use target instead
[INFO] Executing tasks

main:
[INFO] Executed tasks
[INFO] [build-helper:add-source {execution: add-source}]
[INFO] Source directory: <https://builds.apache.org/job/myfaces-orchestra-core/ws/core/target/shared_sources>
added.
[INFO] [source:jar {execution: attach-source}]
[INFO] ------------------------------------------------------------------------
[ERROR] FATAL ERROR
[INFO] ------------------------------------------------------------------------
[INFO] null
error=12, Not enough space
[INFO] ------------------------------------------------------------------------
[INFO] Trace
java.lang.reflect.UndeclaredThrowableException
	at org.codehaus.plexus.archiver.AbstractArchiver.getFiles(AbstractArchiver.java:519)
	at org.apache.maven.plugin.source.AbstractSourceJarMojo.packageSources(AbstractSourceJarMojo.java:262)
	at org.apache.maven.plugin.source.AbstractSourceJarMojo.packageSources(AbstractSourceJarMojo.java:232)
	at org.apache.maven.plugin.source.AbstractSourceJarMojo.execute(AbstractSourceJarMojo.java:201)
	at org.apache.maven.plugin.DefaultPluginManager.executeMojo(DefaultPluginManager.java:490)
	at hudson.maven.agent.PluginManagerInterceptor.executeMojo(PluginManagerInterceptor.java:182)
	at org.apache.maven.lifecycle.DefaultLifecycleExecutor.executeGoals(DefaultLifecycleExecutor.java:694)
	at org.apache.maven.lifecycle.DefaultLifecycleExecutor.executeGoalWithLifecycle(DefaultLifecycleExecutor.java:556)
	at org.apache.maven.lifecycle.DefaultLifecycleExecutor.executeGoal(DefaultLifecycleExecutor.java:535)
	at org.apache.maven.lifecycle.DefaultLifecycleExecutor.executeGoalAndHandleFailures(DefaultLifecycleExecutor.java:387)
	at org.apache.maven.lifecycle.DefaultLifecycleExecutor.executeTaskSegments(DefaultLifecycleExecutor.java:348)
	at org.apache.maven.lifecycle.DefaultLifecycleExecutor.execute(DefaultLifecycleExecutor.java:180)
	at org.apache.maven.lifecycle.LifecycleExecutorInterceptor.execute(LifecycleExecutorInterceptor.java:65)
	at org.apache.maven.DefaultMaven.doExecute(DefaultMaven.java:328)
	at org.apache.maven.DefaultMaven.execute(DefaultMaven.java:138)
	at org.apache.maven.cli.MavenCli.main(MavenCli.java:362)
	at sun.reflect.NativeMethodAccessorImpl.invoke0(Native Method)
	at sun.reflect.NativeMethodAccessorImpl.invoke(NativeMethodAccessorImpl.java:39)
	at sun.reflect.DelegatingMethodAccessorImpl.invoke(DelegatingMethodAccessorImpl.java:25)
	at java.lang.reflect.Method.invoke(Method.java:597)
	at org.codehaus.classworlds.Launcher.launchEnhanced(Launcher.java:315)
	at org.codehaus.classworlds.Launcher.launch(Launcher.java:255)
	at hudson.maven.agent.Main.launch(Main.java:185)
	at hudson.maven.MavenBuilder.call(MavenBuilder.java:154)
	at hudson.maven.Maven2Builder.call(Maven2Builder.java:79)
	at hudson.maven.Maven2Builder.call(Maven2Builder.java:55)
	at hudson.remoting.UserRequest.perform(UserRequest.java:118)
	at hudson.remoting.UserRequest.perform(UserRequest.java:48)
	at hudson.remoting.Request$2.run(Request.java:326)
	at hudson.remoting.InterceptingExecutorService$1.call(InterceptingExecutorService.java:72)
	at java.util.concurrent.FutureTask$Sync.innerRun(FutureTask.java:303)
	at java.util.concurrent.FutureTask.run(FutureTask.java:138)
	at java.util.concurrent.ThreadPoolExecutor$Worker.runTask(ThreadPoolExecutor.java:886)
	at java.util.concurrent.ThreadPoolExecutor$Worker.run(ThreadPoolExecutor.java:908)
	at java.lang.Thread.run(Thread.java:662)
Caused by: org.codehaus.plexus.archiver.ArchiverException: Failed to retrieve numeric file
attributes using: '/bin/sh -c ls -1nlaR <https://builds.apache.org/job/myfaces-orchestra-core/ws/core/target/maven-shared-archive-resources'>
	at org.codehaus.plexus.archiver.AbstractArchiver$1.hasNext(AbstractArchiver.java:427)
	at org.codehaus.plexus.archiver.AbstractArchiver.getFiles(AbstractArchiver.java:507)
	... 34 more
Caused by: java.io.IOException: Failed to retrieve numeric file attributes using: '/bin/sh
-c ls -1nlaR <https://builds.apache.org/job/myfaces-orchestra-core/ws/core/target/maven-shared-archive-resources'>
	at org.codehaus.plexus.components.io.attributes.PlexusIoResourceAttributeUtils.executeLs(PlexusIoResourceAttributeUtils.java:287)
	at org.codehaus.plexus.components.io.attributes.PlexusIoResourceAttributeUtils.getFileAttributesByPath(PlexusIoResourceAttributeUtils.java:223)
	at org.codehaus.plexus.components.io.attributes.PlexusIoResourceAttributeUtils.getFileAttributesByPath(PlexusIoResourceAttributeUtils.java:189)
	at org.codehaus.plexus.components.io.resources.PlexusIoFileResourceCollection.getResources(PlexusIoFileResourceCollection.java:175)
	at org.codehaus.plexus.archiver.AbstractArchiver$1.hasNext(AbstractArchiver.java:423)
	... 35 more
Caused by: org.codehaus.plexus.util.cli.CommandLineException: Error while executing process.
	at org.codehaus.plexus.util.cli.Commandline.execute(Commandline.java:656)
	at org.codehaus.plexus.util.cli.CommandLineUtils.executeCommandLine(CommandLineUtils.java:144)
	at org.codehaus.plexus.util.cli.CommandLineUtils.executeCommandLine(CommandLineUtils.java:107)
	at org.codehaus.plexus.components.io.attributes.PlexusIoResourceAttributeUtils.executeLs(PlexusIoResourceAttributeUtils.java:277)
	... 39 more
Caused by: java.io.IOException: Cannot run program "/bin/sh": error=12, Not enough space
	at java.lang.ProcessBuilder.start(ProcessBuilder.java:460)
	at java.lang.Runtime.exec(Runtime.java:593)
	at java.lang.Runtime.exec(Runtime.java:509)
	at org.codehaus.plexus.util.cli.Commandline.execute(Commandline.java:636)
	... 42 more
Caused by: java.io.IOException: error=12, Not enough space
	at java.lang.UNIXProcess.forkAndExec(Native Method)
	at java.lang.UNIXProcess.<init>(UNIXProcess.java:53)
	at java.lang.ProcessImpl.start(ProcessImpl.java:65)
	at java.lang.ProcessBuilder.start(ProcessBuilder.java:453)
	... 45 more
[INFO] ------------------------------------------------------------------------
[INFO] Total time: 7 minutes 2 seconds
[INFO] Finished at: Wed Jul 17 00:31:34 GMT+00:00 2013
[INFO] Final Memory: 52M/371M
[INFO] ------------------------------------------------------------------------
channel stopped

Mime
View raw message