myfaces-commits mailing list archives

Site index · List index
Message view « Date » · « Thread »
Top « Date » · « Thread »
From Apache Jenkins Server <jenk...@builds.apache.org>
Subject Build failed in Jenkins: Myfaces-Orchestra #1096
Date Tue, 30 Jul 2013 23:26:20 GMT
See <https://builds.apache.org/job/Myfaces-Orchestra/1096/>

------------------------------------------
[...truncated 413 lines...]
	User: sa
	Database: Apache Derby  Version: 10.3.1.4 - (561794)
	Driver: Apache Derby Embedded JDBC Driver  Version: 10.3.1.4 - (561794)
[TopLink Info]: 2013.07.30 11:14:56.865--ServerSession(4837279)--Thread(Thread[main,5,main])--<https://builds.apache.org/job/Myfaces-Orchestra/ws/trunk/core/target/test-classes-default>
login successful
[TopLink Fine]: 2013.07.30 11:14:56.925--ServerSession(4837279)--Connection(346148)--Thread(Thread[main,5,main])--DROP
TABLE USERDATA
[TopLink Fine]: 2013.07.30 11:14:58.073--ServerSession(4837279)--Connection(18333931)--Thread(Thread[main,5,main])--CREATE
TABLE USERDATA (ID BIGINT GENERATED ALWAYS AS IDENTITY NOT NULL, USERNAME VARCHAR(255), VERSION
BIGINT, PRIMARY KEY (ID))
Jul 30, 2013 11:14:58 PM org.springframework.context.support.AbstractApplicationContext$BeanPostProcessorChecker
postProcessAfterInitialization
INFO: Bean 'org.springframework.aop.config.internalAutoProxyCreator' is not eligible for getting
processed by all BeanPostProcessors (for example: not eligible for auto-proxying)
Jul 30, 2013 11:14:58 PM org.springframework.context.support.AbstractApplicationContext$BeanPostProcessorChecker
postProcessAfterInitialization
INFO: Bean 'org.springframework.orm.jpa.support.PersistenceAnnotationBeanPostProcessor' is
not eligible for getting processed by all BeanPostProcessors (for example: not eligible for
auto-proxying)
Jul 30, 2013 11:14:58 PM org.springframework.context.support.AbstractApplicationContext$BeanPostProcessorChecker
postProcessAfterInitialization
INFO: Bean 'transactionManager' is not eligible for getting processed by all BeanPostProcessors
(for example: not eligible for auto-proxying)
Jul 30, 2013 11:14:58 PM org.springframework.context.support.AbstractApplicationContext$BeanPostProcessorChecker
postProcessAfterInitialization
INFO: Bean '(inner bean)' is not eligible for getting processed by all BeanPostProcessors
(for example: not eligible for auto-proxying)
Jul 30, 2013 11:14:58 PM org.springframework.context.support.AbstractApplicationContext$BeanPostProcessorChecker
postProcessAfterInitialization
INFO: Bean '(inner bean)' is not eligible for getting processed by all BeanPostProcessors
(for example: not eligible for auto-proxying)
Jul 30, 2013 11:14:58 PM org.springframework.context.support.AbstractApplicationContext$BeanPostProcessorChecker
postProcessAfterInitialization
INFO: Bean 'org.springframework.transaction.interceptor.TransactionAttributeSourceAdvisor'
is not eligible for getting processed by all BeanPostProcessors (for example: not eligible
for auto-proxying)
Jul 30, 2013 11:14:58 PM org.springframework.beans.factory.support.DefaultListableBeanFactory
preInstantiateSingletons
INFO: Pre-instantiating singletons in org.springframework.beans.factory.support.DefaultListableBeanFactory@136d9d8:
defining beans [org.springframework.beans.factory.config.CustomScopeConfigurer,persistentContextConversationInterceptor,persistentContextFactory,org.springframework.orm.jpa.support.PersistenceAnnotationBeanPostProcessor,org.springframework.aop.config.internalAutoProxyCreator,org.springframework.transaction.interceptor.TransactionAttributeSourceAdvisor,transactionManager,entityManagerFactory,scopedTarget.persistentBackingBean,persistentBackingBean,scopedTarget.dummyBean,dummyBean];
root of factory hierarchy
[TopLink Fine]: 2013.07.30 11:14:59.627--ClientSession(15953497)--Connection(22889075)--Thread(Thread[main,5,main])--INSERT
INTO USERDATA (USERNAME, VERSION) VALUES (?, ?)
	bind => [test, 1]
[TopLink Fine]: 2013.07.30 11:14:59.702--ClientSession(15953497)--Connection(22889075)--Thread(Thread[main,5,main])--values
IDENTITY_VAL_LOCAL()
[TopLink Fine]: 2013.07.30 11:14:59.792--ClientSession(27940994)--Connection(15463408)--Thread(Thread[main,5,main])--INSERT
INTO USERDATA (USERNAME, VERSION) VALUES (?, ?)
	bind => [test, 1]
[TopLink Fine]: 2013.07.30 11:14:59.793--ClientSession(27940994)--Connection(15463408)--Thread(Thread[main,5,main])--values
IDENTITY_VAL_LOCAL()
Tests run: 2, Failures: 0, Errors: 0, Skipped: 0, Time elapsed: 10.501 sec
Running org.apache.myfaces.orchestra.conversation.TestConversation
Tests run: 1, Failures: 0, Errors: 0, Skipped: 0, Time elapsed: 0.023 sec
Running org.apache.myfaces.orchestra.viewController.TestInterfaceViewControllerExecutor
Tests run: 1, Failures: 0, Errors: 0, Skipped: 0, Time elapsed: 1.02 sec
Running org.apache.myfaces.orchestra.viewController.TestReflectiveViewControllerExecutor
Tests run: 1, Failures: 0, Errors: 0, Skipped: 0, Time elapsed: 0.011 sec
Running org.apache.myfaces.orchestra.viewController.TestDefaultViewControllerNameMapper
Tests run: 1, Failures: 0, Errors: 0, Skipped: 0, Time elapsed: 0.049 sec
Running org.apache.myfaces.orchestra.requestParameterProvider.TestRequestParameterProviderManager
Tests run: 1, Failures: 0, Errors: 0, Skipped: 0, Time elapsed: 0.123 sec
Jul 30, 2013 11:15:01 PM org.springframework.context.support.AbstractApplicationContext doClose
INFO: Closing org.springframework.context.support.GenericApplicationContext@14a8cd1: display
name [org.springframework.context.support.GenericApplicationContext@14a8cd1]; startup date
[Tue Jul 30 23:14:47 GMT+00:00 2013]; root of context hierarchy
Jul 30, 2013 11:15:01 PM org.springframework.context.support.AbstractApplicationContext doClose
INFO: Closing org.springframework.context.support.GenericApplicationContext@1fcc0a2: display
name [org.springframework.context.support.GenericApplicationContext@1fcc0a2]; startup date
[Tue Jul 30 23:14:49 GMT+00:00 2013]; root of context hierarchy
Jul 30, 2013 11:15:01 PM org.springframework.context.support.AbstractApplicationContext doClose
INFO: Closing org.springframework.context.support.GenericApplicationContext@1d439fe: display
name [org.springframework.context.support.GenericApplicationContext@1d439fe]; startup date
[Tue Jul 30 23:14:48 GMT+00:00 2013]; root of context hierarchy
Jul 30, 2013 11:15:01 PM org.springframework.context.support.AbstractApplicationContext doClose
INFO: Closing org.springframework.context.support.GenericApplicationContext@1557c0: display
name [org.springframework.context.support.GenericApplicationContext@1557c0]; startup date
[Tue Jul 30 23:14:49 GMT+00:00 2013]; root of context hierarchy
[TopLink Config]: 2013.07.30 11:15:01.195--ServerSession(4837279)--Connection(18333931)--Thread(Thread[Thread-5,5,main])--disconnect
[TopLink Info]: 2013.07.30 11:15:01.196--ServerSession(4837279)--Thread(Thread[Thread-5,5,main])--<https://builds.apache.org/job/Myfaces-Orchestra/ws/trunk/core/target/test-classes-default>
logout successful
[TopLink Config]: 2013.07.30 11:15:01.196--ServerSession(4837279)--Connection(346148)--Thread(Thread[Thread-5,5,main])--disconnect
[TopLink Config]: 2013.07.30 11:15:01.197--ServerSession(4837279)--Connection(22472173)--Thread(Thread[Thread-5,5,main])--disconnect
[TopLink Config]: 2013.07.30 11:15:01.197--ServerSession(4837279)--Connection(24969062)--Thread(Thread[Thread-5,5,main])--disconnect
[TopLink Config]: 2013.07.30 11:15:01.198--ServerSession(4837279)--Connection(20235775)--Thread(Thread[Thread-5,5,main])--disconnect
[TopLink Config]: 2013.07.30 11:15:01.198--ServerSession(4837279)--Connection(2184190)--Thread(Thread[Thread-5,5,main])--disconnect
[TopLink Config]: 2013.07.30 11:15:01.199--ServerSession(4837279)--Connection(22889075)--Thread(Thread[Thread-5,5,main])--disconnect
[TopLink Config]: 2013.07.30 11:15:01.200--ServerSession(4837279)--Connection(15463408)--Thread(Thread[Thread-5,5,main])--disconnect

Results :

Tests run: 15, Failures: 0, Errors: 0, Skipped: 0

[JENKINS] Recording test results
[INFO] [jar:jar {execution: default-jar}]
[INFO] Building jar: <https://builds.apache.org/job/Myfaces-Orchestra/ws/trunk/core/target/myfaces-orchestra-core-1.6-SNAPSHOT.jar>
[INFO] Preparing source:jar
[WARNING] Removing: jar from forked lifecycle, to prevent recursive invocation.
[WARNING] DEPRECATED [tasks]: Use target instead
[JENKINS] Archiving <https://builds.apache.org/job/Myfaces-Orchestra/ws/trunk/core/pom.xml>
to /home/hudson/hudson/jobs/Myfaces-Orchestra/modules/org.apache.myfaces.orchestra$myfaces-orchestra-core/builds/2013-07-30_22-59-28/archive/org.apache.myfaces.orchestra/myfaces-orchestra-core/1.6-SNAPSHOT/myfaces-orchestra-core-1.6-SNAPSHOT.pom
[JENKINS] Archiving <https://builds.apache.org/job/Myfaces-Orchestra/ws/trunk/core/target/myfaces-orchestra-core-1.6-SNAPSHOT.jar>
to /home/hudson/hudson/jobs/Myfaces-Orchestra/modules/org.apache.myfaces.orchestra$myfaces-orchestra-core/builds/2013-07-30_22-59-28/archive/org.apache.myfaces.orchestra/myfaces-orchestra-core/1.6-SNAPSHOT/myfaces-orchestra-core-1.6-SNAPSHOT.jar
[INFO] [antrun:run {execution: javadoc.resources}]
[WARNING] Parameter tasks is deprecated, use target instead
[INFO] Executing tasks

main:
[INFO] Executed tasks
[INFO] [build-helper:add-source {execution: add-source}]
[INFO] Source directory: <https://builds.apache.org/job/Myfaces-Orchestra/ws/trunk/core/target/shared_sources>
added.
ERROR: Could not find local repository for 2.2.1
[INFO] [source:jar {execution: attach-source}]
[INFO] org already added, skipping
[INFO] org/apache already added, skipping
[INFO] org/apache/myfaces already added, skipping
[INFO] META-INF already added, skipping
[INFO] org already added, skipping
[INFO] org/apache already added, skipping
[INFO] org/apache/myfaces already added, skipping
[INFO] org/apache/myfaces/orchestra already added, skipping
[INFO] META-INF already added, skipping
[INFO] META-INF already added, skipping
[INFO] META-INF/NOTICE already added, skipping
[INFO] META-INF/DEPENDENCIES already added, skipping
[INFO] META-INF/LICENSE already added, skipping
[INFO] Building jar: <https://builds.apache.org/job/Myfaces-Orchestra/ws/trunk/core/target/myfaces-orchestra-core-1.6-SNAPSHOT-sources.jar>
[INFO] org already added, skipping
[INFO] org/apache already added, skipping
[INFO] org/apache/myfaces already added, skipping
[INFO] META-INF already added, skipping
[INFO] org already added, skipping
[INFO] org/apache already added, skipping
[INFO] org/apache/myfaces already added, skipping
[INFO] org/apache/myfaces/orchestra already added, skipping
[INFO] META-INF already added, skipping
[INFO] META-INF already added, skipping
[INFO] META-INF/NOTICE already added, skipping
[INFO] META-INF/DEPENDENCIES already added, skipping
[INFO] META-INF/LICENSE already added, skipping
[INFO] [checkstyle:check {execution: verify-style}]
[INFO] 
[INFO] [install:install {execution: default-install}]
[INFO] Installing <https://builds.apache.org/job/Myfaces-Orchestra/ws/trunk/core/target/myfaces-orchestra-core-1.6-SNAPSHOT.jar>
to /export/home/hudson/hudson-slave/maven-repositories/1/org/apache/myfaces/orchestra/myfaces-orchestra-core/1.6-SNAPSHOT/myfaces-orchestra-core-1.6-SNAPSHOT.jar
[INFO] Installing <https://builds.apache.org/job/Myfaces-Orchestra/ws/trunk/core/target/myfaces-orchestra-core-1.6-SNAPSHOT-sources.jar>
to /export/home/hudson/hudson-slave/maven-repositories/1/org/apache/myfaces/orchestra/myfaces-orchestra-core/1.6-SNAPSHOT/myfaces-orchestra-core-1.6-SNAPSHOT-sources.jar
[WARNING] DEPRECATED [tasks]: Use target instead
[INFO] [antrun:run {execution: javadoc.resources}]
[WARNING] Parameter tasks is deprecated, use target instead
[INFO] Executing tasks

main:
[INFO] Executed tasks
[INFO] [build-helper:add-source {execution: add-source}]
[INFO] Source directory: <https://builds.apache.org/job/Myfaces-Orchestra/ws/trunk/core/target/shared_sources>
added.
[INFO] [dependency:unpack {execution: unpack-shared-impl-sources}]
[INFO] Configured Artifact: org.apache.myfaces.shared:myfaces-shared-orchestra:sources:2.0.13:jar
[INFO] Unpacking /export/home/hudson/hudson-slave/maven-repositories/1/org/apache/myfaces/shared/myfaces-shared-orchestra/2.0.13/myfaces-shared-orchestra-2.0.13-sources.jar
to <https://builds.apache.org/job/Myfaces-Orchestra/ws/trunk/core/target/shared_sources>
with includes "" and excludes "META-INF/*"
[INFO] [xslt:transform {execution: default}]
[INFO] # of XML files: 1
[INFO] file up-to-date: <https://builds.apache.org/job/Myfaces-Orchestra/ws/trunk/core/target/classes/META-INF/myfaces_orchestra.tld>
[INFO] [remote-resources:process {execution: default}]
[debug] execute contextualize
[INFO] [resources:resources {execution: default-resources}]
[INFO] Using 'UTF-8' encoding to copy filtered resources.
[INFO] Copying 2 resources to META-INF
[INFO] Copying 6 resources
[INFO] Copying 3 resources
[INFO] Copying 3 resources
[INFO] [compiler:compile {execution: default-compile}]
[INFO] Nothing to compile - all classes are up to date
[debug] execute contextualize
[INFO] [resources:testResources {execution: default-testResources}]
[INFO] Using 'UTF-8' encoding to copy filtered resources.
[INFO] Copying 6 resources
[INFO] Copying 3 resources
[INFO] Copying 3 resources
[INFO] [compiler:testCompile {execution: default-testCompile}]
[INFO] Nothing to compile - all classes are up to date
[INFO] [surefire:test {execution: default-test}]
[JENKINS] Recording test results[INFO] Skipping execution of surefire because it has already
been run for this configuration

[INFO] [jar:jar {execution: default-jar}]
[INFO] Building jar: <https://builds.apache.org/job/Myfaces-Orchestra/ws/trunk/core/target/myfaces-orchestra-core-1.6-SNAPSHOT.jar>
[INFO] Preparing source:jar
[WARNING] Removing: jar from forked lifecycle, to prevent recursive invocation.
[WARNING] DEPRECATED [tasks]: Use target instead
[JENKINS] Re-archiving <https://builds.apache.org/job/Myfaces-Orchestra/ws/trunk/core/target/myfaces-orchestra-core-1.6-SNAPSHOT.jar>
[JENKINS] Archiving <https://builds.apache.org/job/Myfaces-Orchestra/ws/trunk/core/target/myfaces-orchestra-core-1.6-SNAPSHOT-sources.jar>
to /home/hudson/hudson/jobs/Myfaces-Orchestra/modules/org.apache.myfaces.orchestra$myfaces-orchestra-core/builds/2013-07-30_22-59-28/archive/org.apache.myfaces.orchestra/myfaces-orchestra-core/1.6-SNAPSHOT/myfaces-orchestra-core-1.6-SNAPSHOT-sources.jar
[INFO] [antrun:run {execution: javadoc.resources}]
[WARNING] Parameter tasks is deprecated, use target instead
[INFO] Executing tasks

main:
[INFO] Executed tasks
[INFO] [build-helper:add-source {execution: add-source}]
[INFO] Source directory: <https://builds.apache.org/job/Myfaces-Orchestra/ws/trunk/core/target/shared_sources>
added.
ERROR: Could not find local repository for 2.2.1
[INFO] [source:jar {execution: attach-source}]
[INFO] META-INF already added, skipping
[INFO] META-INF/NOTICE already added, skipping
[INFO] META-INF/DEPENDENCIES already added, skipping
[INFO] META-INF/LICENSE already added, skipping
[INFO] org already added, skipping
[INFO] org/apache already added, skipping
[INFO] org/apache/myfaces already added, skipping
[INFO] META-INF already added, skipping
[INFO] ------------------------------------------------------------------------
[ERROR] FATAL ERROR
[INFO] ------------------------------------------------------------------------
[INFO] null
error=12, Not enough space
[INFO] ------------------------------------------------------------------------
[INFO] Trace
java.lang.reflect.UndeclaredThrowableException
	at org.codehaus.plexus.archiver.AbstractArchiver.getFiles(AbstractArchiver.java:519)
	at org.apache.maven.plugin.source.AbstractSourceJarMojo.packageSources(AbstractSourceJarMojo.java:262)
	at org.apache.maven.plugin.source.AbstractSourceJarMojo.packageSources(AbstractSourceJarMojo.java:232)
	at org.apache.maven.plugin.source.AbstractSourceJarMojo.execute(AbstractSourceJarMojo.java:201)
	at org.apache.maven.plugin.DefaultPluginManager.executeMojo(DefaultPluginManager.java:490)
	at hudson.maven.agent.PluginManagerInterceptor.executeMojo(PluginManagerInterceptor.java:182)
	at org.apache.maven.lifecycle.DefaultLifecycleExecutor.executeGoals(DefaultLifecycleExecutor.java:694)
	at org.apache.maven.lifecycle.DefaultLifecycleExecutor.executeGoalWithLifecycle(DefaultLifecycleExecutor.java:556)
	at org.apache.maven.lifecycle.DefaultLifecycleExecutor.executeGoal(DefaultLifecycleExecutor.java:535)
	at org.apache.maven.lifecycle.DefaultLifecycleExecutor.executeGoalAndHandleFailures(DefaultLifecycleExecutor.java:387)
	at org.apache.maven.lifecycle.DefaultLifecycleExecutor.executeTaskSegments(DefaultLifecycleExecutor.java:348)
	at org.apache.maven.lifecycle.DefaultLifecycleExecutor.execute(DefaultLifecycleExecutor.java:180)
	at org.apache.maven.lifecycle.LifecycleExecutorInterceptor.execute(LifecycleExecutorInterceptor.java:65)
	at org.apache.maven.DefaultMaven.doExecute(DefaultMaven.java:328)
	at org.apache.maven.DefaultMaven.execute(DefaultMaven.java:138)
	at org.apache.maven.cli.MavenCli.main(MavenCli.java:362)
	at sun.reflect.NativeMethodAccessorImpl.invoke0(Native Method)
	at sun.reflect.NativeMethodAccessorImpl.invoke(NativeMethodAccessorImpl.java:39)
	at sun.reflect.DelegatingMethodAccessorImpl.invoke(DelegatingMethodAccessorImpl.java:25)
	at java.lang.reflect.Method.invoke(Method.java:597)
	at org.codehaus.classworlds.Launcher.launchEnhanced(Launcher.java:315)
	at org.codehaus.classworlds.Launcher.launch(Launcher.java:255)
	at hudson.maven.agent.Main.launch(Main.java:204)
	at hudson.maven.MavenBuilder.call(MavenBuilder.java:154)
	at hudson.maven.Maven2Builder.call(Maven2Builder.java:79)
	at hudson.maven.Maven2Builder.call(Maven2Builder.java:55)
	at hudson.remoting.UserRequest.perform(UserRequest.java:118)
	at hudson.remoting.UserRequest.perform(UserRequest.java:48)
	at hudson.remoting.Request$2.run(Request.java:326)
	at hudson.remoting.InterceptingExecutorService$1.call(InterceptingExecutorService.java:72)
	at java.util.concurrent.FutureTask$Sync.innerRun(FutureTask.java:303)
	at java.util.concurrent.FutureTask.run(FutureTask.java:138)
	at java.util.concurrent.ThreadPoolExecutor$Worker.runTask(ThreadPoolExecutor.java:886)
	at java.util.concurrent.ThreadPoolExecutor$Worker.run(ThreadPoolExecutor.java:908)
	at java.lang.Thread.run(Thread.java:662)
Caused by: org.codehaus.plexus.archiver.ArchiverException: Failed to retrieve numeric file
attributes using: '/bin/sh -c ls -1nlaR <https://builds.apache.org/job/Myfaces-Orchestra/ws/trunk/core/src/main/resources'>
	at org.codehaus.plexus.archiver.AbstractArchiver$1.hasNext(AbstractArchiver.java:427)
	at org.codehaus.plexus.archiver.AbstractArchiver$1.hasNext(AbstractArchiver.java:453)
	at org.codehaus.plexus.archiver.AbstractArchiver.getFiles(AbstractArchiver.java:507)
	... 34 more
Caused by: java.io.IOException: Failed to retrieve numeric file attributes using: '/bin/sh
-c ls -1nlaR <https://builds.apache.org/job/Myfaces-Orchestra/ws/trunk/core/src/main/resources'>
	at org.codehaus.plexus.components.io.attributes.PlexusIoResourceAttributeUtils.executeLs(PlexusIoResourceAttributeUtils.java:287)
	at org.codehaus.plexus.components.io.attributes.PlexusIoResourceAttributeUtils.getFileAttributesByPath(PlexusIoResourceAttributeUtils.java:223)
	at org.codehaus.plexus.components.io.attributes.PlexusIoResourceAttributeUtils.getFileAttributesByPath(PlexusIoResourceAttributeUtils.java:189)
	at org.codehaus.plexus.components.io.resources.PlexusIoFileResourceCollection.getResources(PlexusIoFileResourceCollection.java:175)
	at org.codehaus.plexus.archiver.AbstractArchiver$1.hasNext(AbstractArchiver.java:423)
	... 36 more
Caused by: org.codehaus.plexus.util.cli.CommandLineException: Error while executing process.
	at org.codehaus.plexus.util.cli.Commandline.execute(Commandline.java:656)
	at org.codehaus.plexus.util.cli.CommandLineUtils.executeCommandLine(CommandLineUtils.java:144)
	at org.codehaus.plexus.util.cli.CommandLineUtils.executeCommandLine(CommandLineUtils.java:107)
	at org.codehaus.plexus.components.io.attributes.PlexusIoResourceAttributeUtils.executeLs(PlexusIoResourceAttributeUtils.java:277)
	... 40 more
Caused by: java.io.IOException: Cannot run program "/bin/sh": error=12, Not enough space
	at java.lang.ProcessBuilder.start(ProcessBuilder.java:460)
	at java.lang.Runtime.exec(Runtime.java:593)
	at java.lang.Runtime.exec(Runtime.java:509)
	at org.codehaus.plexus.util.cli.Commandline.execute(Commandline.java:636)
	... 43 more
Caused by: java.io.IOException: error=12, Not enough space
	at java.lang.UNIXProcess.forkAndExec(Native Method)
	at java.lang.UNIXProcess.<init>(UNIXProcess.java:53)
	at java.lang.ProcessImpl.start(ProcessImpl.java:65)
	at java.lang.ProcessBuilder.start(ProcessBuilder.java:453)
	... 46 more
[INFO] ------------------------------------------------------------------------
[INFO] Total time: 21 minutes 48 seconds
[INFO] Finished at: Tue Jul 30 23:26:23 GMT+00:00 2013
[INFO] Final Memory: 76M/408M
[INFO] ------------------------------------------------------------------------
channel stopped

Mime
View raw message