myfaces-commits mailing list archives

Site index · List index
Message view « Date » · « Thread »
Top « Date » · « Thread »
From Apache Jenkins Server <jenk...@builds.apache.org>
Subject Build failed in Jenkins: myfaces-current12 #940
Date Wed, 31 Jul 2013 12:18:17 GMT
See <https://builds.apache.org/job/myfaces-current12/940/>

------------------------------------------
[...truncated 1424 lines...]
WARNING: No Renderer found for component {Component-Path : [Class: javax.faces.component.UIViewRoot,ViewId:
null][Class: javax.faces.component.UIForm,Id: formId]} (component-family=javax.faces.Form,
renderer-type=javax.faces.Form)
Jul 31, 2013 12:07:13 PM javax.faces.component.UIComponentBase getClientId
WARNING: WARNING: Component formId:j_id0 just got an automatic id, because there was no id
assigned yet. If this component was created dynamically (i.e. not by a JSP tag) you should
assign it an explicit static id or assign it the id you get from the createUniqueId from the
current UIViewRoot component right after creation! Path to Component: {Component-Path : [Class:
javax.faces.component.UIViewRoot,ViewId: null][Class: javax.faces.component.UIForm,Id: formId][Class:
javax.faces.component.html.HtmlInputText,Id: j_id0]}
Jul 31, 2013 12:07:13 PM javax.faces.component.UIComponentBase getClientId
WARNING: WARNING: Component j_id0 just got an automatic id, because there was no id assigned
yet. If this component was created dynamically (i.e. not by a JSP tag) you should assign it
an explicit static id or assign it the id you get from the createUniqueId from the current
UIViewRoot component right after creation! Path to Component: {Component-Path : [Class: javax.faces.component.html.HtmlInputTextarea,Id:
j_id0]}
Jul 31, 2013 12:07:13 PM javax.faces.component.UIComponentBase getClientId
WARNING: WARNING: Component j_id0 just got an automatic id, because there was no id assigned
yet. If this component was created dynamically (i.e. not by a JSP tag) you should assign it
an explicit static id or assign it the id you get from the createUniqueId from the current
UIViewRoot component right after creation! Path to Component: {Component-Path : [Class: javax.faces.component.html.HtmlInputTextarea,Id:
j_id0]}
Jul 31, 2013 12:07:13 PM javax.faces.component.UIComponentBase getClientId
WARNING: WARNING: Component j_id0 just got an automatic id, because there was no id assigned
yet. If this component was created dynamically (i.e. not by a JSP tag) you should assign it
an explicit static id or assign it the id you get from the createUniqueId from the current
UIViewRoot component right after creation! Path to Component: {Component-Path : [Class: javax.faces.component.html.HtmlInputTextarea,Id:
j_id0]}
Jul 31, 2013 12:07:13 PM javax.faces.component.UIComponentBase getClientId
WARNING: WARNING: Component j_id0 just got an automatic id, because there was no id assigned
yet. If this component was created dynamically (i.e. not by a JSP tag) you should assign it
an explicit static id or assign it the id you get from the createUniqueId from the current
UIViewRoot component right after creation! Path to Component: {Component-Path : [Class: javax.faces.component.html.HtmlInputText,Id:
j_id0]}
Jul 31, 2013 12:07:13 PM org.apache.myfaces.webapp.AbstractFacesInitializer initFaces
SEVERE: An error occured while initializing MyFaces: null
java.lang.NullPointerException
	at org.apache.myfaces.shared_impl.webapp.webxml.WebXml.getWebXml(WebXml.java:225)
	at org.apache.myfaces.webapp.AbstractFacesInitializer.initFaces(AbstractFacesInitializer.java:80)
	at org.apache.myfaces.webapp.Jsp21FacesInitializerTest.testInitFaces(Jsp21FacesInitializerTest.java:91)
	at sun.reflect.NativeMethodAccessorImpl.invoke0(Native Method)
	at sun.reflect.NativeMethodAccessorImpl.invoke(NativeMethodAccessorImpl.java:39)
	at sun.reflect.DelegatingMethodAccessorImpl.invoke(DelegatingMethodAccessorImpl.java:25)
	at java.lang.reflect.Method.invoke(Method.java:597)
	at org.testng.internal.MethodHelper.invokeMethod(MethodHelper.java:552)
	at org.testng.internal.Invoker.invokeMethod(Invoker.java:411)
	at org.testng.internal.Invoker.invokeTestMethods(Invoker.java:785)
	at org.testng.internal.TestMethodWorker.run(TestMethodWorker.java:114)
	at org.testng.TestRunner.privateRun(TestRunner.java:693)
	at org.testng.TestRunner.run(TestRunner.java:574)
	at org.testng.SuiteRunner.privateRun(SuiteRunner.java:241)
	at org.testng.SuiteRunner.run(SuiteRunner.java:145)
	at org.testng.TestNG.createAndRunSuiteRunners(TestNG.java:901)
	at org.testng.TestNG.runSuitesLocally(TestNG.java:863)
	at org.testng.TestNG.run(TestNG.java:613)
	at org.apache.maven.surefire.testng.TestNGExecutor.run(TestNGExecutor.java:62)
	at org.apache.maven.surefire.testng.TestNGDirectoryTestSuite.execute(TestNGDirectoryTestSuite.java:155)
	at org.apache.maven.surefire.Surefire.run(Surefire.java:180)
	at sun.reflect.NativeMethodAccessorImpl.invoke0(Native Method)
	at sun.reflect.NativeMethodAccessorImpl.invoke(NativeMethodAccessorImpl.java:39)
	at sun.reflect.DelegatingMethodAccessorImpl.invoke(DelegatingMethodAccessorImpl.java:25)
	at java.lang.reflect.Method.invoke(Method.java:597)
	at org.apache.maven.surefire.booter.SurefireBooter.runSuitesInProcess(SurefireBooter.java:350)
	at org.apache.maven.surefire.booter.SurefireBooter.main(SurefireBooter.java:1021)
Tests run: 143, Failures: 0, Errors: 0, Skipped: 0, Time elapsed: 1.571 sec

Results :

Tests run: 143, Failures: 0, Errors: 0, Skipped: 0

[INFO] [jar:jar {execution: default-jar}]
[INFO] Building jar: <https://builds.apache.org/job/myfaces-current12/ws/current12/core/impl/target/myfaces-impl-1.2.13-SNAPSHOT.jar>
[INFO] Preparing source:jar
[WARNING] Removing: jar from forked lifecycle, to prevent recursive invocation.
[JENKINS] Archiving <https://builds.apache.org/job/myfaces-current12/ws/current12/core/impl/pom.xml>
to /home/hudson/hudson/jobs/myfaces-current12/modules/org.apache.myfaces.core$myfaces-impl/builds/2013-07-31_12-05-37/archive/org.apache.myfaces.core/myfaces-impl/1.2.13-SNAPSHOT/myfaces-impl-1.2.13-SNAPSHOT.pom
[JENKINS] Archiving <https://builds.apache.org/job/myfaces-current12/ws/current12/core/impl/target/myfaces-impl-1.2.13-SNAPSHOT.jar>
to /home/hudson/hudson/jobs/myfaces-current12/modules/org.apache.myfaces.core$myfaces-impl/builds/2013-07-31_12-05-37/archive/org.apache.myfaces.core/myfaces-impl/1.2.13-SNAPSHOT/myfaces-impl-1.2.13-SNAPSHOT.jar
[INFO] [myfaces-builder:build-metadata {execution: makemyfacesmetadata}]
Artifact: myfaces-api-1.2.13-SNAPSHOT.jar have META-INF/myfaces-metadata.xml
[INFO] [myfaces-builder:make-config {execution: makefacesconfig}]
[WARNING] *******************************************************************
[WARNING] RuntimeInstance initializing.
[WARNING] Default ResourceManager initializing. (class org.apache.velocity.runtime.resource.ResourceManagerImpl)
[WARNING] FileResourceLoader : initialization starting.
[WARNING] FileResourceLoader : initialization complete.
[WARNING] RelativeClasspathResourceLoader : initialization complete.
[INFO] RelativeClasspathResourceLoader : adding path 'META-INF'
[WARNING] RelativeClasspathResourceLoader : initialization complete.
[WARNING] Default ResourceManager initialization complete.
[WARNING] Velocimacro : initialization starting.
[WARNING] Velocimacro : VM library registration complete.
[WARNING] Velocimacro : Velocimacro : initialization complete.
[WARNING] RuntimeInstance successfully initialized.
[INFO] using base content file: <https://builds.apache.org/job/myfaces-current12/ws/current12/core/impl/src/main/conf/META-INF/standard-faces-config-base.xml>
[INFO] [myfaces-builder:make-tags {execution: make_tags}]
[INFO] Using template from file loader: <https://builds.apache.org/job/myfaces-current12/ws/current12/core/impl/src/main/resources/META-INF/tagClass12.vm>
[WARNING] *******************************************************************
[WARNING] RuntimeInstance initializing.
[WARNING] Default ResourceManager initializing. (class org.apache.velocity.runtime.resource.ResourceManagerImpl)
[WARNING] FileResourceLoader : initialization starting.
[WARNING] FileResourceLoader : initialization complete.
[WARNING] RelativeClasspathResourceLoader : initialization complete.
[INFO] RelativeClasspathResourceLoader : adding path 'META-INF'
[WARNING] RelativeClasspathResourceLoader : initialization complete.
[WARNING] Default ResourceManager initialization complete.
[WARNING] Velocimacro : initialization starting.
[WARNING] Velocimacro : VM library registration complete.
[WARNING] Velocimacro : Velocimacro : initialization complete.
[WARNING] RuntimeInstance successfully initialized.
[INFO] Generating tag class:org.apache.myfaces.taglib.html.HtmlInputHiddenTag
[INFO] Generating tag class:org.apache.myfaces.taglib.html.HtmlColumnTag
[INFO] Generating tag class:org.apache.myfaces.taglib.html.HtmlCommandButtonTag
[INFO] Generating tag class:org.apache.myfaces.taglib.html.HtmlCommandLinkTag
[INFO] Generating tag class:org.apache.myfaces.taglib.html.HtmlDataTableTag
[INFO] Generating tag class:org.apache.myfaces.taglib.html.HtmlFormTag
[INFO] Generating tag class:org.apache.myfaces.taglib.html.HtmlGraphicImageTag
[INFO] Generating tag class:org.apache.myfaces.taglib.html.HtmlInputSecretTag
[INFO] Generating tag class:org.apache.myfaces.taglib.html.HtmlInputTextTag
[INFO] Generating tag class:org.apache.myfaces.taglib.html.HtmlInputTextareaTag
[INFO] Generating tag class:org.apache.myfaces.taglib.html.HtmlMessageTag
[INFO] Generating tag class:org.apache.myfaces.taglib.html.HtmlMessagesTag
[INFO] Generating tag class:org.apache.myfaces.taglib.html.HtmlOutputFormatTag
[INFO] Generating tag class:org.apache.myfaces.taglib.html.HtmlOutputLabelTag
[INFO] Generating tag class:org.apache.myfaces.taglib.html.HtmlOutputLinkTag
[INFO] Generating tag class:org.apache.myfaces.taglib.html.HtmlOutputTextTag
[INFO] Generating tag class:org.apache.myfaces.taglib.html.HtmlPanelGridTag
[INFO] Generating tag class:org.apache.myfaces.taglib.html.HtmlPanelGroupTag
[INFO] Generating tag class:org.apache.myfaces.taglib.html.HtmlSelectBooleanCheckboxTag
[INFO] Generating tag class:org.apache.myfaces.taglib.html.HtmlSelectManyCheckboxTag
[INFO] Generating tag class:org.apache.myfaces.taglib.html.HtmlSelectManyListboxTag
[INFO] Generating tag class:org.apache.myfaces.taglib.html.HtmlSelectManyMenuTag
[INFO] Generating tag class:org.apache.myfaces.taglib.html.HtmlSelectOneListboxTag
[INFO] Generating tag class:org.apache.myfaces.taglib.html.HtmlSelectOneMenuTag
[INFO] Generating tag class:org.apache.myfaces.taglib.html.HtmlSelectOneRadioTag
[INFO] [myfaces-builder:make-config {execution: makecoretld}]
[WARNING] *******************************************************************
[WARNING] RuntimeInstance initializing.
[WARNING] Default ResourceManager initializing. (class org.apache.velocity.runtime.resource.ResourceManagerImpl)
[WARNING] FileResourceLoader : initialization starting.
[WARNING] FileResourceLoader : initialization complete.
[WARNING] RelativeClasspathResourceLoader : initialization complete.
[INFO] RelativeClasspathResourceLoader : adding path 'META-INF'
[WARNING] RelativeClasspathResourceLoader : initialization complete.
[WARNING] Default ResourceManager initialization complete.
[WARNING] Velocimacro : initialization starting.
[WARNING] Velocimacro : VM library registration complete.
[WARNING] Velocimacro : Velocimacro : initialization complete.
[WARNING] RuntimeInstance successfully initialized.
[INFO] using base content file: <https://builds.apache.org/job/myfaces-current12/ws/current12/core/impl/src/main/conf/META-INF/myfaces_core-base.tld>
[INFO] [myfaces-builder:make-config {execution: makehtmltld}]
[WARNING] *******************************************************************
[WARNING] RuntimeInstance initializing.
[WARNING] Default ResourceManager initializing. (class org.apache.velocity.runtime.resource.ResourceManagerImpl)
[WARNING] FileResourceLoader : initialization starting.
[WARNING] FileResourceLoader : initialization complete.
[WARNING] RelativeClasspathResourceLoader : initialization complete.
[INFO] RelativeClasspathResourceLoader : adding path 'META-INF'
[WARNING] RelativeClasspathResourceLoader : initialization complete.
[WARNING] Default ResourceManager initialization complete.
[WARNING] Velocimacro : initialization starting.
[WARNING] Velocimacro : VM library registration complete.
[WARNING] Velocimacro : Velocimacro : initialization complete.
[WARNING] RuntimeInstance successfully initialized.
[INFO] using base content file: <https://builds.apache.org/job/myfaces-current12/ws/current12/core/impl/src/main/conf/META-INF/myfaces_html-base.tld>
ERROR: Could not find local repository for 2.2.1
[INFO] [source:jar {execution: attach-source}]
[INFO] Building jar: <https://builds.apache.org/job/myfaces-current12/ws/current12/core/impl/target/myfaces-impl-1.2.13-SNAPSHOT-sources.jar>
[INFO] [checkstyle:check {execution: verify-style}]
[INFO] 
[INFO] [install:install {execution: default-install}]
[INFO] Installing <https://builds.apache.org/job/myfaces-current12/ws/current12/core/impl/target/myfaces-impl-1.2.13-SNAPSHOT.jar>
to /home/jenkins/jenkins-slave/maven-repositories/0/org/apache/myfaces/core/myfaces-impl/1.2.13-SNAPSHOT/myfaces-impl-1.2.13-SNAPSHOT.jar
[INFO] Installing <https://builds.apache.org/job/myfaces-current12/ws/current12/core/impl/target/myfaces-impl-1.2.13-SNAPSHOT-sources.jar>
to /home/jenkins/jenkins-slave/maven-repositories/0/org/apache/myfaces/core/myfaces-impl/1.2.13-SNAPSHOT/myfaces-impl-1.2.13-SNAPSHOT-sources.jar
[JENKINS] Archiving <https://builds.apache.org/job/myfaces-current12/ws/current12/core/impl/target/myfaces-impl-1.2.13-SNAPSHOT-sources.jar>
to /home/hudson/hudson/jobs/myfaces-current12/modules/org.apache.myfaces.core$myfaces-impl/builds/2013-07-31_12-05-37/archive/org.apache.myfaces.core/myfaces-impl/1.2.13-SNAPSHOT/myfaces-impl-1.2.13-SNAPSHOT-sources.jar
[INFO] ------------------------------------------------------------------------
[INFO] Building Build Project
[INFO]    task-segment: [install]
[INFO] ------------------------------------------------------------------------
[INFO] Setting property: classpath.resource.loader.class => 'org.codehaus.plexus.velocity.ContextClassLoaderResourceLoader'.
[INFO] Setting property: velocimacro.messages.on => 'false'.
[INFO] Setting property: resource.loader => 'classpath'.
[INFO] Setting property: resource.manager.logwhenfound => 'false'.
[INFO] [remote-resources:process {execution: default}]
[INFO] [site:attach-descriptor {execution: default-attach-descriptor}]
[INFO] [install:install {execution: default-install}]
[INFO] Installing <https://builds.apache.org/job/myfaces-current12/ws/current12/pom.xml>
to /home/jenkins/jenkins-slave/maven-repositories/0/org/apache/myfaces/myfaces-base/1.2.10-SNAPSHOT/myfaces-base-1.2.10-SNAPSHOT.pom
[JENKINS] Archiving <https://builds.apache.org/job/myfaces-current12/ws/current12/pom.xml>
to /home/hudson/hudson/jobs/myfaces-current12/modules/org.apache.myfaces$myfaces-base/builds/2013-07-31_12-05-37/archive/org.apache.myfaces/myfaces-base/1.2.10-SNAPSHOT/myfaces-base-1.2.10-SNAPSHOT.pom
[INFO] 
[INFO] 
[INFO] ------------------------------------------------------------------------
[INFO] Reactor Summary:
[INFO] ------------------------------------------------------------------------
[INFO] Apache MyFaces JSF-1.2 Core Project ................... SUCCESS [4.188s]
[INFO] Apache Myfaces JSF Core-1.2 API ....................... SUCCESS [15.796s]
[INFO] Apache MyFaces Shared For JSF 1.2 - Project ........... SUCCESS [0.424s]
[INFO] Apache MyFaces Shared For JSF 1.2 - Core .............. SUCCESS [6.007s]
[INFO] MyFaces Shared Impl ................................... SUCCESS [5.835s]
[INFO] MyFaces Shared Tomahawk ............................... SUCCESS [43.276s]
[INFO] Apache MyFaces JSF-1.2 Core Impl ...................... SUCCESS [17.327s]
[INFO] Build Project ......................................... SUCCESS [1.364s]
[INFO] ------------------------------------------------------------------------
[INFO] ------------------------------------------------------------------------
[INFO] BUILD SUCCESSFUL
[INFO] ------------------------------------------------------------------------
[INFO] Total time: 1 minute 38 seconds
[INFO] Finished at: Wed Jul 31 12:07:20 UTC 2013
[INFO] Final Memory: 109M/420M
[INFO] ------------------------------------------------------------------------
Waiting for Jenkins to finish collecting data
channel stopped
Maven RedeployPublisher use remote ubuntu3 maven settings from : /home/jenkins/.m2/settings.xml
[INFO] Deployment in https://repository.apache.org/content/repositories/snapshots (id=apache.snapshots.https,uniqueVersion=false)
Deploying the main artifact myfaces-base-1.2.10-SNAPSHOT.pom
[INFO] Deployment in https://repository.apache.org/content/repositories/snapshots (id=apache.snapshots.https,uniqueVersion=false)
Deploying the main artifact myfaces-api-1.2.13-SNAPSHOT.jar
Deploying the main artifact myfaces-api-1.2.13-SNAPSHOT-sources.jar
Deploying the main artifact myfaces-api-1.2.13-SNAPSHOT-tests.jar
[INFO] Deployment in https://repository.apache.org/content/repositories/snapshots (id=apache.snapshots.https,uniqueVersion=false)
Deploying the main artifact myfaces-core-project-1.2.13-SNAPSHOT.pom
Deploying the main artifact myfaces-core-project-1.2.13-SNAPSHOT-site.xml
[INFO] Deployment in https://repository.apache.org/content/repositories/snapshots (id=apache.snapshots.https,uniqueVersion=false)
Deploying the main artifact myfaces-impl-1.2.13-SNAPSHOT.jar
Deploying the main artifact myfaces-impl-1.2.13-SNAPSHOT-sources.jar
[INFO] Deployment in https://repository.apache.org/content/repositories/snapshots (id=apache.snapshots.https,uniqueVersion=false)
Deploying the main artifact myfaces-shared-core-3.0.13-SNAPSHOT.jar
Deploying the main artifact myfaces-shared-core-3.0.13-SNAPSHOT-sources.jar
[INFO] Deployment in https://repository.apache.org/content/repositories/snapshots (id=apache.snapshots.https,uniqueVersion=false)
Deploying the main artifact myfaces-shared-impl-3.0.13-SNAPSHOT.jar
Deploying the main artifact myfaces-shared-impl-3.0.13-SNAPSHOT-sources.jar
ERROR: Error installing artifact's metadata: Error while deploying metadata: The target server
failed to respond
org.apache.maven.artifact.deployer.ArtifactDeploymentException: Error installing artifact's
metadata: Error while deploying metadata: The target server failed to respond
	at hudson.maven.artifact.deployer.DefaultArtifactDeployer.deploy(DefaultArtifactDeployer.java:183)
	at hudson.maven.reporters.MavenArtifactRecord.deploy(MavenArtifactRecord.java:195)
	at hudson.maven.RedeployPublisher.perform(RedeployPublisher.java:176)
	at hudson.tasks.BuildStepMonitor$1.perform(BuildStepMonitor.java:19)
	at hudson.model.AbstractBuild$AbstractBuildExecution.perform(AbstractBuild.java:804)
	at hudson.model.AbstractBuild$AbstractBuildExecution.performAllBuildSteps(AbstractBuild.java:776)
	at hudson.maven.MavenModuleSetBuild$MavenModuleSetBuildExecution.post2(MavenModuleSetBuild.java:995)
	at hudson.model.AbstractBuild$AbstractBuildExecution.post(AbstractBuild.java:726)
	at hudson.model.Run.execute(Run.java:1618)
	at hudson.maven.MavenModuleSetBuild.run(MavenModuleSetBuild.java:495)
	at hudson.model.ResourceController.execute(ResourceController.java:88)
	at hudson.model.Executor.run(Executor.java:247)
Caused by: org.apache.maven.artifact.repository.metadata.RepositoryMetadataDeploymentException:
Error while deploying metadata: The target server failed to respond
	at org.apache.maven.artifact.repository.metadata.DefaultRepositoryMetadataManager.deploy(DefaultRepositoryMetadataManager.java:492)
	at hudson.maven.artifact.deployer.DefaultArtifactDeployer.deploy(DefaultArtifactDeployer.java:167)
	... 11 more
Caused by: org.apache.maven.wagon.TransferFailedException: The target server failed to respond
	at org.apache.maven.wagon.shared.http4.AbstractHttpClientWagon.put(AbstractHttpClientWagon.java:580)
	at org.apache.maven.wagon.shared.http4.AbstractHttpClientWagon.put(AbstractHttpClientWagon.java:524)
	at org.apache.maven.wagon.shared.http4.AbstractHttpClientWagon.put(AbstractHttpClientWagon.java:505)
	at org.apache.maven.wagon.shared.http4.AbstractHttpClientWagon.put(AbstractHttpClientWagon.java:485)
	at org.apache.maven.repository.legacy.DefaultWagonManager.putRemoteFile(DefaultWagonManager.java:543)
	at org.apache.maven.repository.legacy.DefaultWagonManager.putArtifactMetadata(DefaultWagonManager.java:501)
	at org.apache.maven.artifact.repository.metadata.DefaultRepositoryMetadataManager.deploy(DefaultRepositoryMetadataManager.java:488)
	... 12 more
Caused by: org.apache.http.NoHttpResponseException: The target server failed to respond
	at org.apache.http.impl.conn.DefaultHttpResponseParser.parseHead(DefaultHttpResponseParser.java:95)
	at org.apache.http.impl.conn.DefaultHttpResponseParser.parseHead(DefaultHttpResponseParser.java:62)
	at org.apache.http.impl.io.AbstractMessageParser.parse(AbstractMessageParser.java:254)
	at org.apache.http.impl.AbstractHttpClientConnection.receiveResponseHeader(AbstractHttpClientConnection.java:289)
	at org.apache.http.impl.conn.DefaultClientConnection.receiveResponseHeader(DefaultClientConnection.java:252)
	at org.apache.http.impl.conn.ManagedClientConnectionImpl.receiveResponseHeader(ManagedClientConnectionImpl.java:191)
	at org.apache.http.protocol.HttpRequestExecutor.doReceiveResponse(HttpRequestExecutor.java:300)
	at org.apache.http.protocol.HttpRequestExecutor.execute(HttpRequestExecutor.java:127)
	at org.apache.http.impl.client.DefaultRequestDirector.tryExecute(DefaultRequestDirector.java:715)
	at org.apache.http.impl.client.DefaultRequestDirector.execute(DefaultRequestDirector.java:520)
	at org.apache.http.impl.client.AbstractHttpClient.execute(AbstractHttpClient.java:906)
	at org.apache.http.impl.client.AbstractHttpClient.execute(AbstractHttpClient.java:805)
	at org.apache.maven.wagon.shared.http4.AbstractHttpClientWagon.execute(AbstractHttpClientWagon.java:746)
	at org.apache.maven.wagon.shared.http4.AbstractHttpClientWagon.put(AbstractHttpClientWagon.java:574)
	... 18 more
[INFO] Deployment failed after 7 min 31 sec
Build step 'Deploy artifacts to Maven repository' changed build result to FAILURE

Mime
View raw message