myfaces-commits mailing list archives

Site index · List index
Message view « Date » · « Thread »
Top « Date » · « Thread »
From Apache Jenkins Server <jenk...@builds.apache.org>
Subject Build failed in Jenkins: myfaces-orchestra-core #1230
Date Sun, 28 Jul 2013 22:28:07 GMT
See <https://builds.apache.org/job/myfaces-orchestra-core/1230/>

------------------------------------------
[...truncated 321 lines...]
	Database: Apache Derby  Version: 10.3.1.4 - (561794)
	Driver: Apache Derby Embedded JDBC Driver  Version: 10.3.1.4 - (561794)
[TopLink Info]: 2013.07.28 10:24:10.571--ServerSession(32215117)--Thread(Thread[main,5,main])--<https://builds.apache.org/job/myfaces-orchestra-core/ws/core/target/test-classes-default>
login successful
[TopLink Fine]: 2013.07.28 10:24:10.595--ServerSession(32215117)--Connection(15494065)--Thread(Thread[main,5,main])--DROP
TABLE USERDATA
[TopLink Fine]: 2013.07.28 10:24:12.025--ServerSession(32215117)--Connection(27701615)--Thread(Thread[main,5,main])--CREATE
TABLE USERDATA (ID BIGINT GENERATED ALWAYS AS IDENTITY NOT NULL, USERNAME VARCHAR(255), VERSION
BIGINT, PRIMARY KEY (ID))
Jul 28, 2013 10:24:12 PM org.springframework.context.support.AbstractApplicationContext$BeanPostProcessorChecker
postProcessAfterInitialization
INFO: Bean 'org.springframework.aop.config.internalAutoProxyCreator' is not eligible for getting
processed by all BeanPostProcessors (for example: not eligible for auto-proxying)
Jul 28, 2013 10:24:12 PM org.springframework.context.support.AbstractApplicationContext$BeanPostProcessorChecker
postProcessAfterInitialization
INFO: Bean 'org.springframework.orm.jpa.support.PersistenceAnnotationBeanPostProcessor' is
not eligible for getting processed by all BeanPostProcessors (for example: not eligible for
auto-proxying)
Jul 28, 2013 10:24:12 PM org.springframework.context.support.AbstractApplicationContext$BeanPostProcessorChecker
postProcessAfterInitialization
INFO: Bean 'transactionManager' is not eligible for getting processed by all BeanPostProcessors
(for example: not eligible for auto-proxying)
Jul 28, 2013 10:24:12 PM org.springframework.context.support.AbstractApplicationContext$BeanPostProcessorChecker
postProcessAfterInitialization
INFO: Bean '(inner bean)' is not eligible for getting processed by all BeanPostProcessors
(for example: not eligible for auto-proxying)
Jul 28, 2013 10:24:12 PM org.springframework.context.support.AbstractApplicationContext$BeanPostProcessorChecker
postProcessAfterInitialization
INFO: Bean '(inner bean)' is not eligible for getting processed by all BeanPostProcessors
(for example: not eligible for auto-proxying)
Jul 28, 2013 10:24:12 PM org.springframework.context.support.AbstractApplicationContext$BeanPostProcessorChecker
postProcessAfterInitialization
INFO: Bean 'org.springframework.transaction.interceptor.TransactionAttributeSourceAdvisor'
is not eligible for getting processed by all BeanPostProcessors (for example: not eligible
for auto-proxying)
Jul 28, 2013 10:24:12 PM org.springframework.beans.factory.support.DefaultListableBeanFactory
preInstantiateSingletons
INFO: Pre-instantiating singletons in org.springframework.beans.factory.support.DefaultListableBeanFactory@ee3aa7:
defining beans [org.springframework.beans.factory.config.CustomScopeConfigurer,persistentContextConversationInterceptor,persistentContextFactory,org.springframework.orm.jpa.support.PersistenceAnnotationBeanPostProcessor,org.springframework.aop.config.internalAutoProxyCreator,org.springframework.transaction.interceptor.TransactionAttributeSourceAdvisor,transactionManager,entityManagerFactory,scopedTarget.persistentBackingBean,persistentBackingBean,scopedTarget.dummyBean,dummyBean];
root of factory hierarchy
[TopLink Fine]: 2013.07.28 10:24:13.454--ClientSession(12345351)--Connection(20483678)--Thread(Thread[main,5,main])--INSERT
INTO USERDATA (USERNAME, VERSION) VALUES (?, ?)
	bind => [test, 1]
[TopLink Fine]: 2013.07.28 10:24:14.052--ClientSession(12345351)--Connection(20483678)--Thread(Thread[main,5,main])--values
IDENTITY_VAL_LOCAL()
[TopLink Fine]: 2013.07.28 10:24:14.213--ClientSession(21323983)--Connection(31616594)--Thread(Thread[main,5,main])--INSERT
INTO USERDATA (USERNAME, VERSION) VALUES (?, ?)
	bind => [test, 1]
[TopLink Fine]: 2013.07.28 10:24:14.216--ClientSession(21323983)--Connection(31616594)--Thread(Thread[main,5,main])--values
IDENTITY_VAL_LOCAL()
Tests run: 2, Failures: 0, Errors: 0, Skipped: 0, Time elapsed: 18.886 sec
Running org.apache.myfaces.orchestra.conversation.TestConversation
Tests run: 1, Failures: 0, Errors: 0, Skipped: 0, Time elapsed: 0.063 sec
Running org.apache.myfaces.orchestra.conversation.spring.TestSpringUtils
Jul 28, 2013 10:24:14 PM org.springframework.test.AbstractSingleSpringContextTests loadContextLocations
INFO: Loading context for locations: classpath:org/apache/myfaces/orchestra/conversation/spring/TestSpringUtils.xml
Jul 28, 2013 10:24:14 PM org.springframework.beans.factory.xml.XmlBeanDefinitionReader loadBeanDefinitions
INFO: Loading XML bean definitions from class path resource [org/apache/myfaces/orchestra/conversation/spring/TestSpringUtils.xml]
Jul 28, 2013 10:24:14 PM org.springframework.context.support.AbstractApplicationContext prepareRefresh
INFO: Refreshing org.springframework.context.support.GenericApplicationContext@54570a: display
name [org.springframework.context.support.GenericApplicationContext@54570a]; startup date
[Sun Jul 28 22:24:14 GMT+00:00 2013]; root of context hierarchy
Jul 28, 2013 10:24:14 PM org.springframework.context.support.AbstractApplicationContext obtainFreshBeanFactory
INFO: Bean factory for application context [org.springframework.context.support.GenericApplicationContext@54570a]:
org.springframework.beans.factory.support.DefaultListableBeanFactory@16f3619
Jul 28, 2013 10:24:14 PM org.springframework.beans.factory.support.DefaultListableBeanFactory
preInstantiateSingletons
INFO: Pre-instantiating singletons in org.springframework.beans.factory.support.DefaultListableBeanFactory@16f3619:
defining beans [org.springframework.beans.factory.config.CustomScopeConfigurer,simpleBean];
root of factory hierarchy
Tests run: 1, Failures: 0, Errors: 0, Skipped: 0, Time elapsed: 0.209 sec
Running org.apache.myfaces.orchestra.viewController.TestInterfaceViewControllerExecutor
Tests run: 1, Failures: 0, Errors: 0, Skipped: 0, Time elapsed: 0.085 sec
Running org.apache.myfaces.orchestra.viewController.TestReflectiveViewControllerExecutor
Tests run: 1, Failures: 0, Errors: 0, Skipped: 0, Time elapsed: 0.019 sec
Running org.apache.myfaces.orchestra.viewController.TestDefaultViewControllerNameMapper
Tests run: 1, Failures: 0, Errors: 0, Skipped: 0, Time elapsed: 0.023 sec
Jul 28, 2013 10:24:14 PM org.springframework.context.support.AbstractApplicationContext doClose
INFO: Closing org.springframework.context.support.GenericApplicationContext@ce5b1c: display
name [org.springframework.context.support.GenericApplicationContext@ce5b1c]; startup date
[Sun Jul 28 22:23:50 GMT+00:00 2013]; root of context hierarchy
Jul 28, 2013 10:24:14 PM org.springframework.context.support.AbstractApplicationContext doClose
INFO: Closing org.springframework.context.support.GenericApplicationContext@54570a: display
name [org.springframework.context.support.GenericApplicationContext@54570a]; startup date
[Sun Jul 28 22:24:14 GMT+00:00 2013]; root of context hierarchy
Jul 28, 2013 10:24:14 PM org.springframework.context.support.AbstractApplicationContext doClose
INFO: Closing org.springframework.context.support.GenericApplicationContext@f0b4a3: display
name [org.springframework.context.support.GenericApplicationContext@f0b4a3]; startup date
[Sun Jul 28 22:23:55 GMT+00:00 2013]; root of context hierarchy
Jul 28, 2013 10:24:14 PM org.springframework.context.support.AbstractApplicationContext doClose
INFO: Closing org.springframework.context.support.GenericApplicationContext@1202d69: display
name [org.springframework.context.support.GenericApplicationContext@1202d69]; startup date
[Sun Jul 28 22:23:54 GMT+00:00 2013]; root of context hierarchy
[TopLink Config]: 2013.07.28 10:24:14.722--ServerSession(32215117)--Connection(27701615)--Thread(Thread[Thread-4,5,main])--disconnect
[TopLink Info]: 2013.07.28 10:24:14.723--ServerSession(32215117)--Thread(Thread[Thread-4,5,main])--<https://builds.apache.org/job/myfaces-orchestra-core/ws/core/target/test-classes-default>
logout successful
[TopLink Config]: 2013.07.28 10:24:14.724--ServerSession(32215117)--Connection(15494065)--Thread(Thread[Thread-4,5,main])--disconnect
[TopLink Config]: 2013.07.28 10:24:14.725--ServerSession(32215117)--Connection(13218198)--Thread(Thread[Thread-4,5,main])--disconnect
[TopLink Config]: 2013.07.28 10:24:14.725--ServerSession(32215117)--Connection(8374450)--Thread(Thread[Thread-4,5,main])--disconnect
[TopLink Config]: 2013.07.28 10:24:14.725--ServerSession(32215117)--Connection(22572221)--Thread(Thread[Thread-4,5,main])--disconnect
[TopLink Config]: 2013.07.28 10:24:14.726--ServerSession(32215117)--Connection(1108447)--Thread(Thread[Thread-4,5,main])--disconnect
[TopLink Config]: 2013.07.28 10:24:14.726--ServerSession(32215117)--Connection(20483678)--Thread(Thread[Thread-4,5,main])--disconnect
[TopLink Config]: 2013.07.28 10:24:14.727--ServerSession(32215117)--Connection(31616594)--Thread(Thread[Thread-4,5,main])--disconnect

Results :

Tests run: 15, Failures: 0, Errors: 0, Skipped: 0

[JENKINS] Recording test results
[INFO] [jar:jar {execution: default-jar}]
[INFO] Building jar: <https://builds.apache.org/job/myfaces-orchestra-core/ws/core/target/myfaces-orchestra-core-1.6-SNAPSHOT.jar>
[INFO] Preparing source:jar
[WARNING] Removing: jar from forked lifecycle, to prevent recursive invocation.
[WARNING] DEPRECATED [tasks]: Use target instead
[JENKINS] Archiving <https://builds.apache.org/job/myfaces-orchestra-core/ws/core/pom.xml>
to /home/hudson/hudson/jobs/myfaces-orchestra-core/modules/org.apache.myfaces.orchestra$myfaces-orchestra-core/builds/2013-07-28_22-18-51/archive/org.apache.myfaces.orchestra/myfaces-orchestra-core/1.6-SNAPSHOT/myfaces-orchestra-core-1.6-SNAPSHOT.pom
[JENKINS] Archiving <https://builds.apache.org/job/myfaces-orchestra-core/ws/core/target/myfaces-orchestra-core-1.6-SNAPSHOT.jar>
to /home/hudson/hudson/jobs/myfaces-orchestra-core/modules/org.apache.myfaces.orchestra$myfaces-orchestra-core/builds/2013-07-28_22-18-51/archive/org.apache.myfaces.orchestra/myfaces-orchestra-core/1.6-SNAPSHOT/myfaces-orchestra-core-1.6-SNAPSHOT.jar
[INFO] [antrun:run {execution: javadoc.resources}]
[WARNING] Parameter tasks is deprecated, use target instead
[INFO] Executing tasks

main:
[INFO] Executed tasks
[INFO] [build-helper:add-source {execution: add-source}]
[INFO] Source directory: <https://builds.apache.org/job/myfaces-orchestra-core/ws/core/target/shared_sources>
added.
ERROR: Could not find local repository for 2.2.1
[INFO] [source:jar {execution: attach-source}]
[INFO] META-INF already added, skipping
[INFO] org already added, skipping
[INFO] org/apache already added, skipping
[INFO] org/apache/myfaces already added, skipping
[INFO] org already added, skipping
[INFO] org/apache already added, skipping
[INFO] org/apache/myfaces already added, skipping
[INFO] org/apache/myfaces/orchestra already added, skipping
[INFO] META-INF already added, skipping
[INFO] META-INF already added, skipping
[INFO] META-INF/NOTICE already added, skipping
[INFO] META-INF/LICENSE already added, skipping
[INFO] META-INF/DEPENDENCIES already added, skipping
[INFO] Building jar: <https://builds.apache.org/job/myfaces-orchestra-core/ws/core/target/myfaces-orchestra-core-1.6-SNAPSHOT-sources.jar>
[INFO] META-INF already added, skipping
[INFO] org already added, skipping
[INFO] org/apache already added, skipping
[INFO] org/apache/myfaces already added, skipping
[INFO] org already added, skipping
[INFO] org/apache already added, skipping
[INFO] org/apache/myfaces already added, skipping
[INFO] org/apache/myfaces/orchestra already added, skipping
[INFO] META-INF already added, skipping
[INFO] META-INF already added, skipping
[INFO] META-INF/NOTICE already added, skipping
[INFO] META-INF/LICENSE already added, skipping
[INFO] META-INF/DEPENDENCIES already added, skipping
[INFO] [checkstyle:check {execution: verify-style}]
[INFO] 
[INFO] [install:install {execution: default-install}]
[INFO] Installing <https://builds.apache.org/job/myfaces-orchestra-core/ws/core/target/myfaces-orchestra-core-1.6-SNAPSHOT.jar>
to /export/home/hudson/hudson-slave/maven-repositories/0/org/apache/myfaces/orchestra/myfaces-orchestra-core/1.6-SNAPSHOT/myfaces-orchestra-core-1.6-SNAPSHOT.jar
[INFO] Installing <https://builds.apache.org/job/myfaces-orchestra-core/ws/core/target/myfaces-orchestra-core-1.6-SNAPSHOT-sources.jar>
to /export/home/hudson/hudson-slave/maven-repositories/0/org/apache/myfaces/orchestra/myfaces-orchestra-core/1.6-SNAPSHOT/myfaces-orchestra-core-1.6-SNAPSHOT-sources.jar
[WARNING] DEPRECATED [tasks]: Use target instead
[INFO] [antrun:run {execution: javadoc.resources}]
[WARNING] Parameter tasks is deprecated, use target instead
[INFO] Executing tasks

main:
[INFO] Executed tasks
[INFO] [build-helper:add-source {execution: add-source}]
[INFO] Source directory: <https://builds.apache.org/job/myfaces-orchestra-core/ws/core/target/shared_sources>
added.
[INFO] [dependency:unpack {execution: unpack-shared-impl-sources}]
[INFO] Configured Artifact: org.apache.myfaces.shared:myfaces-shared-orchestra:sources:2.0.13:jar
[INFO] Unpacking /export/home/hudson/hudson-slave/maven-repositories/0/org/apache/myfaces/shared/myfaces-shared-orchestra/2.0.13/myfaces-shared-orchestra-2.0.13-sources.jar
to <https://builds.apache.org/job/myfaces-orchestra-core/ws/core/target/shared_sources>
with includes "" and excludes "META-INF/*"
[INFO] [xslt:transform {execution: default}]
[INFO] # of XML files: 1
[INFO] file up-to-date: <https://builds.apache.org/job/myfaces-orchestra-core/ws/core/target/classes/META-INF/myfaces_orchestra.tld>
[INFO] [remote-resources:process {execution: default}]
[debug] execute contextualize
[INFO] [resources:resources {execution: default-resources}]
[INFO] Using 'UTF-8' encoding to copy filtered resources.
[INFO] Copying 2 resources to META-INF
[INFO] Copying 6 resources
[INFO] Copying 3 resources
[INFO] Copying 3 resources
[INFO] [compiler:compile {execution: default-compile}]
[INFO] Nothing to compile - all classes are up to date
[debug] execute contextualize
[INFO] [resources:testResources {execution: default-testResources}]
[INFO] Using 'UTF-8' encoding to copy filtered resources.
[INFO] Copying 6 resources
[INFO] Copying 3 resources
[INFO] Copying 3 resources
[INFO] [compiler:testCompile {execution: default-testCompile}]
[INFO] Nothing to compile - all classes are up to date
[INFO] [surefire:test {execution: default-test}]
[INFO] Skipping execution of surefire because it has already been run for this configuration
[JENKINS] Recording test results
[INFO] [jar:jar {execution: default-jar}]
[INFO] Building jar: <https://builds.apache.org/job/myfaces-orchestra-core/ws/core/target/myfaces-orchestra-core-1.6-SNAPSHOT.jar>
[INFO] Preparing source:jar
[WARNING] Removing: jar from forked lifecycle, to prevent recursive invocation.
[WARNING] DEPRECATED [tasks]: Use target instead
[JENKINS] Re-archiving <https://builds.apache.org/job/myfaces-orchestra-core/ws/core/target/myfaces-orchestra-core-1.6-SNAPSHOT.jar>
[JENKINS] Archiving <https://builds.apache.org/job/myfaces-orchestra-core/ws/core/target/myfaces-orchestra-core-1.6-SNAPSHOT-sources.jar>
to /home/hudson/hudson/jobs/myfaces-orchestra-core/modules/org.apache.myfaces.orchestra$myfaces-orchestra-core/builds/2013-07-28_22-18-51/archive/org.apache.myfaces.orchestra/myfaces-orchestra-core/1.6-SNAPSHOT/myfaces-orchestra-core-1.6-SNAPSHOT-sources.jar
[INFO] [antrun:run {execution: javadoc.resources}]
[WARNING] Parameter tasks is deprecated, use target instead
[INFO] Executing tasks

main:
[INFO] Executed tasks
[INFO] [build-helper:add-source {execution: add-source}]
[INFO] Source directory: <https://builds.apache.org/job/myfaces-orchestra-core/ws/core/target/shared_sources>
added.
ERROR: Could not find local repository for 2.2.1
[INFO] [source:jar {execution: attach-source}]
[INFO] ------------------------------------------------------------------------
[ERROR] FATAL ERROR
[INFO] ------------------------------------------------------------------------
[INFO] null
error=12, Not enough space
[INFO] ------------------------------------------------------------------------
[INFO] Trace
java.lang.reflect.UndeclaredThrowableException
	at org.codehaus.plexus.archiver.AbstractArchiver.getFiles(AbstractArchiver.java:519)
	at org.apache.maven.plugin.source.AbstractSourceJarMojo.packageSources(AbstractSourceJarMojo.java:262)
	at org.apache.maven.plugin.source.AbstractSourceJarMojo.packageSources(AbstractSourceJarMojo.java:232)
	at org.apache.maven.plugin.source.AbstractSourceJarMojo.execute(AbstractSourceJarMojo.java:201)
	at org.apache.maven.plugin.DefaultPluginManager.executeMojo(DefaultPluginManager.java:490)
	at hudson.maven.agent.PluginManagerInterceptor.executeMojo(PluginManagerInterceptor.java:182)
	at org.apache.maven.lifecycle.DefaultLifecycleExecutor.executeGoals(DefaultLifecycleExecutor.java:694)
	at org.apache.maven.lifecycle.DefaultLifecycleExecutor.executeGoalWithLifecycle(DefaultLifecycleExecutor.java:556)
	at org.apache.maven.lifecycle.DefaultLifecycleExecutor.executeGoal(DefaultLifecycleExecutor.java:535)
	at org.apache.maven.lifecycle.DefaultLifecycleExecutor.executeGoalAndHandleFailures(DefaultLifecycleExecutor.java:387)
	at org.apache.maven.lifecycle.DefaultLifecycleExecutor.executeTaskSegments(DefaultLifecycleExecutor.java:348)
	at org.apache.maven.lifecycle.DefaultLifecycleExecutor.execute(DefaultLifecycleExecutor.java:180)
	at org.apache.maven.lifecycle.LifecycleExecutorInterceptor.execute(LifecycleExecutorInterceptor.java:65)
	at org.apache.maven.DefaultMaven.doExecute(DefaultMaven.java:328)
	at org.apache.maven.DefaultMaven.execute(DefaultMaven.java:138)
	at org.apache.maven.cli.MavenCli.main(MavenCli.java:362)
	at sun.reflect.NativeMethodAccessorImpl.invoke0(Native Method)
	at sun.reflect.NativeMethodAccessorImpl.invoke(NativeMethodAccessorImpl.java:39)
	at sun.reflect.DelegatingMethodAccessorImpl.invoke(DelegatingMethodAccessorImpl.java:25)
	at java.lang.reflect.Method.invoke(Method.java:597)
	at org.codehaus.classworlds.Launcher.launchEnhanced(Launcher.java:315)
	at org.codehaus.classworlds.Launcher.launch(Launcher.java:255)
	at hudson.maven.agent.Main.launch(Main.java:204)
	at hudson.maven.MavenBuilder.call(MavenBuilder.java:154)
	at hudson.maven.Maven2Builder.call(Maven2Builder.java:79)
	at hudson.maven.Maven2Builder.call(Maven2Builder.java:55)
	at hudson.remoting.UserRequest.perform(UserRequest.java:118)
	at hudson.remoting.UserRequest.perform(UserRequest.java:48)
	at hudson.remoting.Request$2.run(Request.java:326)
	at hudson.remoting.InterceptingExecutorService$1.call(InterceptingExecutorService.java:72)
	at java.util.concurrent.FutureTask$Sync.innerRun(FutureTask.java:303)
	at java.util.concurrent.FutureTask.run(FutureTask.java:138)
	at java.util.concurrent.ThreadPoolExecutor$Worker.runTask(ThreadPoolExecutor.java:886)
	at java.util.concurrent.ThreadPoolExecutor$Worker.run(ThreadPoolExecutor.java:908)
	at java.lang.Thread.run(Thread.java:662)
Caused by: org.codehaus.plexus.archiver.ArchiverException: Failed to retrieve numeric file
attributes using: '/bin/sh -c ls -1nlaR <https://builds.apache.org/job/myfaces-orchestra-core/ws/core/target/maven-shared-archive-resources'>
	at org.codehaus.plexus.archiver.AbstractArchiver$1.hasNext(AbstractArchiver.java:427)
	at org.codehaus.plexus.archiver.AbstractArchiver.getFiles(AbstractArchiver.java:507)
	... 34 more
Caused by: java.io.IOException: Failed to retrieve numeric file attributes using: '/bin/sh
-c ls -1nlaR <https://builds.apache.org/job/myfaces-orchestra-core/ws/core/target/maven-shared-archive-resources'>
	at org.codehaus.plexus.components.io.attributes.PlexusIoResourceAttributeUtils.executeLs(PlexusIoResourceAttributeUtils.java:287)
	at org.codehaus.plexus.components.io.attributes.PlexusIoResourceAttributeUtils.getFileAttributesByPath(PlexusIoResourceAttributeUtils.java:223)
	at org.codehaus.plexus.components.io.attributes.PlexusIoResourceAttributeUtils.getFileAttributesByPath(PlexusIoResourceAttributeUtils.java:189)
	at org.codehaus.plexus.components.io.resources.PlexusIoFileResourceCollection.getResources(PlexusIoFileResourceCollection.java:175)
	at org.codehaus.plexus.archiver.AbstractArchiver$1.hasNext(AbstractArchiver.java:423)
	... 35 more
Caused by: org.codehaus.plexus.util.cli.CommandLineException: Error while executing process.
	at org.codehaus.plexus.util.cli.Commandline.execute(Commandline.java:656)
	at org.codehaus.plexus.util.cli.CommandLineUtils.executeCommandLine(CommandLineUtils.java:144)
	at org.codehaus.plexus.util.cli.CommandLineUtils.executeCommandLine(CommandLineUtils.java:107)
	at org.codehaus.plexus.components.io.attributes.PlexusIoResourceAttributeUtils.executeLs(PlexusIoResourceAttributeUtils.java:277)
	... 39 more
Caused by: java.io.IOException: Cannot run program "/bin/sh": error=12, Not enough space
	at java.lang.ProcessBuilder.start(ProcessBuilder.java:460)
	at java.lang.Runtime.exec(Runtime.java:593)
	at java.lang.Runtime.exec(Runtime.java:509)
	at org.codehaus.plexus.util.cli.Commandline.execute(Commandline.java:636)
	... 42 more
Caused by: java.io.IOException: error=12, Not enough space
	at java.lang.UNIXProcess.forkAndExec(Native Method)
	at java.lang.UNIXProcess.<init>(UNIXProcess.java:53)
	at java.lang.ProcessImpl.start(ProcessImpl.java:65)
	at java.lang.ProcessBuilder.start(ProcessBuilder.java:453)
	... 45 more
[INFO] ------------------------------------------------------------------------
[INFO] Total time: 6 minutes 6 seconds
[INFO] Finished at: Sun Jul 28 22:28:11 GMT+00:00 2013
[INFO] Final Memory: 60M/392M
[INFO] ------------------------------------------------------------------------
channel stopped

Mime
View raw message