myfaces-commits mailing list archives

Site index · List index
Message view « Date » · « Thread »
Top « Date » · « Thread »
From Apache Jenkins Server <jenk...@builds.apache.org>
Subject Build failed in Jenkins: Myfaces-Orchestra #1088
Date Mon, 29 Jul 2013 10:02:45 GMT
See <https://builds.apache.org/job/Myfaces-Orchestra/1088/>

------------------------------------------
[...truncated 320 lines...]
INFO: before:Conversation Method
Jul 29, 2013 10:00:19 AM org.apache.myfaces.orchestra.conversation.MockAdvice invoke
INFO: after: Conversation Method
Jul 29, 2013 10:00:19 AM org.apache.myfaces.orchestra.conversation.MockAdvice invoke
INFO: before:Conversation Method
Jul 29, 2013 10:00:19 AM org.apache.myfaces.orchestra.conversation.MockAdvice invoke
INFO: before:Invoking
Jul 29, 2013 10:00:19 AM org.apache.myfaces.orchestra.conversation.MockAdvice invoke
INFO: after: Invoking
Jul 29, 2013 10:00:19 AM org.apache.myfaces.orchestra.conversation.MockAdvice invoke
INFO: after: Conversation Method
Jul 29, 2013 10:00:19 AM org.apache.myfaces.orchestra.conversation.MockAdvice invoke
INFO: before:Conversation Method
Jul 29, 2013 10:00:19 AM org.apache.myfaces.orchestra.conversation.MockAdvice invoke
INFO: before:Invoking
Jul 29, 2013 10:00:19 AM org.apache.myfaces.orchestra.conversation.MockAdvice invoke
INFO: after: Invoking
Jul 29, 2013 10:00:19 AM org.apache.myfaces.orchestra.conversation.MockAdvice invoke
INFO: after: Conversation Method
Jul 29, 2013 10:00:19 AM org.apache.myfaces.orchestra.conversation.MockAdvice invoke
INFO: before:Conversation Method
Jul 29, 2013 10:00:19 AM org.apache.myfaces.orchestra.conversation.MockAdvice invoke
INFO: after: Conversation Method
Jul 29, 2013 10:00:19 AM org.apache.myfaces.orchestra.conversation.MockAdvice invoke
INFO: before:Conversation Method
Jul 29, 2013 10:00:19 AM org.apache.myfaces.orchestra.conversation.MockAdvice invoke
INFO: before:Invoking
Jul 29, 2013 10:00:19 AM org.apache.myfaces.orchestra.conversation.MockAdvice invoke
INFO: after: Invoking
Jul 29, 2013 10:00:19 AM org.apache.myfaces.orchestra.conversation.MockAdvice invoke
INFO: after: Conversation Method
Jul 29, 2013 10:00:19 AM org.apache.myfaces.orchestra.conversation.MockAdvice invoke
INFO: before:Conversation Method
Jul 29, 2013 10:00:19 AM org.apache.myfaces.orchestra.conversation.MockAdvice invoke
INFO: before:Invoking
Jul 29, 2013 10:00:19 AM org.apache.myfaces.orchestra.conversation.MockAdvice invoke
INFO: after: Invoking
Jul 29, 2013 10:00:19 AM org.apache.myfaces.orchestra.conversation.MockAdvice invoke
INFO: after: Conversation Method
Tests run: 2, Failures: 0, Errors: 0, Skipped: 0, Time elapsed: 0.159 sec
Running org.apache.myfaces.orchestra.conversation.spring.TestSpringUtils
Jul 29, 2013 10:00:19 AM org.springframework.test.AbstractSingleSpringContextTests loadContextLocations
INFO: Loading context for locations: classpath:org/apache/myfaces/orchestra/conversation/spring/TestSpringUtils.xml
Jul 29, 2013 10:00:19 AM org.springframework.beans.factory.xml.XmlBeanDefinitionReader loadBeanDefinitions
INFO: Loading XML bean definitions from class path resource [org/apache/myfaces/orchestra/conversation/spring/TestSpringUtils.xml]
Jul 29, 2013 10:00:19 AM org.springframework.context.support.AbstractApplicationContext prepareRefresh
INFO: Refreshing org.springframework.context.support.GenericApplicationContext@f549de: display
name [org.springframework.context.support.GenericApplicationContext@f549de]; startup date
[Mon Jul 29 10:00:19 GMT+00:00 2013]; root of context hierarchy
Jul 29, 2013 10:00:19 AM org.springframework.context.support.AbstractApplicationContext obtainFreshBeanFactory
INFO: Bean factory for application context [org.springframework.context.support.GenericApplicationContext@f549de]:
org.springframework.beans.factory.support.DefaultListableBeanFactory@6d670a
Jul 29, 2013 10:00:19 AM org.springframework.beans.factory.support.DefaultListableBeanFactory
preInstantiateSingletons
INFO: Pre-instantiating singletons in org.springframework.beans.factory.support.DefaultListableBeanFactory@6d670a:
defining beans [org.springframework.beans.factory.config.CustomScopeConfigurer,simpleBean];
root of factory hierarchy
Tests run: 1, Failures: 0, Errors: 0, Skipped: 0, Time elapsed: 0.07 sec
Running org.apache.myfaces.orchestra.conversation.TestScope
Jul 29, 2013 10:00:19 AM org.apache.myfaces.orchestra.conversation.MockAdvice invoke
INFO: before:Conversation Method
Jul 29, 2013 10:00:19 AM org.apache.myfaces.orchestra.conversation.MockAdvice invoke
INFO: before:Invoking
Jul 29, 2013 10:00:19 AM org.apache.myfaces.orchestra.conversation.MockAdvice invoke
INFO: after: Invoking
Jul 29, 2013 10:00:19 AM org.apache.myfaces.orchestra.conversation.MockAdvice invoke
INFO: after: Conversation Method
Jul 29, 2013 10:00:19 AM org.apache.myfaces.orchestra.conversation.MockAdvice invoke
INFO: before:Conversation Method
Jul 29, 2013 10:00:19 AM org.apache.myfaces.orchestra.conversation.MockAdvice invoke
INFO: before:Invoking
Jul 29, 2013 10:00:19 AM org.apache.myfaces.orchestra.conversation.MockAdvice invoke
INFO: after: Invoking
Jul 29, 2013 10:00:19 AM org.apache.myfaces.orchestra.conversation.MockAdvice invoke
INFO: after: Conversation Method
Jul 29, 2013 10:00:19 AM org.apache.myfaces.orchestra.conversation.MockAdvice invoke
INFO: before:Conversation Method
Jul 29, 2013 10:00:19 AM org.apache.myfaces.orchestra.conversation.MockAdvice invoke
INFO: before:Invoking
Jul 29, 2013 10:00:19 AM org.apache.myfaces.orchestra.conversation.MockAdvice invoke
INFO: after: Invoking
Jul 29, 2013 10:00:19 AM org.apache.myfaces.orchestra.conversation.MockAdvice invoke
INFO: after: Conversation Method
Jul 29, 2013 10:00:19 AM org.apache.myfaces.orchestra.conversation.MockAdvice invoke
INFO: before:Conversation Method
Jul 29, 2013 10:00:19 AM org.apache.myfaces.orchestra.conversation.MockAdvice invoke
INFO: before:Invoking
Jul 29, 2013 10:00:19 AM org.apache.myfaces.orchestra.conversation.MockAdvice invoke
INFO: after: Invoking
Jul 29, 2013 10:00:19 AM org.apache.myfaces.orchestra.conversation.MockAdvice invoke
INFO: after: Conversation Method
Jul 29, 2013 10:00:19 AM org.apache.myfaces.orchestra.conversation.MockAdvice invoke
INFO: before:Conversation Method
Jul 29, 2013 10:00:19 AM org.apache.myfaces.orchestra.conversation.MockAdvice invoke
INFO: before:Invoking
Jul 29, 2013 10:00:19 AM org.apache.myfaces.orchestra.conversation.MockAdvice invoke
INFO: after: Invoking
Jul 29, 2013 10:00:19 AM org.apache.myfaces.orchestra.conversation.MockAdvice invoke
INFO: after: Conversation Method
Jul 29, 2013 10:00:19 AM org.apache.myfaces.orchestra.conversation.MockAdvice invoke
INFO: before:Conversation Method
Jul 29, 2013 10:00:19 AM org.apache.myfaces.orchestra.conversation.MockAdvice invoke
INFO: before:Invoking
Jul 29, 2013 10:00:19 AM org.apache.myfaces.orchestra.conversation.MockAdvice invoke
INFO: after: Invoking
Jul 29, 2013 10:00:19 AM org.apache.myfaces.orchestra.conversation.MockAdvice invoke
INFO: after: Conversation Method
Jul 29, 2013 10:00:19 AM org.apache.myfaces.orchestra.conversation.MockAdvice invoke
INFO: before:Conversation Method
Jul 29, 2013 10:00:19 AM org.apache.myfaces.orchestra.conversation.MockAdvice invoke
INFO: before:Invoking
Jul 29, 2013 10:00:19 AM org.apache.myfaces.orchestra.conversation.MockAdvice invoke
INFO: after: Invoking
Jul 29, 2013 10:00:19 AM org.apache.myfaces.orchestra.conversation.MockAdvice invoke
INFO: after: Conversation Method
Jul 29, 2013 10:00:19 AM org.apache.myfaces.orchestra.conversation.MockAdvice invoke
INFO: before:Conversation Method
Jul 29, 2013 10:00:19 AM org.apache.myfaces.orchestra.conversation.MockAdvice invoke
INFO: before:Invoking
Jul 29, 2013 10:00:19 AM org.apache.myfaces.orchestra.conversation.MockAdvice invoke
INFO: after: Invoking
Jul 29, 2013 10:00:19 AM org.apache.myfaces.orchestra.conversation.MockAdvice invoke
INFO: after: Conversation Method
Jul 29, 2013 10:00:19 AM org.apache.myfaces.orchestra.conversation.MockAdvice invoke
INFO: before:Conversation Method
Jul 29, 2013 10:00:19 AM org.apache.myfaces.orchestra.conversation.MockAdvice invoke
INFO: before:Invoking
Jul 29, 2013 10:00:19 AM org.apache.myfaces.orchestra.conversation.MockAdvice invoke
INFO: after: Invoking
Jul 29, 2013 10:00:19 AM org.apache.myfaces.orchestra.conversation.MockAdvice invoke
INFO: after: Conversation Method
Jul 29, 2013 10:00:19 AM org.apache.myfaces.orchestra.conversation.MockAdvice invoke
INFO: before:Invoking
Jul 29, 2013 10:00:19 AM org.apache.myfaces.orchestra.conversation.MockAdvice invoke
INFO: after: Invoking
Tests run: 3, Failures: 0, Errors: 0, Skipped: 0, Time elapsed: 0.023 sec
Jul 29, 2013 10:00:19 AM org.springframework.context.support.AbstractApplicationContext doClose
INFO: Closing org.springframework.context.support.GenericApplicationContext@92eb86: display
name [org.springframework.context.support.GenericApplicationContext@92eb86]; startup date
[Mon Jul 29 10:00:19 GMT+00:00 2013]; root of context hierarchy
Jul 29, 2013 10:00:19 AM org.springframework.context.support.AbstractApplicationContext doClose
INFO: Closing org.springframework.context.support.GenericApplicationContext@f549de: display
name [org.springframework.context.support.GenericApplicationContext@f549de]; startup date
[Mon Jul 29 10:00:19 GMT+00:00 2013]; root of context hierarchy
Jul 29, 2013 10:00:19 AM org.springframework.context.support.AbstractApplicationContext doClose
INFO: Closing org.springframework.context.support.GenericApplicationContext@1e8a1f6: display
name [org.springframework.context.support.GenericApplicationContext@1e8a1f6]; startup date
[Mon Jul 29 10:00:11 GMT+00:00 2013]; root of context hierarchy
Jul 29, 2013 10:00:19 AM org.springframework.context.support.AbstractApplicationContext doClose
INFO: Closing org.springframework.context.support.GenericApplicationContext@109ea96: display
name [org.springframework.context.support.GenericApplicationContext@109ea96]; startup date
[Mon Jul 29 10:00:12 GMT+00:00 2013]; root of context hierarchy
[TopLink Config]: 2013.07.29 10:00:19.951--ServerSession(11681042)--Connection(9300874)--Thread(Thread[Thread-3,5,main])--disconnect
[TopLink Info]: 2013.07.29 10:00:19.953--ServerSession(11681042)--Thread(Thread[Thread-3,5,main])--<https://builds.apache.org/job/Myfaces-Orchestra/ws/trunk/core/target/test-classes-default>
logout successful
[TopLink Config]: 2013.07.29 10:00:19.953--ServerSession(11681042)--Connection(29972655)--Thread(Thread[Thread-3,5,main])--disconnect
[TopLink Config]: 2013.07.29 10:00:19.954--ServerSession(11681042)--Connection(31447311)--Thread(Thread[Thread-3,5,main])--disconnect
[TopLink Config]: 2013.07.29 10:00:19.954--ServerSession(11681042)--Connection(32110028)--Thread(Thread[Thread-3,5,main])--disconnect
[TopLink Config]: 2013.07.29 10:00:19.955--ServerSession(11681042)--Connection(18471838)--Thread(Thread[Thread-3,5,main])--disconnect
[TopLink Config]: 2013.07.29 10:00:19.955--ServerSession(11681042)--Connection(2526406)--Thread(Thread[Thread-3,5,main])--disconnect
[TopLink Config]: 2013.07.29 10:00:19.955--ServerSession(11681042)--Connection(12073952)--Thread(Thread[Thread-3,5,main])--disconnect
[TopLink Config]: 2013.07.29 10:00:19.956--ServerSession(11681042)--Connection(26708275)--Thread(Thread[Thread-3,5,main])--disconnect

Results :

Tests run: 15, Failures: 0, Errors: 0, Skipped: 0

[JENKINS] Recording test results
[INFO] [jar:jar {execution: default-jar}]
[INFO] Building jar: <https://builds.apache.org/job/Myfaces-Orchestra/ws/trunk/core/target/myfaces-orchestra-core-1.6-SNAPSHOT.jar>
[INFO] Preparing source:jar
[WARNING] Removing: jar from forked lifecycle, to prevent recursive invocation.
[WARNING] DEPRECATED [tasks]: Use target instead
[JENKINS] Archiving <https://builds.apache.org/job/Myfaces-Orchestra/ws/trunk/core/pom.xml>
to /home/hudson/hudson/jobs/Myfaces-Orchestra/modules/org.apache.myfaces.orchestra$myfaces-orchestra-core/builds/2013-07-29_09-53-48/archive/org.apache.myfaces.orchestra/myfaces-orchestra-core/1.6-SNAPSHOT/myfaces-orchestra-core-1.6-SNAPSHOT.pom
[JENKINS] Archiving <https://builds.apache.org/job/Myfaces-Orchestra/ws/trunk/core/target/myfaces-orchestra-core-1.6-SNAPSHOT.jar>
to /home/hudson/hudson/jobs/Myfaces-Orchestra/modules/org.apache.myfaces.orchestra$myfaces-orchestra-core/builds/2013-07-29_09-53-48/archive/org.apache.myfaces.orchestra/myfaces-orchestra-core/1.6-SNAPSHOT/myfaces-orchestra-core-1.6-SNAPSHOT.jar
[INFO] [antrun:run {execution: javadoc.resources}]
[WARNING] Parameter tasks is deprecated, use target instead
[INFO] Executing tasks

main:
[INFO] Executed tasks
[INFO] [build-helper:add-source {execution: add-source}]
[INFO] Source directory: <https://builds.apache.org/job/Myfaces-Orchestra/ws/trunk/core/target/shared_sources>
added.
ERROR: Could not find local repository for 2.2.1
[INFO] [source:jar {execution: attach-source}]
[INFO] ------------------------------------------------------------------------
[ERROR] FATAL ERROR
[INFO] ------------------------------------------------------------------------
[INFO] null
error=12, Not enough space
[INFO] ------------------------------------------------------------------------
[INFO] Trace
java.lang.reflect.UndeclaredThrowableException
	at org.codehaus.plexus.archiver.AbstractArchiver.getFiles(AbstractArchiver.java:519)
	at org.apache.maven.plugin.source.AbstractSourceJarMojo.packageSources(AbstractSourceJarMojo.java:262)
	at org.apache.maven.plugin.source.AbstractSourceJarMojo.packageSources(AbstractSourceJarMojo.java:232)
	at org.apache.maven.plugin.source.AbstractSourceJarMojo.execute(AbstractSourceJarMojo.java:201)
	at org.apache.maven.plugin.DefaultPluginManager.executeMojo(DefaultPluginManager.java:490)
	at hudson.maven.agent.PluginManagerInterceptor.executeMojo(PluginManagerInterceptor.java:182)
	at org.apache.maven.lifecycle.DefaultLifecycleExecutor.executeGoals(DefaultLifecycleExecutor.java:694)
	at org.apache.maven.lifecycle.DefaultLifecycleExecutor.executeGoalWithLifecycle(DefaultLifecycleExecutor.java:556)
	at org.apache.maven.lifecycle.DefaultLifecycleExecutor.executeGoal(DefaultLifecycleExecutor.java:535)
	at org.apache.maven.lifecycle.DefaultLifecycleExecutor.executeGoalAndHandleFailures(DefaultLifecycleExecutor.java:387)
	at org.apache.maven.lifecycle.DefaultLifecycleExecutor.executeTaskSegments(DefaultLifecycleExecutor.java:348)
	at org.apache.maven.lifecycle.DefaultLifecycleExecutor.execute(DefaultLifecycleExecutor.java:180)
	at org.apache.maven.lifecycle.LifecycleExecutorInterceptor.execute(LifecycleExecutorInterceptor.java:65)
	at org.apache.maven.DefaultMaven.doExecute(DefaultMaven.java:328)
	at org.apache.maven.DefaultMaven.execute(DefaultMaven.java:138)
	at org.apache.maven.cli.MavenCli.main(MavenCli.java:362)
	at sun.reflect.NativeMethodAccessorImpl.invoke0(Native Method)
	at sun.reflect.NativeMethodAccessorImpl.invoke(NativeMethodAccessorImpl.java:39)
	at sun.reflect.DelegatingMethodAccessorImpl.invoke(DelegatingMethodAccessorImpl.java:25)
	at java.lang.reflect.Method.invoke(Method.java:597)
	at org.codehaus.classworlds.Launcher.launchEnhanced(Launcher.java:315)
	at org.codehaus.classworlds.Launcher.launch(Launcher.java:255)
	at hudson.maven.agent.Main.launch(Main.java:204)
	at hudson.maven.MavenBuilder.call(MavenBuilder.java:154)
	at hudson.maven.Maven2Builder.call(Maven2Builder.java:79)
	at hudson.maven.Maven2Builder.call(Maven2Builder.java:55)
	at hudson.remoting.UserRequest.perform(UserRequest.java:118)
	at hudson.remoting.UserRequest.perform(UserRequest.java:48)
	at hudson.remoting.Request$2.run(Request.java:326)
	at hudson.remoting.InterceptingExecutorService$1.call(InterceptingExecutorService.java:72)
	at java.util.concurrent.FutureTask$Sync.innerRun(FutureTask.java:303)
	at java.util.concurrent.FutureTask.run(FutureTask.java:138)
	at java.util.concurrent.ThreadPoolExecutor$Worker.runTask(ThreadPoolExecutor.java:886)
	at java.util.concurrent.ThreadPoolExecutor$Worker.run(ThreadPoolExecutor.java:908)
	at java.lang.Thread.run(Thread.java:662)
Caused by: org.codehaus.plexus.archiver.ArchiverException: Failed to retrieve numeric file
attributes using: '/bin/sh -c ls -1nlaR <https://builds.apache.org/job/Myfaces-Orchestra/ws/trunk/core/target/maven-shared-archive-resources'>
	at org.codehaus.plexus.archiver.AbstractArchiver$1.hasNext(AbstractArchiver.java:427)
	at org.codehaus.plexus.archiver.AbstractArchiver.getFiles(AbstractArchiver.java:507)
	... 34 more
Caused by: java.io.IOException: Failed to retrieve numeric file attributes using: '/bin/sh
-c ls -1nlaR <https://builds.apache.org/job/Myfaces-Orchestra/ws/trunk/core/target/maven-shared-archive-resources'>
	at org.codehaus.plexus.components.io.attributes.PlexusIoResourceAttributeUtils.executeLs(PlexusIoResourceAttributeUtils.java:287)
	at org.codehaus.plexus.components.io.attributes.PlexusIoResourceAttributeUtils.getFileAttributesByPath(PlexusIoResourceAttributeUtils.java:223)
	at org.codehaus.plexus.components.io.attributes.PlexusIoResourceAttributeUtils.getFileAttributesByPath(PlexusIoResourceAttributeUtils.java:189)
	at org.codehaus.plexus.components.io.resources.PlexusIoFileResourceCollection.getResources(PlexusIoFileResourceCollection.java:175)
	at org.codehaus.plexus.archiver.AbstractArchiver$1.hasNext(AbstractArchiver.java:423)
	... 35 more
Caused by: org.codehaus.plexus.util.cli.CommandLineException: Error while executing process.
	at org.codehaus.plexus.util.cli.Commandline.execute(Commandline.java:656)
	at org.codehaus.plexus.util.cli.CommandLineUtils.executeCommandLine(CommandLineUtils.java:144)
	at org.codehaus.plexus.util.cli.CommandLineUtils.executeCommandLine(CommandLineUtils.java:107)
	at org.codehaus.plexus.components.io.attributes.PlexusIoResourceAttributeUtils.executeLs(PlexusIoResourceAttributeUtils.java:277)
	... 39 more
Caused by: java.io.IOException: Cannot run program "/bin/sh": error=12, Not enough space
	at java.lang.ProcessBuilder.start(ProcessBuilder.java:460)
	at java.lang.Runtime.exec(Runtime.java:593)
	at java.lang.Runtime.exec(Runtime.java:509)
	at org.codehaus.plexus.util.cli.Commandline.execute(Commandline.java:636)
	... 42 more
Caused by: java.io.IOException: error=12, Not enough space
	at java.lang.UNIXProcess.forkAndExec(Native Method)
	at java.lang.UNIXProcess.<init>(UNIXProcess.java:53)
	at java.lang.ProcessImpl.start(ProcessImpl.java:65)
	at java.lang.ProcessBuilder.start(ProcessBuilder.java:453)
	... 45 more
[INFO] ------------------------------------------------------------------------
[INFO] Total time: 5 minutes 48 seconds
[INFO] Finished at: Mon Jul 29 10:01:57 GMT+00:00 2013
[INFO] Final Memory: 74M/409M
[INFO] ------------------------------------------------------------------------
Waiting for Jenkins to finish collecting data
channel stopped

Mime
View raw message