myfaces-commits mailing list archives

Site index · List index
Message view « Date » · « Thread »
Top « Date » · « Thread »
From Apache Jenkins Server <jenk...@builds.apache.org>
Subject Build failed in Jenkins: myfaces-current-2.0-integration-tests #1477
Date Wed, 10 Jul 2013 21:07:04 GMT
See <https://builds.apache.org/job/myfaces-current-2.0-integration-tests/1477/>

------------------------------------------
[...truncated 266 lines...]
[WARNING] [talledLocalContainer] INFO: No context init parameter 'org.apache.myfaces.RESOURCE_MAX_TIME_EXPIRES'
found, using default value '604800000'.
[WARNING] [talledLocalContainer] Jul 10, 2013 9:06:21 PM org.apache.myfaces.webapp.WebConfigParamsLogger
logWebContextParams
[WARNING] [talledLocalContainer] INFO: No context init parameter 'org.apache.myfaces.RESOURCE_HANDLER_CACHE_SIZE'
found, using default value '500'.
[WARNING] [talledLocalContainer] Jul 10, 2013 9:06:21 PM org.apache.myfaces.webapp.WebConfigParamsLogger
logWebContextParams
[WARNING] [talledLocalContainer] INFO: No context init parameter 'org.apache.myfaces.RESOURCE_HANDLER_CACHE_ENABLED'
found, using default value 'true'.
[WARNING] [talledLocalContainer] Jul 10, 2013 9:06:21 PM org.apache.myfaces.webapp.WebConfigParamsLogger
logWebContextParams
[WARNING] [talledLocalContainer] INFO: No context init parameter 'org.apache.myfaces.USE_ENCRYPTION'
found, using default value 'true'.
[WARNING] [talledLocalContainer] Jul 10, 2013 9:06:21 PM org.apache.myfaces.webapp.WebConfigParamsLogger
logWebContextParams
[WARNING] [talledLocalContainer] INFO: No context init parameter 'org.apache.myfaces.SECRET'
found.
[WARNING] [talledLocalContainer] Jul 10, 2013 9:06:21 PM org.apache.myfaces.webapp.WebConfigParamsLogger
logWebContextParams
[WARNING] [talledLocalContainer] INFO: No context init parameter 'org.apache.myfaces.ALGORITHM'
found, using default value 'DES'.
[WARNING] [talledLocalContainer] Jul 10, 2013 9:06:21 PM org.apache.myfaces.webapp.WebConfigParamsLogger
logWebContextParams
[WARNING] [talledLocalContainer] INFO: No context init parameter 'org.apache.myfaces.SECRET.CACHE'
found.
[WARNING] [talledLocalContainer] Jul 10, 2013 9:06:21 PM org.apache.myfaces.webapp.WebConfigParamsLogger
logWebContextParams
[WARNING] [talledLocalContainer] INFO: No context init parameter 'org.apache.myfaces.ALGORITHM.IV'
found.
[WARNING] [talledLocalContainer] Jul 10, 2013 9:06:21 PM org.apache.myfaces.webapp.WebConfigParamsLogger
logWebContextParams
[WARNING] [talledLocalContainer] INFO: No context init parameter 'org.apache.myfaces.ALGORITHM.PARAMETERS'
found, using default value 'ECB/PKCS5Padding'.
[WARNING] [talledLocalContainer] Jul 10, 2013 9:06:21 PM org.apache.myfaces.webapp.WebConfigParamsLogger
logWebContextParams
[WARNING] [talledLocalContainer] INFO: No context init parameter 'org.apache.myfaces.SERIAL_FACTORY'
found.
[WARNING] [talledLocalContainer] Jul 10, 2013 9:06:21 PM org.apache.myfaces.webapp.WebConfigParamsLogger
logWebContextParams
[WARNING] [talledLocalContainer] INFO: No context init parameter 'org.apache.myfaces.COMPRESS_STATE_IN_CLIENT'
found, using default value 'false'.
[WARNING] [talledLocalContainer] Jul 10, 2013 9:06:21 PM org.apache.myfaces.webapp.WebConfigParamsLogger
logWebContextParams
[WARNING] [talledLocalContainer] INFO: No context init parameter 'org.apache.myfaces.MAC_ALGORITHM'
found, using default value 'HmacSHA1'.
[WARNING] [talledLocalContainer] Jul 10, 2013 9:06:21 PM org.apache.myfaces.webapp.WebConfigParamsLogger
logWebContextParams
[WARNING] [talledLocalContainer] INFO: No context init parameter 'org.apache.myfaces.MAC_SECRET'
found.
[WARNING] [talledLocalContainer] Jul 10, 2013 9:06:21 PM org.apache.myfaces.webapp.WebConfigParamsLogger
logWebContextParams
[WARNING] [talledLocalContainer] INFO: No context init parameter 'org.apache.myfaces.MAC_SECRET.CACHE'
found.
[WARNING] [talledLocalContainer] Jul 10, 2013 9:06:21 PM org.apache.myfaces.webapp.WebConfigParamsLogger
logWebContextParams
[WARNING] [talledLocalContainer] INFO: No context init parameter 'javax.faces.DATETIMECONVERTER_DEFAULT_TIMEZONE_IS_SYSTEM_TIMEZONE'
found, using default value 'false'.
[WARNING] [talledLocalContainer] Jul 10, 2013 9:06:21 PM org.apache.myfaces.webapp.WebConfigParamsLogger
logWebContextParams
[WARNING] [talledLocalContainer] INFO: No context init parameter 'org.apache.myfaces.LAZY_LOAD_CONFIG_OBJECTS'
found, using default value 'true'.
[WARNING] [talledLocalContainer] Jul 10, 2013 9:06:21 PM org.apache.myfaces.webapp.WebConfigParamsLogger
logWebContextParams
[WARNING] [talledLocalContainer] INFO: No context init parameter 'org.apache.myfaces.STRICT_JSF_2_ALLOW_SLASH_LIBRARY_NAME'
found, using default value 'false'.
[WARNING] [talledLocalContainer] Jul 10, 2013 9:06:21 PM org.apache.myfaces.webapp.WebConfigParamsLogger
logWebContextParams
[WARNING] [talledLocalContainer] INFO: No context init parameter 'org.apache.myfaces.VALIDATE'
found, using default value 'false'.
[WARNING] [talledLocalContainer] Jul 10, 2013 9:06:21 PM org.apache.myfaces.webapp.WebConfigParamsLogger
logWebContextParams
[WARNING] [talledLocalContainer] INFO: No context init parameter 'org.apache.myfaces.annotation.SCAN_PACKAGES'
found.
[WARNING] [talledLocalContainer] Jul 10, 2013 9:06:21 PM org.apache.myfaces.webapp.WebConfigParamsLogger
logWebContextParams
[WARNING] [talledLocalContainer] INFO: No context init parameter 'org.apache.myfaces.config.annotation.LifecycleProvider'
found.
[WARNING] [talledLocalContainer] Jul 10, 2013 9:06:21 PM org.apache.myfaces.webapp.WebConfigParamsLogger
logWebContextParams
[WARNING] [talledLocalContainer] INFO: No context init parameter 'org.apache.myfaces.EL_RESOLVER_COMPARATOR'
found.
[WARNING] [talledLocalContainer] Jul 10, 2013 9:06:21 PM org.apache.myfaces.webapp.WebConfigParamsLogger
logWebContextParams
[WARNING] [talledLocalContainer] INFO: No context init parameter 'org.apache.myfaces.CHECKED_VIEWID_CACHE_SIZE'
found, using default value '500'.
[WARNING] [talledLocalContainer] Jul 10, 2013 9:06:21 PM org.apache.myfaces.webapp.WebConfigParamsLogger
logWebContextParams
[WARNING] [talledLocalContainer] INFO: No context init parameter 'org.apache.myfaces.CHECKED_VIEWID_CACHE_ENABLED'
found, using default value 'true'.
[WARNING] [talledLocalContainer] Jul 10, 2013 9:06:21 PM org.apache.myfaces.webapp.WebConfigParamsLogger
logWebContextParams
[WARNING] [talledLocalContainer] INFO: No context init parameter 'org.apache.myfaces.CLIENT_VIEW_STATE_TIMEOUT'
found, using default value '0'.
[WARNING] [talledLocalContainer] Jul 10, 2013 9:06:21 PM org.apache.myfaces.webapp.WebConfigParamsLogger
logWebContextParams
[WARNING] [talledLocalContainer] INFO: No context init parameter 'org.apache.myfaces.ERROR_TEMPLATE_RESOURCE'
found, using default value 'META-INF/rsc/myfaces-dev-error.xml'.
[WARNING] [talledLocalContainer] Jul 10, 2013 9:06:21 PM org.apache.myfaces.webapp.WebConfigParamsLogger
logWebContextParams
[WARNING] [talledLocalContainer] INFO: No context init parameter 'org.apache.myfaces.DEBUG_TEMPLATE_RESOURCE'
found, using default value 'META-INF/rsc/myfaces-dev-debug.xml'.
[WARNING] [talledLocalContainer] Jul 10, 2013 9:06:21 PM org.apache.myfaces.webapp.WebConfigParamsLogger
logWebContextParams
[WARNING] [talledLocalContainer] INFO: No context init parameter 'org.apache.myfaces.ERROR_HANDLING'
found, using default value 'false, on Development Project stage: true'.
[WARNING] [talledLocalContainer] Jul 10, 2013 9:06:21 PM org.apache.myfaces.webapp.WebConfigParamsLogger
logWebContextParams
[WARNING] [talledLocalContainer] INFO: No context init parameter 'org.apache.myfaces.NUMBER_OF_VIEWS_IN_SESSION'
found, using default value '20'.
[WARNING] [talledLocalContainer] Jul 10, 2013 9:06:21 PM org.apache.myfaces.webapp.WebConfigParamsLogger
logWebContextParams
[WARNING] [talledLocalContainer] INFO: No context init parameter 'org.apache.myfaces.NUMBER_OF_SEQUENTIAL_VIEWS_IN_SESSION'
found.
[WARNING] [talledLocalContainer] Jul 10, 2013 9:06:21 PM org.apache.myfaces.webapp.WebConfigParamsLogger
logWebContextParams
[WARNING] [talledLocalContainer] INFO: No context init parameter 'org.apache.myfaces.SERIALIZE_STATE_IN_SESSION'
found, using default value 'true'.
[WARNING] [talledLocalContainer] Jul 10, 2013 9:06:21 PM org.apache.myfaces.webapp.WebConfigParamsLogger
logWebContextParams
[WARNING] [talledLocalContainer] INFO: No context init parameter 'org.apache.myfaces.COMPRESS_STATE_IN_SESSION'
found, using default value 'true'.
[WARNING] [talledLocalContainer] Jul 10, 2013 9:06:21 PM org.apache.myfaces.webapp.WebConfigParamsLogger
logWebContextParams
[WARNING] [talledLocalContainer] INFO: No context init parameter 'org.apache.myfaces.CACHE_OLD_VIEWS_IN_SESSION_MODE'
found, using default value 'off'.
[WARNING] [talledLocalContainer] Jul 10, 2013 9:06:21 PM org.apache.myfaces.webapp.WebConfigParamsLogger
logWebContextParams
[WARNING] [talledLocalContainer] INFO: No context init parameter 'org.apache.myfaces.USE_FLASH_SCOPE_PURGE_VIEWS_IN_SESSION'
found, using default value 'false'.
[WARNING] [talledLocalContainer] Jul 10, 2013 9:06:21 PM org.apache.myfaces.webapp.WebConfigParamsLogger
logWebContextParams
[WARNING] [talledLocalContainer] INFO: No context init parameter 'org.apache.myfaces.RANDOM_KEY_IN_VIEW_STATE_SESSION_TOKEN'
found, using default value 'none'.
[WARNING] [talledLocalContainer] Jul 10, 2013 9:06:21 PM org.apache.myfaces.webapp.WebConfigParamsLogger
logWebContextParams
[WARNING] [talledLocalContainer] INFO: No context init parameter 'org.apache.myfaces.RANDOM_KEY_IN_VIEW_STATE_SESSION_TOKEN_LENGTH'
found, using default value '8'.
[WARNING] [talledLocalContainer] Jul 10, 2013 9:06:21 PM org.apache.myfaces.webapp.WebConfigParamsLogger
logWebContextParams
[WARNING] [talledLocalContainer] INFO: No context init parameter 'org.apache.myfaces.RANDOM_KEY_IN_VIEW_STATE_SESSION_TOKEN_SECURE_RANDOM_CLASS'
found.
[WARNING] [talledLocalContainer] Jul 10, 2013 9:06:21 PM org.apache.myfaces.webapp.WebConfigParamsLogger
logWebContextParams
[WARNING] [talledLocalContainer] INFO: No context init parameter 'org.apache.myfaces.RANDOM_KEY_IN_VIEW_STATE_SESSION_TOKEN_SECURE_RANDOM_PROVIDER'
found.
[WARNING] [talledLocalContainer] Jul 10, 2013 9:06:21 PM org.apache.myfaces.webapp.WebConfigParamsLogger
logWebContextParams
[WARNING] [talledLocalContainer] INFO: No context init parameter 'org.apache.myfaces.RANDOM_KEY_IN_VIEW_STATE_SESSION_TOKEN_SECURE_RANDOM_ALGORITM'
found, using default value 'SHA1PRNG'.
[WARNING] [talledLocalContainer] Jul 10, 2013 9:06:21 PM org.apache.myfaces.webapp.WebConfigParamsLogger
logWebContextParams
[WARNING] [talledLocalContainer] INFO: No context init parameter 'org.apache.myfaces.HANDLE_STATE_CACHING_MECHANICS'
found, using default value 'true'.
[WARNING] [talledLocalContainer] Jul 10, 2013 9:06:21 PM org.apache.myfaces.webapp.WebConfigParamsLogger
logWebContextParams
[WARNING] [talledLocalContainer] INFO: No context init parameter 'org.apache.myfaces.USE_MULTIPLE_JS_FILES_FOR_JSF_UNCOMPRESSED_JS'
found, using default value 'false'.
[WARNING] [talledLocalContainer] Jul 10, 2013 9:06:21 PM org.apache.myfaces.webapp.WebConfigParamsLogger
logWebContextParams
[WARNING] [talledLocalContainer] INFO: No context init parameter 'org.apache.myfaces.JSF_JS_MODE'
found, using default value 'normal'.
[WARNING] [talledLocalContainer] Jul 10, 2013 9:06:21 PM org.apache.myfaces.webapp.WebConfigParamsLogger
logWebContextParams
[WARNING] [talledLocalContainer] INFO: No context init parameter 'org.apache.myfaces.SERVICE_PROVIDER_FINDER'
found.
[WARNING] [talledLocalContainer] Jul 10, 2013 9:06:21 PM org.apache.myfaces.webapp.WebConfigParamsLogger
logWebContextParams
[WARNING] [talledLocalContainer] INFO: No context init parameter 'javax.faces.DISABLE_FACELET_JSF_VIEWHANDLER'
found, using default value 'false'.
[WARNING] [talledLocalContainer] Jul 10, 2013 9:06:21 PM org.apache.myfaces.webapp.WebConfigParamsLogger
logWebContextParams
[WARNING] [talledLocalContainer] INFO: No context init parameter 'org.apache.myfaces.SAVE_STATE_WITH_VISIT_TREE_ON_PSS'
found, using default value 'true'.
[WARNING] [talledLocalContainer] Jul 10, 2013 9:06:21 PM org.apache.myfaces.webapp.WebConfigParamsLogger
logWebContextParams
[WARNING] [talledLocalContainer] INFO: No context init parameter 'org.apache.myfaces.CHECK_ID_PRODUCTION_MODE'
found, using default value 'auto'.
[WARNING] [talledLocalContainer] Jul 10, 2013 9:06:21 PM org.apache.myfaces.webapp.WebConfigParamsLogger
logWebContextParams
[WARNING] [talledLocalContainer] INFO: No context init parameter 'javax.faces.FACELETS_BUFFER_SIZE'
found.
[WARNING] [talledLocalContainer] Jul 10, 2013 9:06:21 PM org.apache.myfaces.webapp.WebConfigParamsLogger
logWebContextParams
[WARNING] [talledLocalContainer] INFO: No context init parameter 'facelets.BUFFER_SIZE' found.
[WARNING] [talledLocalContainer] Jul 10, 2013 9:06:21 PM org.apache.myfaces.webapp.WebConfigParamsLogger
logWebContextParams
[WARNING] [talledLocalContainer] INFO: No context init parameter 'javax.faces.FACELETS_DECORATORS'
found.
[WARNING] [talledLocalContainer] Jul 10, 2013 9:06:21 PM org.apache.myfaces.webapp.WebConfigParamsLogger
logWebContextParams
[WARNING] [talledLocalContainer] INFO: No context init parameter 'facelets.DECORATORS' found.
[WARNING] [talledLocalContainer] Jul 10, 2013 9:06:21 PM org.apache.myfaces.webapp.WebConfigParamsLogger
logWebContextParams
[WARNING] [talledLocalContainer] INFO: No context init parameter 'javax.faces.FACELETS_LIBRARIES'
found.
[WARNING] [talledLocalContainer] Jul 10, 2013 9:06:21 PM org.apache.myfaces.webapp.WebConfigParamsLogger
logWebContextParams
[WARNING] [talledLocalContainer] INFO: No context init parameter 'facelets.LIBRARIES' found.
[WARNING] [talledLocalContainer] Jul 10, 2013 9:06:21 PM org.apache.myfaces.webapp.WebConfigParamsLogger
logWebContextParams
[WARNING] [talledLocalContainer] INFO: No context init parameter 'javax.faces.FACELETS_REFRESH_PERIOD'
found, using default value '-1'.
[WARNING] [talledLocalContainer] Jul 10, 2013 9:06:21 PM org.apache.myfaces.webapp.WebConfigParamsLogger
logWebContextParams
[WARNING] [talledLocalContainer] INFO: No context init parameter 'facelets.REFRESH_PERIOD'
found, using default value '-1'.
[WARNING] [talledLocalContainer] Jul 10, 2013 9:06:21 PM org.apache.myfaces.webapp.WebConfigParamsLogger
logWebContextParams
[WARNING] [talledLocalContainer] INFO: No context init parameter 'javax.faces.FACELETS_RESOURCE_RESOLVER'
found.
[WARNING] [talledLocalContainer] Jul 10, 2013 9:06:21 PM org.apache.myfaces.webapp.WebConfigParamsLogger
logWebContextParams
[WARNING] [talledLocalContainer] INFO: No context init parameter 'facelets.RESOURCE_RESOLVER'
found.
[WARNING] [talledLocalContainer] Jul 10, 2013 9:06:21 PM org.apache.myfaces.webapp.WebConfigParamsLogger
logWebContextParams
[WARNING] [talledLocalContainer] INFO: No context init parameter 'javax.faces.FACELETS_SKIP_COMMENTS'
found.
[WARNING] [talledLocalContainer] Jul 10, 2013 9:06:21 PM org.apache.myfaces.webapp.WebConfigParamsLogger
logWebContextParams
[WARNING] [talledLocalContainer] INFO: No context init parameter 'facelets.SKIP_COMMENTS'
found.
[WARNING] [talledLocalContainer] Jul 10, 2013 9:06:21 PM org.apache.myfaces.webapp.WebConfigParamsLogger
logWebContextParams
[WARNING] [talledLocalContainer] INFO: No context init parameter 'org.apache.myfaces.WRAP_TAG_EXCEPTIONS_AS_CONTEXT_AWARE'
found, using default value 'true'.
[WARNING] [talledLocalContainer] Jul 10, 2013 9:06:21 PM org.apache.myfaces.webapp.WebConfigParamsLogger
logWebContextParams
[WARNING] [talledLocalContainer] INFO: No context init parameter 'org.apache.myfaces.CACHE_EL_EXPRESSIONS'
found, using default value 'noCache'.
[WARNING] [talledLocalContainer] Jul 10, 2013 9:06:21 PM org.apache.myfaces.webapp.WebConfigParamsLogger
logWebContextParams
[WARNING] [talledLocalContainer] INFO: No context init parameter 'org.apache.myfaces.EXPRESSION_FACTORY'
found.
[WARNING] [talledLocalContainer] Jul 10, 2013 9:06:21 PM org.apache.myfaces.webapp.WebConfigParamsLogger
logWebContextParams
[WARNING] [talledLocalContainer] INFO: No context init parameter 'org.apache.myfaces.INITIALIZE_ALWAYS_STANDALONE'
found, using default value 'false'.
[WARNING] [talledLocalContainer] Jul 10, 2013 9:06:21 PM org.apache.myfaces.webapp.WebConfigParamsLogger
logWebContextParams
[WARNING] [talledLocalContainer] INFO: No context init parameter 'org.apache.myfaces.LOG_WEB_CONTEXT_PARAMS'
found, using default value 'auto'.
[WARNING] [talledLocalContainer] Jul 10, 2013 9:06:21 PM org.apache.myfaces.webapp.WebConfigParamsLogger
logWebContextParams
[WARNING] [talledLocalContainer] INFO: No context init parameter 'org.apache.myfaces.FACES_INITIALIZER'
found.
[WARNING] [talledLocalContainer] Jul 10, 2013 9:06:21 PM org.apache.myfaces.webapp.WebConfigParamsLogger
logWebContextParams
[WARNING] [talledLocalContainer] INFO: No context init parameter 'org.apache.myfaces.FACES_INIT_PLUGINS'
found.
[WARNING] [talledLocalContainer] Jul 10, 2013 9:06:21 PM org.apache.myfaces.util.ExternalSpecifications
isUnifiedELAvailable
[WARNING] [talledLocalContainer] INFO: MyFaces Unified EL support disabled
[WARNING] [talledLocalContainer] Jul 10, 2013 9:06:21 PM org.apache.catalina.startup.HostConfig
deployDirectory
[WARNING] [talledLocalContainer] INFO: Deploying web application directory manager
[WARNING] [talledLocalContainer] Jul 10, 2013 9:06:21 PM org.apache.catalina.startup.HostConfig
deployDirectory
[WARNING] [talledLocalContainer] INFO: Deploying web application directory host-manager
[WARNING] [talledLocalContainer] Jul 10, 2013 9:06:21 PM org.apache.coyote.http11.Http11Protocol
start
[WARNING] [talledLocalContainer] INFO: Starting Coyote HTTP/1.1 on http-9090
[WARNING] [talledLocalContainer] Jul 10, 2013 9:06:21 PM org.apache.jk.common.ChannelSocket
init
[WARNING] [talledLocalContainer] INFO: JK: ajp13 listening on /0.0.0.0:8009
[WARNING] [talledLocalContainer] Jul 10, 2013 9:06:21 PM org.apache.jk.server.JkMain start
[WARNING] [talledLocalContainer] INFO: Jk running ID=0 time=0/22  config=null
[WARNING] [talledLocalContainer] Jul 10, 2013 9:06:21 PM org.apache.catalina.startup.Catalina
start
[WARNING] [talledLocalContainer] INFO: Server startup in 1587 ms
[INFO] [talledLocalContainer] Tomcat 6.x started on port [9090]
[INFO] ------------------------------------------------------------------------
[INFO] Reactor Summary:
[INFO] 
[INFO] Apache MyFaces JSF-2.0 Core Integration Tests Parent  SUCCESS [30.339s]
[INFO] Apache MyFaces JSF-2.0 Core Integration Tests Support Module  SUCCESS [5.718s]
[INFO] Apache MyFaces JSF-2.0 Core Integration Tests - Basic tests for a Servlet 2.5 + EL
1.0 environment  FAILURE [28.563s]
[INFO] Apache MyFaces JSF-2.0 Core Integration Tests - Basic tests for a Servlet 2.5 + EL
2.2 environment  SKIPPED
[INFO] Apache MyFaces JSF-2.0 Core Integration Tests - Basic tests for a Servlet 3.0 + EL
2.2 environment  SKIPPED
[INFO] ------------------------------------------------------------------------
[INFO] BUILD FAILURE
[INFO] ------------------------------------------------------------------------
[INFO] Total time: 1:08.195s
[INFO] Finished at: Wed Jul 10 21:06:22 UTC 2013
[INFO] Final Memory: 27M/74M
[INFO] ------------------------------------------------------------------------
[JENKINS] Archiving <https://builds.apache.org/job/myfaces-current-2.0-integration-tests/ws/pom.xml>
to /home/hudson/hudson/jobs/myfaces-current-2.0-integration-tests/modules/org.apache.myfaces.core.integrationtest$myfaces-integration-tests/builds/2013-07-10_21-04-53/archive/org.apache.myfaces.core.integrationtest/myfaces-integration-tests/2.0.15-SNAPSHOT/myfaces-integration-tests-2.0.15-SNAPSHOT.pom
[JENKINS] Archiving <https://builds.apache.org/job/myfaces-current-2.0-integration-tests/ws/integration-test-support/pom.xml>
to /home/hudson/hudson/jobs/myfaces-current-2.0-integration-tests/modules/org.apache.myfaces.core.integrationtest$myfaces-integration-test-support/builds/2013-07-10_21-04-53/archive/org.apache.myfaces.core.integrationtest/myfaces-integration-test-support/2.0.15-SNAPSHOT/myfaces-integration-test-support-2.0.15-SNAPSHOT.pom
[JENKINS] Archiving <https://builds.apache.org/job/myfaces-current-2.0-integration-tests/ws/integration-test-support/target/myfaces-integration-test-support-2.0.15-SNAPSHOT.jar>
to /home/hudson/hudson/jobs/myfaces-current-2.0-integration-tests/modules/org.apache.myfaces.core.integrationtest$myfaces-integration-test-support/builds/2013-07-10_21-04-53/archive/org.apache.myfaces.core.integrationtest/myfaces-integration-test-support/2.0.15-SNAPSHOT/myfaces-integration-test-support-2.0.15-SNAPSHOT.jar
[JENKINS] Archiving <https://builds.apache.org/job/myfaces-current-2.0-integration-tests/ws/integration-test-support/target/myfaces-integration-test-support-2.0.15-SNAPSHOT-sources.jar>
to /home/hudson/hudson/jobs/myfaces-current-2.0-integration-tests/modules/org.apache.myfaces.core.integrationtest$myfaces-integration-test-support/builds/2013-07-10_21-04-53/archive/org.apache.myfaces.core.integrationtest/myfaces-integration-test-support/2.0.15-SNAPSHOT/myfaces-integration-test-support-2.0.15-SNAPSHOT-sources.jar
[JENKINS] Archiving <https://builds.apache.org/job/myfaces-current-2.0-integration-tests/ws/servlet25-el22-basic-tests/pom.xml>
to /home/hudson/hudson/jobs/myfaces-current-2.0-integration-tests/modules/org.apache.myfaces.core.integrationtest$myfaces-servlet25-el22-basic-tests/builds/2013-07-10_21-04-53/archive/org.apache.myfaces.core.integrationtest/myfaces-servlet25-el22-basic-tests/2.0.15-SNAPSHOT/myfaces-servlet25-el22-basic-tests-2.0.15-SNAPSHOT.pom
[JENKINS] Archiving <https://builds.apache.org/job/myfaces-current-2.0-integration-tests/ws/servlet25-el10-basic-tests/pom.xml>
to /home/hudson/hudson/jobs/myfaces-current-2.0-integration-tests/modules/org.apache.myfaces.core.integrationtest$myfaces-servlet25-el10-basic-tests/builds/2013-07-10_21-04-53/archive/org.apache.myfaces.core.integrationtest/myfaces-servlet25-el10-basic-tests/2.0.15-SNAPSHOT/myfaces-servlet25-el10-basic-tests-2.0.15-SNAPSHOT.pom
[JENKINS] Archiving <https://builds.apache.org/job/myfaces-current-2.0-integration-tests/ws/servlet25-el10-basic-tests/target/myfaces-servlet25-el10-basic-tests-2.0.15-SNAPSHOT.war>
to /home/hudson/hudson/jobs/myfaces-current-2.0-integration-tests/modules/org.apache.myfaces.core.integrationtest$myfaces-servlet25-el10-basic-tests/builds/2013-07-10_21-04-53/archive/org.apache.myfaces.core.integrationtest/myfaces-servlet25-el10-basic-tests/2.0.15-SNAPSHOT/myfaces-servlet25-el10-basic-tests-2.0.15-SNAPSHOT.war
[JENKINS] Archiving <https://builds.apache.org/job/myfaces-current-2.0-integration-tests/ws/servlet25-el10-basic-tests/target/myfaces-servlet25-el10-basic-tests-2.0.15-SNAPSHOT-sources.jar>
to /home/hudson/hudson/jobs/myfaces-current-2.0-integration-tests/modules/org.apache.myfaces.core.integrationtest$myfaces-servlet25-el10-basic-tests/builds/2013-07-10_21-04-53/archive/org.apache.myfaces.core.integrationtest/myfaces-servlet25-el10-basic-tests/2.0.15-SNAPSHOT/myfaces-servlet25-el10-basic-tests-2.0.15-SNAPSHOT-sources.jar
[JENKINS] Archiving <https://builds.apache.org/job/myfaces-current-2.0-integration-tests/ws/servlet30-el22-basic-tests/pom.xml>
to /home/hudson/hudson/jobs/myfaces-current-2.0-integration-tests/modules/org.apache.myfaces.core.integrationtest$myfaces-servlet30-el22-basic-tests/builds/2013-07-10_21-04-53/archive/org.apache.myfaces.core.integrationtest/myfaces-servlet30-el22-basic-tests/2.0.15-SNAPSHOT/myfaces-servlet30-el22-basic-tests-2.0.15-SNAPSHOT.pom
Waiting for Jenkins to finish collecting data
mavenExecutionResult exceptions not empty
message : Internal error: java.lang.reflect.UndeclaredThrowableException
cause : null
Stack trace : 
org.apache.maven.InternalErrorException: Internal error: java.lang.reflect.UndeclaredThrowableException
	at org.apache.maven.lifecycle.internal.BuilderCommon.handleBuildError(BuilderCommon.java:128)
	at org.apache.maven.lifecycle.internal.LifecycleModuleBuilder.buildProject(LifecycleModuleBuilder.java:95)
	at org.apache.maven.lifecycle.internal.LifecycleModuleBuilder.buildProject(LifecycleModuleBuilder.java:59)
	at org.apache.maven.lifecycle.internal.LifecycleStarter.singleThreadedBuild(LifecycleStarter.java:183)
	at org.apache.maven.lifecycle.internal.LifecycleStarter.execute(LifecycleStarter.java:161)
	at org.apache.maven.DefaultMaven.doExecute(DefaultMaven.java:320)
	at org.apache.maven.DefaultMaven.execute(DefaultMaven.java:156)
	at org.jvnet.hudson.maven3.launcher.Maven3Launcher.main(Maven3Launcher.java:79)
	at sun.reflect.NativeMethodAccessorImpl.invoke0(Native Method)
	at sun.reflect.NativeMethodAccessorImpl.invoke(NativeMethodAccessorImpl.java:39)
	at sun.reflect.DelegatingMethodAccessorImpl.invoke(DelegatingMethodAccessorImpl.java:25)
	at java.lang.reflect.Method.invoke(Method.java:597)
	at org.codehaus.plexus.classworlds.launcher.Launcher.launchStandard(Launcher.java:329)
	at org.codehaus.plexus.classworlds.launcher.Launcher.launch(Launcher.java:239)
	at org.jvnet.hudson.maven3.agent.Maven3Main.launch(Maven3Main.java:158)
	at hudson.maven.Maven3Builder.call(Maven3Builder.java:100)
	at hudson.maven.Maven3Builder.call(Maven3Builder.java:66)
	at hudson.remoting.UserRequest.perform(UserRequest.java:118)
	at hudson.remoting.UserRequest.perform(UserRequest.java:48)
	at hudson.remoting.Request$2.run(Request.java:326)
	at hudson.remoting.InterceptingExecutorService$1.call(InterceptingExecutorService.java:72)
	at java.util.concurrent.FutureTask$Sync.innerRun(FutureTask.java:303)
	at java.util.concurrent.FutureTask.run(FutureTask.java:138)
	at java.util.concurrent.ThreadPoolExecutor$Worker.runTask(ThreadPoolExecutor.java:895)
	at java.util.concurrent.ThreadPoolExecutor$Worker.run(ThreadPoolExecutor.java:918)
	at java.lang.Thread.run(Thread.java:662)
Caused by: java.lang.reflect.UndeclaredThrowableException
	at com.sun.proxy.$Proxy2.setExecutedMojos(Unknown Source)
	at hudson.maven.MavenBuildProxy$Filter.setExecutedMojos(MavenBuildProxy.java:243)
	at hudson.maven.Maven3Builder$MavenExecutionListener.recordMojoEnded(Maven3Builder.java:439)
	at hudson.maven.Maven3Builder$MavenExecutionListener.mojoSucceeded(Maven3Builder.java:425)
	at org.apache.maven.lifecycle.internal.DefaultExecutionEventCatapult.fire(DefaultExecutionEventCatapult.java:87)
	at org.apache.maven.lifecycle.internal.DefaultExecutionEventCatapult.fire(DefaultExecutionEventCatapult.java:42)
	at org.apache.maven.lifecycle.internal.MojoExecutor.execute(MojoExecutor.java:228)
	at org.apache.maven.lifecycle.internal.MojoExecutor.execute(MojoExecutor.java:153)
	at org.apache.maven.lifecycle.internal.MojoExecutor.execute(MojoExecutor.java:145)
	at org.apache.maven.lifecycle.internal.LifecycleModuleBuilder.buildProject(LifecycleModuleBuilder.java:84)
	... 24 more
Caused by: java.io.UTFDataFormatException
	at java.io.ObjectInputStream$BlockDataInputStream.readUTFSpan(ObjectInputStream.java:3105)
	at java.io.ObjectInputStream$BlockDataInputStream.readUTFBody(ObjectInputStream.java:3030)
	at java.io.ObjectInputStream$BlockDataInputStream.readUTF(ObjectInputStream.java:2843)
	at java.io.ObjectInputStream.readUTF(ObjectInputStream.java:1069)
	at java.io.ObjectStreamClass.readNonProxy(ObjectStreamClass.java:658)
	at java.io.ObjectInputStream.readClassDescriptor(ObjectInputStream.java:827)
	at java.io.ObjectInputStream.readNonProxyDesc(ObjectInputStream.java:1583)
	at java.io.ObjectInputStream.readClassDesc(ObjectInputStream.java:1514)
	at java.io.ObjectInputStream.readOrdinaryObject(ObjectInputStream.java:1750)
	at java.io.ObjectInputStream.readObject0(ObjectInputStream.java:1347)
	at java.io.ObjectInputStream.readObject(ObjectInputStream.java:369)
	at java.util.concurrent.CopyOnWriteArrayList.readObject(CopyOnWriteArrayList.java:879)
	at sun.reflect.GeneratedMethodAccessor15361.invoke(Unknown Source)
	at sun.reflect.DelegatingMethodAccessorImpl.invoke(DelegatingMethodAccessorImpl.java:43)
	at java.lang.reflect.Method.invoke(Method.java:601)
	at java.io.ObjectStreamClass.invokeReadObject(ObjectStreamClass.java:1004)
	at java.io.ObjectInputStream.readSerialData(ObjectInputStream.java:1872)
	at java.io.ObjectInputStream.readOrdinaryObject(ObjectInputStream.java:1777)
	at java.io.ObjectInputStream.readObject0(ObjectInputStream.java:1347)
	at java.io.ObjectInputStream.readArray(ObjectInputStream.java:1685)
	at java.io.ObjectInputStream.readObject0(ObjectInputStream.java:1341)
	at java.io.ObjectInputStream.defaultReadFields(ObjectInputStream.java:1970)
	at java.io.ObjectInputStream.readSerialData(ObjectInputStream.java:1894)
	at java.io.ObjectInputStream.readOrdinaryObject(ObjectInputStream.java:1777)
	at java.io.ObjectInputStream.readObject0(ObjectInputStream.java:1347)
	at java.io.ObjectInputStream.readObject(ObjectInputStream.java:369)
	at hudson.remoting.UserRequest.deserialize(UserRequest.java:182)
	at hudson.remoting.UserRequest.perform(UserRequest.java:98)
	at hudson.remoting.UserRequest.perform(UserRequest.java:48)
	at hudson.remoting.Request$2.run(Request.java:326)
	at hudson.remoting.InterceptingExecutorService$1.call(InterceptingExecutorService.java:72)
	at java.util.concurrent.FutureTask$Sync.innerRun(FutureTask.java:334)
	at java.util.concurrent.FutureTask.run(FutureTask.java:166)
	at java.util.concurrent.ThreadPoolExecutor.runWorker(ThreadPoolExecutor.java:1145)
	at java.util.concurrent.ThreadPoolExecutor$Worker.run(ThreadPoolExecutor.java:615)
	at java.lang.Thread.run(Thread.java:722)
Sending e-mails to: commits@myfaces.apache.org
channel stopped

Mime
View raw message