myfaces-commits mailing list archives

Site index · List index
Message view « Date » · « Thread »
Top « Date » · « Thread »
From Apache Jenkins Server <jenk...@builds.apache.org>
Subject Build failed in Jenkins: myfaces-current21 #1968
Date Sun, 15 Sep 2013 23:37:24 GMT
See <https://builds.apache.org/job/myfaces-current21/1968/>

------------------------------------------
[...truncated 3864 lines...]
[INFO] [myfaces-builder:make-config {execution: make_ui_facelet_tld}]
[INFO] generated file myfaces_facelets_ui.tld is up to date
[INFO] [myfaces-builder:make-config {execution: make_composite_facelet_tld}]
[INFO] generated file myfaces_facelets_composite.tld is up to date
[INFO] [myfaces-builder:make-config {execution: make_fn_facelet_tld}]
[INFO] generated file myfaces_facelet_fn.tld is up to date
[INFO] [myfaces-builder:make-config {execution: make_core_facelet_xsd}]
[INFO] generated file myfaces_facelets_core_2_1.xsd is up to date
[INFO] [myfaces-builder:make-config {execution: make_html_facelet_xsd}]
[INFO] generated file myfaces_facelets_html_2_1.xsd is up to date
[INFO] [myfaces-builder:make-config {execution: make_c_facelet_xsd}]
[INFO] generated file myfaces_facelets_c_2_1.xsd is up to date
[INFO] [myfaces-builder:make-config {execution: make_ui_facelet_xsd}]
[INFO] generated file myfaces_facelets_ui_2_1.xsd is up to date
[INFO] [myfaces-builder:make-config {execution: make_composite_facelet_xsd}]
[INFO] generated file myfaces_facelets_composite_2_1.xsd is up to date
ERROR: Could not find local repository for 2.2.1
[INFO] [source:jar {execution: attach-source}]
[JENKINS] Re-archiving <https://builds.apache.org/job/myfaces-current21/ws/current21/core/impl/target/myfaces-impl-2.1.13-SNAPSHOT.jar[INFO]>
Building jar: <https://builds.apache.org/job/myfaces-current21/ws/current21/core/impl/target/myfaces-impl-2.1.13-SNAPSHOT-sources.jar>

[INFO] [jar:test-jar {execution: default}]
[INFO] Building jar: <https://builds.apache.org/job/myfaces-current21/ws/current21/core/impl/target/myfaces-impl-2.1.13-SNAPSHOT-tests.jar>
[INFO] [shade:shade {execution: default}]
[INFO] Excluding org.apache.myfaces.core:myfaces-api:jar:2.1.13-SNAPSHOT from the shaded jar.
[INFO] Excluding org.apache.myfaces.core.internal:myfaces-impl-shared-public:jar:2.1.13-SNAPSHOT
from the shaded jar.
[INFO] Excluding commons-codec:commons-codec:jar:1.3 from the shaded jar.
[INFO] Including org.apache.myfaces.core.internal:myfaces-impl-shared:jar:2.1.13-SNAPSHOT
in the shaded jar.
[INFO] Excluding org.apache.geronimo.specs:geronimo-validation_1.0_spec:jar:1.1 from the shaded
jar.
[INFO] Excluding org.apache.geronimo.specs:geronimo-jpa_3.0_spec:jar:1.1.1 from the shaded
jar.
[INFO] Excluding org.apache.geronimo.specs:geronimo-ejb_3.0_spec:jar:1.0.1 from the shaded
jar.
[INFO] Excluding commons-collections:commons-collections:jar:3.2 from the shaded jar.
[INFO] Excluding commons-beanutils:commons-beanutils:jar:1.8.3 from the shaded jar.
[INFO] Excluding commons-logging:commons-logging:jar:1.1.1 from the shaded jar.
[INFO] Excluding commons-digester:commons-digester:jar:1.8 from the shaded jar.
[INFO] Excluding org.apache.tomcat:catalina:jar:6.0.29 from the shaded jar.
[INFO] Excluding org.apache.tomcat:servlet-api:jar:6.0.29 from the shaded jar.
[INFO] Excluding org.apache.tomcat:juli:jar:6.0.29 from the shaded jar.
[INFO] Excluding org.apache.tomcat:annotations-api:jar:6.0.29 from the shaded jar.
[INFO] Excluding org.apache.tomcat:tomcat-catalina:jar:7.0.0 from the shaded jar.
[INFO] Excluding org.apache.tomcat:tomcat-servlet-api:jar:7.0.0 from the shaded jar.
[INFO] Excluding org.apache.tomcat:tomcat-juli:jar:7.0.0 from the shaded jar.
[INFO] Excluding org.apache.tomcat:tomcat-annotations-api:jar:7.0.0 from the shaded jar.
[INFO] Excluding org.apache.tomcat:tomcat-api:jar:7.0.0 from the shaded jar.
[INFO] Excluding org.apache.tomcat:tomcat-util:jar:7.0.0 from the shaded jar.
[INFO] Excluding com.google.code.guice:guice:jar:1.0 from the shaded jar.
[INFO] Replacing original artifact with shaded artifact.
[INFO] Replacing <https://builds.apache.org/job/myfaces-current21/ws/current21/core/impl/target/myfaces-impl-2.1.13-SNAPSHOT.jar>
with <https://builds.apache.org/job/myfaces-current21/ws/current21/core/impl/target/myfaces-impl-2.1.13-SNAPSHOT-shaded.jar>
[INFO] Replacing <https://builds.apache.org/job/myfaces-current21/ws/current21/core/impl/target/myfaces-impl-2.1.13-SNAPSHOT-sources.jar>
with <https://builds.apache.org/job/myfaces-current21/ws/current21/core/impl/target/myfaces-impl-2.1.13-SNAPSHOT-shaded-sources.jar>
[INFO] [checkstyle:check {execution: verify-style}]
[INFO] 
[INFO] [install:install {execution: default-install}]
[INFO] Installing <https://builds.apache.org/job/myfaces-current21/ws/current21/core/impl/target/myfaces-impl-2.1.13-SNAPSHOT.jar>
to /home/jenkins/jenkins-slave/maven-repositories/1/org/apache/myfaces/core/myfaces-impl/2.1.13-SNAPSHOT/myfaces-impl-2.1.13-SNAPSHOT.jar
[INFO] Installing <https://builds.apache.org/job/myfaces-current21/ws/current21/core/impl/target/myfaces-impl-2.1.13-SNAPSHOT-sources.jar>
to /home/jenkins/jenkins-slave/maven-repositories/1/org/apache/myfaces/core/myfaces-impl/2.1.13-SNAPSHOT/myfaces-impl-2.1.13-SNAPSHOT-sources.jar
[INFO] Installing <https://builds.apache.org/job/myfaces-current21/ws/current21/core/impl/target/myfaces-impl-2.1.13-SNAPSHOT-tests.jar>
to /home/jenkins/jenkins-slave/maven-repositories/1/org/apache/myfaces/core/myfaces-impl/2.1.13-SNAPSHOT/myfaces-impl-2.1.13-SNAPSHOT-tests.jar
[INFO] Installing <https://builds.apache.org/job/myfaces-current21/ws/current21/core/impl/target/myfaces-impl-2.1.13-SNAPSHOT-sources.jar>
to /home/jenkins/jenkins-slave/maven-repositories/1/org/apache/myfaces/core/myfaces-impl/2.1.13-SNAPSHOT/myfaces-impl-2.1.13-SNAPSHOT-sources.jar
[JENKINS] Archiving <https://builds.apache.org/job/myfaces-current21/ws/current21/core/impl/target/myfaces-impl-2.1.13-SNAPSHOT-sources.jar>
to /home/hudson/hudson/jobs/myfaces-current21/modules/org.apache.myfaces.core$myfaces-impl/builds/2013-09-15_23-21-09/archive/org.apache.myfaces.core/myfaces-impl/2.1.13-SNAPSHOT/myfaces-impl-2.1.13-SNAPSHOT-sources.jar
[JENKINS] Archiving <https://builds.apache.org/job/myfaces-current21/ws/current21/core/impl/target/myfaces-impl-2.1.13-SNAPSHOT-tests.jar>
to /home/hudson/hudson/jobs/myfaces-current21/modules/org.apache.myfaces.core$myfaces-impl/builds/2013-09-15_23-21-09/archive/org.apache.myfaces.core/myfaces-impl/2.1.13-SNAPSHOT/myfaces-impl-2.1.13-SNAPSHOT-tests.jar
[INFO] ------------------------------------------------------------------------
[INFO] Building Apache MyFaces JSF-2.1 Core OSGi Bundle
[INFO]    task-segment: [install]
[INFO] ------------------------------------------------------------------------
[JENKINS] Recording test results[INFO] [remote-resources:process {execution: default}]
[debug] execute contextualize

[INFO] [resources:resources {execution: default-resources}]
[INFO] Using 'UTF-8' encoding to copy filtered resources.
[INFO] skip non existing resourceDirectory <https://builds.apache.org/job/myfaces-current21/ws/current21/core/bundle/src/main/resources>
[INFO] Copying 3 resources
[INFO] [compiler:compile {execution: default-compile}]
[INFO] No sources to compile
[debug] execute contextualize
[INFO] [resources:testResources {execution: default-testResources}]
[INFO] Using 'UTF-8' encoding to copy filtered resources.
[INFO] skip non existing resourceDirectory <https://builds.apache.org/job/myfaces-current21/ws/current21/core/bundle/src/test/resources>
[INFO] Copying 3 resources
[INFO] [compiler:testCompile {execution: default-testCompile}]
[INFO] No sources to compile
[INFO] [surefire:test {execution: default-test}]
[INFO] Surefire report directory: <https://builds.apache.org/job/myfaces-current21/ws/current21/core/bundle/target/surefire-reports>

-------------------------------------------------------
 T E S T S
-------------------------------------------------------

Results :

Tests run: 0, Failures: 0, Errors: 0, Skipped: 0

[INFO] [bundle:bundle {execution: default-bundle}]
[INFO] Preparing source:jar
[JENKINS] Archiving <https://builds.apache.org/job/myfaces-current21/ws/current21/core/bundle/pom.xml>
to /home/hudson/hudson/jobs/myfaces-current21/modules/org.apache.myfaces.core$myfaces-bundle/builds/2013-09-15_23-21-10/archive/org.apache.myfaces.core/myfaces-bundle/2.1.13-SNAPSHOT/myfaces-bundle-2.1.13-SNAPSHOT.pom[WARNING]
Removing: jar from forked lifecycle, to prevent recursive invocation.
[INFO] No goals needed for project - skipping
[INFO] [source:jar {execution: attach-source}]
[INFO] Building jar: <https://builds.apache.org/job/myfaces-current21/ws/current21/core/bundle/target/myfaces-bundle-2.1.13-SNAPSHOT-sources.jar>
[INFO] [checkstyle:check {execution: verify-style}]
[INFO] 

[INFO] [install:install {execution: default-install}]
[INFO] Installing <https://builds.apache.org/job/myfaces-current21/ws/current21/core/bundle/target/myfaces-bundle-2.1.13-SNAPSHOT.jar>
to /home/jenkins/jenkins-slave/maven-repositories/1/org/apache/myfaces/core/myfaces-bundle/2.1.13-SNAPSHOT/myfaces-bundle-2.1.13-SNAPSHOT.jar
[INFO] Installing <https://builds.apache.org/job/myfaces-current21/ws/current21/core/bundle/target/myfaces-bundle-2.1.13-SNAPSHOT-sources.jar>
to /home/jenkins/jenkins-slave/maven-repositories/1/org/apache/myfaces/core/myfaces-bundle/2.1.13-SNAPSHOT/myfaces-bundle-2.1.13-SNAPSHOT-sources.jar
[INFO] [bundle:install {execution: default-install}]
[WARNING] Exception while updating local OBR: Unable to read repository xml: file:/home/jenkins/jenkins-slave/maven-repositories/1/repository.xml
org.apache.maven.plugin.MojoExecutionException: Unable to read repository xml: file:/home/jenkins/jenkins-slave/maven-repositories/1/repository.xml
	at org.apache.felix.obrplugin.ObrUpdate.parseRepositoryXml(ObrUpdate.java:295)
	at org.apache.felix.obrplugin.ObrInstall.execute(ObrInstall.java:140)
	at org.apache.maven.plugin.DefaultPluginManager.executeMojo(DefaultPluginManager.java:490)
	at hudson.maven.agent.PluginManagerInterceptor.executeMojo(PluginManagerInterceptor.java:182)
	at org.apache.maven.lifecycle.DefaultLifecycleExecutor.executeGoals(DefaultLifecycleExecutor.java:694)
	at org.apache.maven.lifecycle.DefaultLifecycleExecutor.executeGoalWithLifecycle(DefaultLifecycleExecutor.java:556)
	at org.apache.maven.lifecycle.DefaultLifecycleExecutor.executeGoal(DefaultLifecycleExecutor.java:535)
	at org.apache.maven.lifecycle.DefaultLifecycleExecutor.executeGoalAndHandleFailures(DefaultLifecycleExecutor.java:387)
	at org.apache.maven.lifecycle.DefaultLifecycleExecutor.executeTaskSegments(DefaultLifecycleExecutor.java:348)
	at org.apache.maven.lifecycle.DefaultLifecycleExecutor.execute(DefaultLifecycleExecutor.java:180)
	at org.apache.maven.lifecycle.LifecycleExecutorInterceptor.execute(LifecycleExecutorInterceptor.java:65)
	at org.apache.maven.DefaultMaven.doExecute(DefaultMaven.java:328)
	at org.apache.maven.DefaultMaven.execute(DefaultMaven.java:138)
	at org.apache.maven.cli.MavenCli.main(MavenCli.java:362)
	at sun.reflect.NativeMethodAccessorImpl.invoke0(Native Method)
	at sun.reflect.NativeMethodAccessorImpl.invoke(NativeMethodAccessorImpl.java:39)
	at sun.reflect.DelegatingMethodAccessorImpl.invoke(DelegatingMethodAccessorImpl.java:25)
	at java.lang.reflect.Method.invoke(Method.java:597)
	at org.codehaus.classworlds.Launcher.launchEnhanced(Launcher.java:315)
	at org.codehaus.classworlds.Launcher.launch(Launcher.java:255)
	at hudson.maven.agent.Main.launch(Main.java:204)
	at hudson.maven.MavenBuilder.call(MavenBuilder.java:154)
	at hudson.maven.Maven2Builder.call(Maven2Builder.java:79)
	at hudson.maven.Maven2Builder.call(Maven2Builder.java:55)
	at hudson.remoting.UserRequest.perform(UserRequest.java:118)
	at hudson.remoting.UserRequest.perform(UserRequest.java:48)
	at hudson.remoting.Request$2.run(Request.java:326)
	at hudson.remoting.InterceptingExecutorService$1.call(InterceptingExecutorService.java:72)
	at java.util.concurrent.FutureTask$Sync.innerRun(FutureTask.java:303)
	at java.util.concurrent.FutureTask.run(FutureTask.java:138)
	at java.util.concurrent.ThreadPoolExecutor$Worker.runTask(ThreadPoolExecutor.java:895)
	at java.util.concurrent.ThreadPoolExecutor$Worker.run(ThreadPoolExecutor.java:918)
	at java.lang.Thread.run(Thread.java:662)
Caused by: org.xmlpull.v1.XmlPullParserException: unexpected type (position:END_DOCUMENT null@3:1
in java.io.InputStreamReader@a27501) 
	at org.kxml2.io.KXmlParser.exception(Unknown Source)
	at org.kxml2.io.KXmlParser.nextTag(Unknown Source)
	at org.apache.felix.bundlerepository.impl.PullParser.parseRepository(PullParser.java:43)
	at org.apache.felix.bundlerepository.impl.DataModelHelperImpl.repository(DataModelHelperImpl.java:147)
	at org.apache.felix.bundlerepository.impl.DataModelHelperImpl.repository(DataModelHelperImpl.java:118)
	at org.apache.felix.obrplugin.ObrUpdate.parseRepositoryXml(ObrUpdate.java:291)
	... 32 more
[JENKINS] Archiving <https://builds.apache.org/job/myfaces-current21/ws/current21/core/bundle/target/myfaces-bundle-2.1.13-SNAPSHOT.jar>
to /home/hudson/hudson/jobs/myfaces-current21/modules/org.apache.myfaces.core$myfaces-bundle/builds/2013-09-15_23-21-10/archive/org.apache.myfaces.core/myfaces-bundle/2.1.13-SNAPSHOT/myfaces-bundle-2.1.13-SNAPSHOT.jar
[JENKINS] Archiving <https://builds.apache.org/job/myfaces-current21/ws/current21/core/bundle/target/myfaces-bundle-2.1.13-SNAPSHOT-sources.jar>
to /home/hudson/hudson/jobs/myfaces-current21/modules/org.apache.myfaces.core$myfaces-bundle/builds/2013-09-15_23-21-10/archive/org.apache.myfaces.core/myfaces-bundle/2.1.13-SNAPSHOT/myfaces-bundle-2.1.13-SNAPSHOT-sources.jar
[INFO] ------------------------------------------------------------------------
[INFO] Building Apache MyFaces JSF-2.1 Core Module
[INFO]    task-segment: [install]
[INFO] ------------------------------------------------------------------------
[JENKINS] Archiving <https://builds.apache.org/job/myfaces-current21/ws/current21/core/pom.xml>
to /home/hudson/hudson/jobs/myfaces-current21/modules/org.apache.myfaces.core$myfaces-core-module/builds/2013-09-15_23-21-09/archive/org.apache.myfaces.core/myfaces-core-module/2.1.13-SNAPSHOT/myfaces-core-module-2.1.13-SNAPSHOT.pom[INFO]
[remote-resources:process {execution: default}]

[INFO] [site:attach-descriptor {execution: default-attach-descriptor}]
[INFO] [checkstyle:check {execution: verify-style}]
[INFO] 
[INFO] [install:install {execution: default-install}]
[INFO] Installing <https://builds.apache.org/job/myfaces-current21/ws/current21/core/pom.xml>
to /home/jenkins/jenkins-slave/maven-repositories/1/org/apache/myfaces/core/myfaces-core-module/2.1.13-SNAPSHOT/myfaces-core-module-2.1.13-SNAPSHOT.pom
[INFO] ------------------------------------------------------------------------
[INFO] Building Apache MyFaces Composite Build
[INFO]    task-segment: [install]
[INFO] ------------------------------------------------------------------------
[INFO] [remote-resources:process {execution: default}]
[INFO] [site:attach-descriptor {execution: default-attach-descriptor}]
[INFO] [checkstyle:check {execution: verify-style}]
[INFO] 
[INFO] [install:install {execution: default-install}]
[INFO] Installing <https://builds.apache.org/job/myfaces-current21/ws/current21/pom.xml>
to /home/jenkins/jenkins-slave/maven-repositories/1/org/apache/myfaces/myfaces-base/2.1.0-SNAPSHOT/myfaces-base-2.1.0-SNAPSHOT.pom
[JENKINS] Archiving <https://builds.apache.org/job/myfaces-current21/ws/current21/pom.xml>
to /home/hudson/hudson/jobs/myfaces-current21/modules/org.apache.myfaces$myfaces-base/builds/2013-09-15_23-21-08/archive/org.apache.myfaces/myfaces-base/2.1.0-SNAPSHOT/myfaces-base-2.1.0-SNAPSHOT.pom
[INFO] 
[INFO] 
[INFO] ------------------------------------------------------------------------
[INFO] Reactor Summary:
[INFO] ------------------------------------------------------------------------
[INFO] Apache MyFaces JSF-2.1 Core Project ................... SUCCESS [28.544s]
[INFO] Apache MyFaces JSF-2.1 Core API ....................... SUCCESS [1:37.062s]
[INFO] Apache MyFaces Shared For JSF 2.1 - Project ........... SUCCESS [12.577s]
[INFO] Apache MyFaces Shared For JSF 2.1 - Core Mirror ....... SUCCESS [29.362s]
[INFO] MyFaces Shared Tomahawk ............................... SUCCESS [25.252s]
[INFO] Apache MyFaces Shared Public API For JSF 2.1 - Core ... SUCCESS [36.824s]
[INFO] Apache MyFaces Core For JSF 2.1 - Shared .............. SUCCESS [1:18.308s]
[INFO] Apache MyFaces JSF-2.1 Core Impl ...................... SUCCESS [2:06.917s]
[INFO] Apache MyFaces JSF-2.1 Core OSGi Bundle ............... SUCCESS [25.525s]
[INFO] Apache MyFaces JSF-2.1 Core Module .................... SUCCESS [16.717s]
[INFO] Apache MyFaces Composite Build ........................ SUCCESS [17.534s]
[INFO] ------------------------------------------------------------------------
[INFO] ------------------------------------------------------------------------
[INFO] BUILD SUCCESSFUL
[INFO] ------------------------------------------------------------------------
[INFO] Total time: 12 minutes 6 seconds
[INFO] Finished at: Sun Sep 15 23:33:31 UTC 2013
[INFO] Final Memory: 169M/509M
[INFO] ------------------------------------------------------------------------
Waiting for Jenkins to finish collecting data
channel stopped
Maven RedeployPublisher use remote ubuntu1 maven settings from : /home/jenkins/.m2/settings.xml
[INFO] Deployment in https://repository.apache.org/content/repositories/snapshots (id=apache.snapshots.https,uniqueVersion=false)
Deploying the main artifact myfaces-base-2.1.0-SNAPSHOT.pom
[INFO] Deployment in https://repository.apache.org/content/repositories/snapshots (id=apache.snapshots.https,uniqueVersion=false)
Deploying the main artifact myfaces-api-2.1.13-SNAPSHOT.jar
Deploying the main artifact myfaces-api-2.1.13-SNAPSHOT-sources.jar
Deploying the main artifact myfaces-api-2.1.13-SNAPSHOT-tests.jar
[INFO] Deployment in https://repository.apache.org/content/repositories/snapshots (id=apache.snapshots.https,uniqueVersion=false)
Deploying the main artifact myfaces-bundle-2.1.13-SNAPSHOT.jar
Deploying the main artifact myfaces-bundle-2.1.13-SNAPSHOT-sources.jar
ERROR: Error installing artifact's metadata: Error while deploying metadata: The target server
failed to respond
org.apache.maven.artifact.deployer.ArtifactDeploymentException: Error installing artifact's
metadata: Error while deploying metadata: The target server failed to respond
	at hudson.maven.artifact.deployer.DefaultArtifactDeployer.deploy(DefaultArtifactDeployer.java:183)
	at hudson.maven.reporters.MavenArtifactRecord.deploy(MavenArtifactRecord.java:195)
	at hudson.maven.RedeployPublisher.perform(RedeployPublisher.java:176)
	at hudson.tasks.BuildStepMonitor$1.perform(BuildStepMonitor.java:20)
	at hudson.model.AbstractBuild$AbstractBuildExecution.perform(AbstractBuild.java:782)
	at hudson.model.AbstractBuild$AbstractBuildExecution.performAllBuildSteps(AbstractBuild.java:754)
	at hudson.maven.MavenModuleSetBuild$MavenModuleSetBuildExecution.post2(MavenModuleSetBuild.java:1007)
	at hudson.model.AbstractBuild$AbstractBuildExecution.post(AbstractBuild.java:707)
	at hudson.model.Run.execute(Run.java:1628)
	at hudson.maven.MavenModuleSetBuild.run(MavenModuleSetBuild.java:506)
	at hudson.model.ResourceController.execute(ResourceController.java:88)
	at hudson.model.Executor.run(Executor.java:246)
Caused by: org.apache.maven.artifact.repository.metadata.RepositoryMetadataDeploymentException:
Error while deploying metadata: The target server failed to respond
	at org.apache.maven.artifact.repository.metadata.DefaultRepositoryMetadataManager.deploy(DefaultRepositoryMetadataManager.java:492)
	at hudson.maven.artifact.deployer.DefaultArtifactDeployer.deploy(DefaultArtifactDeployer.java:167)
	... 11 more
Caused by: org.apache.maven.wagon.TransferFailedException: The target server failed to respond
	at org.apache.maven.wagon.shared.http4.AbstractHttpClientWagon.put(AbstractHttpClientWagon.java:580)
	at org.apache.maven.wagon.shared.http4.AbstractHttpClientWagon.put(AbstractHttpClientWagon.java:524)
	at org.apache.maven.wagon.shared.http4.AbstractHttpClientWagon.put(AbstractHttpClientWagon.java:505)
	at org.apache.maven.wagon.shared.http4.AbstractHttpClientWagon.put(AbstractHttpClientWagon.java:485)
	at org.apache.maven.repository.legacy.DefaultWagonManager.putRemoteFile(DefaultWagonManager.java:543)
	at org.apache.maven.repository.legacy.DefaultWagonManager.putArtifactMetadata(DefaultWagonManager.java:501)
	at org.apache.maven.artifact.repository.metadata.DefaultRepositoryMetadataManager.deploy(DefaultRepositoryMetadataManager.java:488)
	... 12 more
Caused by: org.apache.http.NoHttpResponseException: The target server failed to respond
	at org.apache.http.impl.conn.DefaultHttpResponseParser.parseHead(DefaultHttpResponseParser.java:95)
	at org.apache.http.impl.conn.DefaultHttpResponseParser.parseHead(DefaultHttpResponseParser.java:62)
	at org.apache.http.impl.io.AbstractMessageParser.parse(AbstractMessageParser.java:254)
	at org.apache.http.impl.AbstractHttpClientConnection.receiveResponseHeader(AbstractHttpClientConnection.java:289)
	at org.apache.http.impl.conn.DefaultClientConnection.receiveResponseHeader(DefaultClientConnection.java:252)
	at org.apache.http.impl.conn.ManagedClientConnectionImpl.receiveResponseHeader(ManagedClientConnectionImpl.java:191)
	at org.apache.http.protocol.HttpRequestExecutor.doReceiveResponse(HttpRequestExecutor.java:300)
	at org.apache.http.protocol.HttpRequestExecutor.execute(HttpRequestExecutor.java:127)
	at org.apache.http.impl.client.DefaultRequestDirector.tryExecute(DefaultRequestDirector.java:715)
	at org.apache.http.impl.client.DefaultRequestDirector.execute(DefaultRequestDirector.java:520)
	at org.apache.http.impl.client.AbstractHttpClient.execute(AbstractHttpClient.java:906)
	at org.apache.http.impl.client.AbstractHttpClient.execute(AbstractHttpClient.java:805)
	at org.apache.maven.wagon.shared.http4.AbstractHttpClientWagon.execute(AbstractHttpClientWagon.java:746)
	at org.apache.maven.wagon.shared.http4.AbstractHttpClientWagon.put(AbstractHttpClientWagon.java:574)
	... 18 more
[INFO] Deployment failed after 3 min 3 sec
Build step 'Deploy artifacts to Maven repository' changed build result to FAILURE

Mime
View raw message