myfaces-commits mailing list archives

Site index · List index
Message view « Date » · « Thread »
Top « Date » · « Thread »
From Apache Jenkins Server <jenk...@builds.apache.org>
Subject Build failed in Jenkins: tobago-1.0.x #738
Date Sat, 14 Sep 2013 09:37:39 GMT
See <https://builds.apache.org/job/tobago-1.0.x/738/>

------------------------------------------
[...truncated 3563 lines...]
[INFO] [compiler:compile {execution: default-compile}]
[INFO] Compiling 2 source files to <https://builds.apache.org/job/tobago-1.0.x/ws/tobago-1.0.x/theme/speyside/target/classes>
[INFO] [resources:testResources {execution: default-testResources}]
[INFO] Using 'UTF-8' encoding to copy filtered resources.
[INFO] skip non existing resourceDirectory <https://builds.apache.org/job/tobago-1.0.x/ws/tobago-1.0.x/theme/speyside/src/test/resources>
[INFO] Copying 3 resources
[INFO] [compiler:testCompile {execution: default-testCompile}]
[INFO] No sources to compile
[INFO] [surefire:test {execution: default-test}]
[INFO] Surefire report directory: <https://builds.apache.org/job/tobago-1.0.x/ws/tobago-1.0.x/theme/speyside/target/surefire-reports>

-------------------------------------------------------
 T E S T S
-------------------------------------------------------
There are no tests to run.

Results :

Tests run: 0, Failures: 0, Errors: 0, Skipped: 0

[INFO] [jar:jar {execution: default-jar}]
[INFO] Building jar: <https://builds.apache.org/job/tobago-1.0.x/ws/tobago-1.0.x/theme/speyside/target/tobago-theme-speyside-1.0.41-SNAPSHOT.jar>
[INFO] [install:install {execution: default-install}]
[INFO] Installing <https://builds.apache.org/job/tobago-1.0.x/ws/tobago-1.0.x/theme/speyside/target/tobago-theme-speyside-1.0.41-SNAPSHOT.jar>
to /home/jenkins/jenkins-slave/maven-repositories/0/org/apache/myfaces/tobago/tobago-theme-speyside/1.0.41-SNAPSHOT/tobago-theme-speyside-1.0.41-SNAPSHOT.jar
[INFO] [checkstyle:check {execution: default-cli}]
[INFO] 
[JENKINS] Archiving <https://builds.apache.org/job/tobago-1.0.x/ws/tobago-1.0.x/theme/speyside/pom.xml>
to /home/hudson/hudson/jobs/tobago-1.0.x/modules/org.apache.myfaces.tobago$tobago-theme-speyside/builds/2013-09-14_09-27-12/archive/org.apache.myfaces.tobago/tobago-theme-speyside/1.0.41-SNAPSHOT/tobago-theme-speyside-1.0.41-SNAPSHOT.pom
[JENKINS] Archiving <https://builds.apache.org/job/tobago-1.0.x/ws/tobago-1.0.x/theme/speyside/target/tobago-theme-speyside-1.0.41-SNAPSHOT.jar>
to /home/hudson/hudson/jobs/tobago-1.0.x/modules/org.apache.myfaces.tobago$tobago-theme-speyside/builds/2013-09-14_09-27-12/archive/org.apache.myfaces.tobago/tobago-theme-speyside/1.0.41-SNAPSHOT/tobago-theme-speyside-1.0.41-SNAPSHOT.jar
[INFO] ------------------------------------------------------------------------
[INFO] Building Theme Richmond
[INFO]    task-segment: [clean, install, checkstyle:check]
[INFO] ------------------------------------------------------------------------
[INFO] [clean:clean {execution: default-clean}]
[INFO] [remote-resources:process {execution: default}]
[INFO] [resources:resources {execution: default-resources}]
[INFO] Using 'UTF-8' encoding to copy filtered resources.
[INFO] Copying 65 resources
[INFO] Copying 3 resources
[INFO] [compiler:compile {execution: default-compile}]
[INFO] No sources to compile
[INFO] [resources:testResources {execution: default-testResources}]
[INFO] Using 'UTF-8' encoding to copy filtered resources.
[INFO] skip non existing resourceDirectory <https://builds.apache.org/job/tobago-1.0.x/ws/tobago-1.0.x/theme/richmond/src/test/resources>
[INFO] Copying 3 resources
[INFO] [compiler:testCompile {execution: default-testCompile}]
[INFO] No sources to compile
[INFO] [surefire:test {execution: default-test}]
[INFO] Surefire report directory: <https://builds.apache.org/job/tobago-1.0.x/ws/tobago-1.0.x/theme/richmond/target/surefire-reports>

[JENKINS] Recording test results-------------------------------------------------------
 T E S T S
-------------------------------------------------------

There are no tests to run.

Results :

Tests run: 0, Failures: 0, Errors: 0, Skipped: 0

[INFO] [jar:jar {execution: default-jar}]
[INFO] Building jar: <https://builds.apache.org/job/tobago-1.0.x/ws/tobago-1.0.x/theme/richmond/target/tobago-theme-richmond-1.0.41-SNAPSHOT.jar>
[INFO] [install:install {execution: default-install}]
[INFO] Installing <https://builds.apache.org/job/tobago-1.0.x/ws/tobago-1.0.x/theme/richmond/target/tobago-theme-richmond-1.0.41-SNAPSHOT.jar>
to /home/jenkins/jenkins-slave/maven-repositories/0/org/apache/myfaces/tobago/tobago-theme-richmond/1.0.41-SNAPSHOT/tobago-theme-richmond-1.0.41-SNAPSHOT.jar
[INFO] [checkstyle:check {execution: default-cli}]
[INFO] 
[JENKINS] Archiving <https://builds.apache.org/job/tobago-1.0.x/ws/tobago-1.0.x/theme/richmond/pom.xml>
to /home/hudson/hudson/jobs/tobago-1.0.x/modules/org.apache.myfaces.tobago$tobago-theme-richmond/builds/2013-09-14_09-27-12/archive/org.apache.myfaces.tobago/tobago-theme-richmond/1.0.41-SNAPSHOT/tobago-theme-richmond-1.0.41-SNAPSHOT.pom
[JENKINS] Archiving <https://builds.apache.org/job/tobago-1.0.x/ws/tobago-1.0.x/theme/richmond/target/tobago-theme-richmond-1.0.41-SNAPSHOT.jar>
to /home/hudson/hudson/jobs/tobago-1.0.x/modules/org.apache.myfaces.tobago$tobago-theme-richmond/builds/2013-09-14_09-27-12/archive/org.apache.myfaces.tobago/tobago-theme-richmond/1.0.41-SNAPSHOT/tobago-theme-richmond-1.0.41-SNAPSHOT.jar
[INFO] ------------------------------------------------------------------------
[INFO] Building Theme Charlotteville
[INFO]    task-segment: [clean, install, checkstyle:check]
[INFO] ------------------------------------------------------------------------
[INFO] [clean:clean {execution: default-clean}]
[INFO] [remote-resources:process {execution: default}]
[INFO] [resources:resources {execution: default-resources}]
[INFO] Using 'UTF-8' encoding to copy filtered resources.
[INFO] Copying 7 resources
[INFO] Copying 3 resources
[INFO] [compiler:compile {execution: default-compile}]
[INFO] No sources to compile
[INFO] [resources:testResources {execution: default-testResources}]
[INFO] Using 'UTF-8' encoding to copy filtered resources.
[INFO] skip non existing resourceDirectory <https://builds.apache.org/job/tobago-1.0.x/ws/tobago-1.0.x/theme/charlotteville/src/test/resources>
[INFO] Copying 3 resources
[INFO] [compiler:testCompile {execution: default-testCompile}]
[INFO] No sources to compile
[INFO] [surefire:test {execution: default-test}]
[INFO] Surefire report directory: <https://builds.apache.org/job/tobago-1.0.x/ws/tobago-1.0.x/theme/charlotteville/target/surefire-reports>

-------------------------------------------------------
 T E S T S
-------------------------------------------------------
There are no tests to run.

Results :

Tests run: 0, Failures: 0, Errors: 0, Skipped: 0

[JENKINS] Recording test results
[INFO] [jar:jar {execution: default-jar}]
[INFO] Building jar: <https://builds.apache.org/job/tobago-1.0.x/ws/tobago-1.0.x/theme/charlotteville/target/tobago-theme-charlotteville-1.0.41-SNAPSHOT.jar>
[INFO] [install:install {execution: default-install}]
[INFO] Installing <https://builds.apache.org/job/tobago-1.0.x/ws/tobago-1.0.x/theme/charlotteville/target/tobago-theme-charlotteville-1.0.41-SNAPSHOT.jar>
to /home/jenkins/jenkins-slave/maven-repositories/0/org/apache/myfaces/tobago/tobago-theme-charlotteville/1.0.41-SNAPSHOT/tobago-theme-charlotteville-1.0.41-SNAPSHOT.jar
[INFO] [checkstyle:check {execution: default-cli}]
[INFO] 
[JENKINS] Archiving <https://builds.apache.org/job/tobago-1.0.x/ws/tobago-1.0.x/theme/charlotteville/pom.xml>
to /home/hudson/hudson/jobs/tobago-1.0.x/modules/org.apache.myfaces.tobago$tobago-theme-charlotteville/builds/2013-09-14_09-27-12/archive/org.apache.myfaces.tobago/tobago-theme-charlotteville/1.0.41-SNAPSHOT/tobago-theme-charlotteville-1.0.41-SNAPSHOT.pom
[JENKINS] Archiving <https://builds.apache.org/job/tobago-1.0.x/ws/tobago-1.0.x/theme/charlotteville/target/tobago-theme-charlotteville-1.0.41-SNAPSHOT.jar>
to /home/hudson/hudson/jobs/tobago-1.0.x/modules/org.apache.myfaces.tobago$tobago-theme-charlotteville/builds/2013-09-14_09-27-12/archive/org.apache.myfaces.tobago/tobago-theme-charlotteville/1.0.41-SNAPSHOT/tobago-theme-charlotteville-1.0.41-SNAPSHOT.jar
[INFO] ------------------------------------------------------------------------
[INFO] Building Tobago Extensions
[INFO]    task-segment: [clean, install, checkstyle:check]
[INFO] ------------------------------------------------------------------------
[INFO] [clean:clean {execution: default-clean}]
[INFO] [remote-resources:process {execution: default}]
[INFO] [site:attach-descriptor {execution: default-attach-descriptor}]
[INFO] [install:install {execution: default-install}]
[INFO] Installing <https://builds.apache.org/job/tobago-1.0.x/ws/tobago-1.0.x/extension/pom.xml>
to /home/jenkins/jenkins-slave/maven-repositories/0/org/apache/myfaces/tobago/tobago-extension/1.0.41-SNAPSHOT/tobago-extension-1.0.41-SNAPSHOT.pom
[INFO] [checkstyle:check {execution: default-cli}]
[INFO] 
[JENKINS] Archiving <https://builds.apache.org/job/tobago-1.0.x/ws/tobago-1.0.x/extension/pom.xml>
to /home/hudson/hudson/jobs/tobago-1.0.x/modules/org.apache.myfaces.tobago$tobago-extension/builds/2013-09-14_09-27-12/archive/org.apache.myfaces.tobago/tobago-extension/1.0.41-SNAPSHOT/tobago-extension-1.0.41-SNAPSHOT.pom
[INFO] ------------------------------------------------------------------------
[INFO] Building Tobago Fileupload
[INFO]    task-segment: [clean, install, checkstyle:check]
[INFO] ------------------------------------------------------------------------
[INFO] [clean:clean {execution: default-clean}]
[INFO] [remote-resources:process {execution: default}]
[INFO] [resources:resources {execution: default-resources}]
[INFO] Using 'UTF-8' encoding to copy filtered resources.
[INFO] Copying 3 resources
[INFO] Copying 3 resources
[INFO] [compiler:compile {execution: default-compile}]
[INFO] Compiling 1 source file to <https://builds.apache.org/job/tobago-1.0.x/ws/tobago-1.0.x/extension/fileupload/target/classes>
[INFO] [resources:testResources {execution: default-testResources}]
[INFO] Using 'UTF-8' encoding to copy filtered resources.
[INFO] skip non existing resourceDirectory <https://builds.apache.org/job/tobago-1.0.x/ws/tobago-1.0.x/extension/fileupload/src/test/resources>
[INFO] Copying 3 resources
[INFO] [compiler:testCompile {execution: default-testCompile}]
[INFO] No sources to compile
[INFO] [surefire:test {execution: default-test}]
[INFO] Surefire report directory: <https://builds.apache.org/job/tobago-1.0.x/ws/tobago-1.0.x/extension/fileupload/target/surefire-reports>

-------------------------------------------------------
 T E S T S
-------------------------------------------------------
There are no tests to run.

Results :

Tests run: 0, Failures: 0, Errors: 0, Skipped: 0

[JENKINS] Recording test results
[INFO] [jar:jar {execution: default-jar}]
[INFO] Building jar: <https://builds.apache.org/job/tobago-1.0.x/ws/tobago-1.0.x/extension/fileupload/target/tobago-fileupload-1.0.41-SNAPSHOT.jar>
[INFO] [install:install {execution: default-install}]
[INFO] Installing <https://builds.apache.org/job/tobago-1.0.x/ws/tobago-1.0.x/extension/fileupload/target/tobago-fileupload-1.0.41-SNAPSHOT.jar>
to /home/jenkins/jenkins-slave/maven-repositories/0/org/apache/myfaces/tobago/tobago-fileupload/1.0.41-SNAPSHOT/tobago-fileupload-1.0.41-SNAPSHOT.jar
[INFO] [checkstyle:check {execution: default-cli}]
[INFO] 
[JENKINS] Archiving <https://builds.apache.org/job/tobago-1.0.x/ws/tobago-1.0.x/extension/fileupload/pom.xml>
to /home/hudson/hudson/jobs/tobago-1.0.x/modules/org.apache.myfaces.tobago$tobago-fileupload/builds/2013-09-14_09-27-12/archive/org.apache.myfaces.tobago/tobago-fileupload/1.0.41-SNAPSHOT/tobago-fileupload-1.0.41-SNAPSHOT.pom
[JENKINS] Archiving <https://builds.apache.org/job/tobago-1.0.x/ws/tobago-1.0.x/extension/fileupload/target/tobago-fileupload-1.0.41-SNAPSHOT.jar>
to /home/hudson/hudson/jobs/tobago-1.0.x/modules/org.apache.myfaces.tobago$tobago-fileupload/builds/2013-09-14_09-27-12/archive/org.apache.myfaces.tobago/tobago-fileupload/1.0.41-SNAPSHOT/tobago-fileupload-1.0.41-SNAPSHOT.jar
[INFO] ------------------------------------------------------------------------
[INFO] Building Tobago Security
[INFO]    task-segment: [clean, install, checkstyle:check]
[INFO] ------------------------------------------------------------------------
[INFO] [clean:clean {execution: default-clean}]
[INFO] [remote-resources:process {execution: default}]
[INFO] [resources:resources {execution: default-resources}]
[INFO] Using 'UTF-8' encoding to copy filtered resources.
[INFO] Copying 3 resources
[INFO] Copying 3 resources
[INFO] [compiler:compile {execution: default-compile}]
[INFO] Compiling 7 source files to <https://builds.apache.org/job/tobago-1.0.x/ws/tobago-1.0.x/extension/security/target/classes>
[INFO] [resources:testResources {execution: default-testResources}]
[JENKINS] Recording test results[INFO] Using 'UTF-8' encoding to copy filtered resources.

[INFO] skip non existing resourceDirectory <https://builds.apache.org/job/tobago-1.0.x/ws/tobago-1.0.x/extension/security/src/test/resources>
[INFO] Copying 3 resources
[INFO] [compiler:testCompile {execution: default-testCompile}]
[INFO] No sources to compile
[INFO] [surefire:test {execution: default-test}]
[INFO] Surefire report directory: <https://builds.apache.org/job/tobago-1.0.x/ws/tobago-1.0.x/extension/security/target/surefire-reports>

-------------------------------------------------------
 T E S T S
-------------------------------------------------------
There are no tests to run.

Results :

Tests run: 0, Failures: 0, Errors: 0, Skipped: 0

[INFO] [jar:jar {execution: default-jar}]
[INFO] Building jar: <https://builds.apache.org/job/tobago-1.0.x/ws/tobago-1.0.x/extension/security/target/tobago-security-1.0.41-SNAPSHOT.jar>
[INFO] [install:install {execution: default-install}]
[INFO] Installing <https://builds.apache.org/job/tobago-1.0.x/ws/tobago-1.0.x/extension/security/target/tobago-security-1.0.41-SNAPSHOT.jar>
to /home/jenkins/jenkins-slave/maven-repositories/0/org/apache/myfaces/tobago/tobago-security/1.0.41-SNAPSHOT/tobago-security-1.0.41-SNAPSHOT.jar
[INFO] [checkstyle:check {execution: default-cli}]
[INFO] 
[JENKINS] Archiving <https://builds.apache.org/job/tobago-1.0.x/ws/tobago-1.0.x/extension/security/pom.xml>
to /home/hudson/hudson/jobs/tobago-1.0.x/modules/org.apache.myfaces.tobago$tobago-security/builds/2013-09-14_09-27-12/archive/org.apache.myfaces.tobago/tobago-security/1.0.41-SNAPSHOT/tobago-security-1.0.41-SNAPSHOT.pom
[JENKINS] Archiving <https://builds.apache.org/job/tobago-1.0.x/ws/tobago-1.0.x/extension/security/target/tobago-security-1.0.41-SNAPSHOT.jar>
to /home/hudson/hudson/jobs/tobago-1.0.x/modules/org.apache.myfaces.tobago$tobago-security/builds/2013-09-14_09-27-12/archive/org.apache.myfaces.tobago/tobago-security/1.0.41-SNAPSHOT/tobago-security-1.0.41-SNAPSHOT.jar
[INFO] ------------------------------------------------------------------------
[INFO] Building Tobago Facelets
[INFO]    task-segment: [clean, install, checkstyle:check]
[INFO] ------------------------------------------------------------------------
[INFO] [clean:clean {execution: default-clean}]
[INFO] [dependency:unpack {execution: unpack-sources}]
[INFO] Configured Artifact: org.apache.myfaces.tobago:tobago-core:sources:1.0.41-SNAPSHOT:jar
[INFO] snapshot org.apache.myfaces.tobago:tobago-core:1.0.41-SNAPSHOT: checking for updates
from java.net
[INFO] Expanding: /home/jenkins/jenkins-slave/maven-repositories/0/org/apache/myfaces/tobago/tobago-core/1.0.41-SNAPSHOT/tobago-core-1.0.41-SNAPSHOT-sources.jar
into <https://builds.apache.org/job/tobago-1.0.x/ws/tobago-1.0.x/extension/facelets/target/tobago-core-sources>
ERROR: Failed to parse POMs
hudson.remoting.ChannelClosedException: channel is already closed
	at hudson.remoting.Channel.send(Channel.java:516)
	at hudson.remoting.Request.call(Request.java:129)
	at hudson.remoting.Channel.call(Channel.java:714)
	at hudson.remoting.RemoteInvocationHandler.invoke(RemoteInvocationHandler.java:167)
	at com.sun.proxy.$Proxy38.isAlive(Unknown Source)
	at hudson.Launcher$RemoteLauncher$ProcImpl.isAlive(Launcher.java:930)
	at hudson.maven.ProcessCache$MavenProcess.call(ProcessCache.java:165)
	at hudson.maven.MavenModuleSetBuild$MavenModuleSetBuildExecution.doRun(MavenModuleSetBuild.java:813)
	at hudson.model.AbstractBuild$AbstractBuildExecution.run(AbstractBuild.java:567)
	at hudson.model.Run.execute(Run.java:1603)
	at hudson.maven.MavenModuleSetBuild.run(MavenModuleSetBuild.java:506)
	at hudson.model.ResourceController.execute(ResourceController.java:88)
	at hudson.model.Executor.run(Executor.java:246)
Caused by: java.io.IOException: Unexpected termination of the channel
	at hudson.remoting.SynchronousCommandTransport$ReaderThread.run(SynchronousCommandTransport.java:50)
Caused by: java.io.EOFException
	at java.io.ObjectInputStream$BlockDataInputStream.peekByte(ObjectInputStream.java:2596)
	at java.io.ObjectInputStream.readObject0(ObjectInputStream.java:1316)
	at java.io.ObjectInputStream.readObject(ObjectInputStream.java:370)
	at hudson.remoting.Command.readFrom(Command.java:92)
	at hudson.remoting.ClassicCommandTransport.read(ClassicCommandTransport.java:71)
	at hudson.remoting.SynchronousCommandTransport$ReaderThread.run(SynchronousCommandTransport.java:48)
FATAL: channel is already closed
hudson.remoting.ChannelClosedException: channel is already closed
	at hudson.remoting.Channel.send(Channel.java:516)
	at hudson.remoting.Request.call(Request.java:129)
	at hudson.remoting.Channel.call(Channel.java:714)
	at hudson.Launcher$RemoteLauncher.kill(Launcher.java:887)
	at hudson.model.AbstractBuild$AbstractBuildExecution.run(AbstractBuild.java:590)
	at hudson.model.Run.execute(Run.java:1603)
	at hudson.maven.MavenModuleSetBuild.run(MavenModuleSetBuild.java:506)
	at hudson.model.ResourceController.execute(ResourceController.java:88)
	at hudson.model.Executor.run(Executor.java:246)
Caused by: java.io.IOException: Unexpected termination of the channel
	at hudson.remoting.SynchronousCommandTransport$ReaderThread.run(SynchronousCommandTransport.java:50)
Caused by: java.io.EOFException
	at java.io.ObjectInputStream$BlockDataInputStream.peekByte(ObjectInputStream.java:2596)
	at java.io.ObjectInputStream.readObject0(ObjectInputStream.java:1316)
	at java.io.ObjectInputStream.readObject(ObjectInputStream.java:370)
	at hudson.remoting.Command.readFrom(Command.java:92)
	at hudson.remoting.ClassicCommandTransport.read(ClassicCommandTransport.java:71)
	at hudson.remoting.SynchronousCommandTransport$ReaderThread.run(SynchronousCommandTransport.java:48)

Mime
View raw message