myfaces-commits mailing list archives

Site index · List index
Message view « Date » · « Thread »
Top « Date » · « Thread »
From Apache Jenkins Server <jenk...@builds.apache.org>
Subject Build failed in Jenkins: Trinidad Core Trunk (snapshot) #84
Date Tue, 17 Sep 2013 06:03:04 GMT
See <https://builds.apache.org/job/Trinidad%20Core%20Trunk%20(snapshot)/84/changes>

Changes:

[sobryan] NIDAD-2399: support css client side rules in skinning framework
 * Thanks for the patch Anand

[sobryan] Reverse checkin for TRINIDAD-2414, patch is not necessary.

------------------------------------------
[...truncated 9046 lines...]
159/237 KB   14/14 KB   
163/237 KB   14/14 KB   
167/237 KB   14/14 KB   
171/237 KB   14/14 KB   
175/237 KB   14/14 KB   
                        
179/237 KB              
Downloaded: http://repo.maven.apache.org/maven2/org/apache/maven/plugin-tools/maven-plugin-tools-beanshell/2.5.1/maven-plugin-tools-beanshell-2.5.1.jar
(14 KB at 621.6 KB/sec)
183/237 KB   
187/237 KB   
191/237 KB   
195/237 KB   
199/237 KB   
203/237 KB   
207/237 KB   
211/237 KB   
215/237 KB   
219/237 KB   
223/237 KB   
227/237 KB   
231/237 KB   
235/237 KB   
237/237 KB   
             
Downloaded: http://repo.maven.apache.org/maven2/bsh/bsh/1.3.0/bsh-1.3.0.jar (237 KB at 8758.5
KB/sec)
[INFO] Using 'UTF-8' encoding to read mojo metadata.
[INFO] Applying mojo extractor for language: java
[INFO] Mojo extractor for language: java found 1 mojo descriptors.
[INFO] Applying mojo extractor for language: bsh
[INFO] Mojo extractor for language: bsh found 0 mojo descriptors.
[INFO] 
[INFO] --- maven-remote-resources-plugin:1.1:process (default) @ maven-jdev-plugin ---
[INFO] 
[INFO] --- maven-resources-plugin:2.4.3:resources (default-resources) @ maven-jdev-plugin
---
Downloading: http://repo.maven.apache.org/maven2/org/codehaus/plexus/plexus-utils/2.0.5/plexus-utils-2.0.5.pom
4/4 KB       
         
Downloaded: http://repo.maven.apache.org/maven2/org/codehaus/plexus/plexus-utils/2.0.5/plexus-utils-2.0.5.pom
(4 KB at 465.1 KB/sec)
Downloading: http://repo.maven.apache.org/maven2/org/codehaus/plexus/plexus/2.0.6/plexus-2.0.6.pom
4/17 KB   
7/17 KB   
11/17 KB   
15/17 KB   
17/17 KB   
           
Downloaded: http://repo.maven.apache.org/maven2/org/codehaus/plexus/plexus/2.0.6/plexus-2.0.6.pom
(17 KB at 2338.6 KB/sec)
Downloading: http://repo.maven.apache.org/maven2/org/apache/maven/shared/maven-filtering/1.0-beta-4/maven-filtering-1.0-beta-4.pom
2/5 KB     
5/5 KB   
         
Downloaded: http://repo.maven.apache.org/maven2/org/apache/maven/shared/maven-filtering/1.0-beta-4/maven-filtering-1.0-beta-4.pom
(5 KB at 649.0 KB/sec)
Downloading: http://repo.maven.apache.org/maven2/org/apache/maven/shared/maven-shared-components/15/maven-shared-components-15.pom
4/10 KB   
8/10 KB   
10/10 KB   
           
Downloaded: http://repo.maven.apache.org/maven2/org/apache/maven/shared/maven-shared-components/15/maven-shared-components-15.pom
(10 KB at 1302.6 KB/sec)
Downloading: http://repo.maven.apache.org/maven2/org/codehaus/plexus/plexus-interpolation/1.13/plexus-interpolation-1.13.pom
890/890 B   
            
Downloaded: http://repo.maven.apache.org/maven2/org/codehaus/plexus/plexus-interpolation/1.13/plexus-interpolation-1.13.pom
(890 B at 124.2 KB/sec)
Downloading: http://repo.maven.apache.org/maven2/org/codehaus/plexus/plexus-components/1.1.15/plexus-components-1.1.15.pom
2/3 KB      
3/3 KB   
         
Downloaded: http://repo.maven.apache.org/maven2/org/codehaus/plexus/plexus-components/1.1.15/plexus-components-1.1.15.pom
(3 KB at 463.5 KB/sec)
Downloading: http://repo.maven.apache.org/maven2/org/codehaus/plexus/plexus/2.0.3/plexus-2.0.3.pom
2/16 KB   
6/16 KB   
10/16 KB   
14/16 KB   
16/16 KB   
           
Downloaded: http://repo.maven.apache.org/maven2/org/codehaus/plexus/plexus/2.0.3/plexus-2.0.3.pom
(16 KB at 2156.9 KB/sec)
Downloading: http://repo.maven.apache.org/maven2/org/codehaus/plexus/plexus-utils/2.0.5/plexus-utils-2.0.5.jar
Downloading: http://repo.maven.apache.org/maven2/org/apache/maven/shared/maven-filtering/1.0-beta-4/maven-filtering-1.0-beta-4.jar
Downloading: http://repo.maven.apache.org/maven2/org/codehaus/plexus/plexus-interpolation/1.13/plexus-interpolation-1.13.jar
2/34 KB    
6/34 KB   
10/34 KB   
14/34 KB   
18/34 KB   
22/34 KB   
26/34 KB   
30/34 KB   
34/34 KB   
34/34 KB   
34/34 KB   2/60 KB   
34/34 KB   6/60 KB   
34/34 KB   10/60 KB   
34/34 KB   14/60 KB   
34/34 KB   18/60 KB   
34/34 KB   22/60 KB   
34/34 KB   26/60 KB   
34/34 KB   30/60 KB   
34/34 KB   4/218 KB   30/60 KB   
34/34 KB   4/218 KB   34/60 KB   
34/34 KB   4/218 KB   38/60 KB   
34/34 KB   8/218 KB   38/60 KB   
34/34 KB   8/218 KB   42/60 KB   
34/34 KB   12/218 KB   42/60 KB   
34/34 KB   12/218 KB   46/60 KB   
34/34 KB   16/218 KB   46/60 KB   
34/34 KB   16/218 KB   50/60 KB   
34/34 KB   20/218 KB   50/60 KB   
34/34 KB   20/218 KB   54/60 KB   
34/34 KB   24/218 KB   54/60 KB   
34/34 KB   24/218 KB   58/60 KB   
34/34 KB   28/218 KB   58/60 KB   
34/34 KB   28/218 KB   60/60 KB   
34/34 KB   32/218 KB   60/60 KB   
34/34 KB   36/218 KB   60/60 KB   
34/34 KB   40/218 KB   60/60 KB   
34/34 KB   44/218 KB   60/60 KB   
34/34 KB   48/218 KB   60/60 KB   
34/34 KB   52/218 KB   60/60 KB   
34/34 KB   56/218 KB   60/60 KB   
34/34 KB   60/218 KB   60/60 KB   
34/34 KB   64/218 KB   60/60 KB   
34/34 KB   68/218 KB   60/60 KB   
                                  
72/218 KB   60/60 KB              
Downloaded: http://repo.maven.apache.org/maven2/org/apache/maven/shared/maven-filtering/1.0-beta-4/maven-filtering-1.0-beta-4.jar
(34 KB at 3745.7 KB/sec)
76/218 KB   60/60 KB   
80/218 KB   60/60 KB   
84/218 KB   60/60 KB   
88/218 KB   60/60 KB   
92/218 KB   60/60 KB   
96/218 KB   60/60 KB   
100/218 KB   60/60 KB   
104/218 KB   60/60 KB   
108/218 KB   60/60 KB   
112/218 KB   60/60 KB   
116/218 KB   60/60 KB   
120/218 KB   60/60 KB   
124/218 KB   60/60 KB   
128/218 KB   60/60 KB   
132/218 KB   60/60 KB   
                        
136/218 KB              
Downloaded: http://repo.maven.apache.org/maven2/org/codehaus/plexus/plexus-interpolation/1.13/plexus-interpolation-1.13.jar
(60 KB at 5420.5 KB/sec)
140/218 KB   
144/218 KB   
148/218 KB   
152/218 KB   
156/218 KB   
160/218 KB   
164/218 KB   
168/218 KB   
172/218 KB   
176/218 KB   
180/218 KB   
184/218 KB   
188/218 KB   
192/218 KB   
196/218 KB   
200/218 KB   
204/218 KB   
208/218 KB   
212/218 KB   
216/218 KB   
218/218 KB   
             
Downloaded: http://repo.maven.apache.org/maven2/org/codehaus/plexus/plexus-utils/2.0.5/plexus-utils-2.0.5.jar
(218 KB at 12820.0 KB/sec)
[INFO] Using 'UTF-8' encoding to copy filtered resources.
[INFO] Copying 18 resources
[INFO] Copying 2 resources
[INFO] 
[INFO] --- maven-compiler-plugin:2.3.1:compile (default-compile) @ maven-jdev-plugin ---
Downloading: http://repo.maven.apache.org/maven2/org/codehaus/plexus/plexus-compiler-api/1.8/plexus-compiler-api-1.8.pom
778/778 B    
            
Downloaded: http://repo.maven.apache.org/maven2/org/codehaus/plexus/plexus-compiler-api/1.8/plexus-compiler-api-1.8.pom
(778 B at 95.0 KB/sec)
Downloading: http://repo.maven.apache.org/maven2/org/codehaus/plexus/plexus-compiler/1.8/plexus-compiler-1.8.pom
4/4 KB      
         
Downloaded: http://repo.maven.apache.org/maven2/org/codehaus/plexus/plexus-compiler/1.8/plexus-compiler-1.8.pom
(4 KB at 415.9 KB/sec)
Downloading: http://repo.maven.apache.org/maven2/org/codehaus/plexus/plexus-components/1.1.17/plexus-components-1.1.17.pom
4/6 KB   
6/6 KB   
         
Downloaded: http://repo.maven.apache.org/maven2/org/codehaus/plexus/plexus-components/1.1.17/plexus-components-1.1.17.pom
(6 KB at 636.0 KB/sec)
Downloading: http://repo.maven.apache.org/maven2/org/codehaus/plexus/plexus/2.0.5/plexus-2.0.5.pom
4/17 KB   
7/17 KB   
11/17 KB   
15/17 KB   
17/17 KB   
           
Downloaded: http://repo.maven.apache.org/maven2/org/codehaus/plexus/plexus/2.0.5/plexus-2.0.5.pom
(17 KB at 1882.4 KB/sec)
Downloading: http://repo.maven.apache.org/maven2/org/apache/maven/maven-toolchain/1.0/maven-toolchain-1.0.pom
4/4 KB     
         
Downloaded: http://repo.maven.apache.org/maven2/org/apache/maven/maven-toolchain/1.0/maven-toolchain-1.0.pom
(4 KB at 370.4 KB/sec)
Downloading: http://repo.maven.apache.org/maven2/org/codehaus/plexus/plexus-compiler-manager/1.8/plexus-compiler-manager-1.8.pom
690/690 B   
            
Downloaded: http://repo.maven.apache.org/maven2/org/codehaus/plexus/plexus-compiler-manager/1.8/plexus-compiler-manager-1.8.pom
(690 B at 56.2 KB/sec)
Downloading: http://repo.maven.apache.org/maven2/org/codehaus/plexus/plexus-compiler-javac/1.8/plexus-compiler-javac-1.8.pom
686/686 B   
            
Downloaded: http://repo.maven.apache.org/maven2/org/codehaus/plexus/plexus-compiler-javac/1.8/plexus-compiler-javac-1.8.pom
(686 B at 74.4 KB/sec)
Downloading: http://repo.maven.apache.org/maven2/org/codehaus/plexus/plexus-compilers/1.8/plexus-compilers-1.8.pom
2/2 KB      
         
Downloaded: http://repo.maven.apache.org/maven2/org/codehaus/plexus/plexus-compilers/1.8/plexus-compilers-1.8.pom
(2 KB at 156.5 KB/sec)
Downloading: http://repo.maven.apache.org/maven2/org/codehaus/plexus/plexus-compiler-api/1.8/plexus-compiler-api-1.8.jar
Downloading: http://repo.maven.apache.org/maven2/org/codehaus/plexus/plexus-compiler-manager/1.8/plexus-compiler-manager-1.8.jar
Downloading: http://repo.maven.apache.org/maven2/org/codehaus/plexus/plexus-compiler-javac/1.8/plexus-compiler-javac-1.8.jar
2/12 KB   
2/12 KB   4/6 KB   
6/12 KB   4/6 KB   
6/12 KB   6/6 KB   
10/12 KB   6/6 KB   
12/12 KB   6/6 KB   
                    
Downloaded: http://repo.maven.apache.org/maven2/org/codehaus/plexus/plexus-compiler-javac/1.8/plexus-compiler-javac-1.8.jar
(12 KB at 1188.4 KB/sec)
                    
Downloaded: http://repo.maven.apache.org/maven2/org/codehaus/plexus/plexus-compiler-manager/1.8/plexus-compiler-manager-1.8.jar
(6 KB at 518.7 KB/sec)
                    
[INFO] ------------------------------------------------------------------------
[INFO] Reactor Summary:
[INFO] 
[INFO] Apache Trinidad Maven Plugin Parent ............... SUCCESS [3.129s]
[INFO] Apache Trinidad Maven JDev Plugin ................. FAILURE [1:01.872s]
[INFO] Apache Trinidad Maven Faces Plugin ................ SKIPPED
[INFO] Apache Trinidad Maven Javacc Plugin ............... SKIPPED
[INFO] Apache Trinidad Maven i18n Plugin ................. SKIPPED
[INFO] Apache Trinidad Maven Javascript Plugin ........... SKIPPED
[INFO] Apache Trinidad Maven XRTS Plugin ................. SKIPPED
[INFO] Apache Trinidad Maven Tag Documentation Report .... SKIPPED
[INFO] ------------------------------------------------------------------------
[INFO] BUILD FAILURE
[INFO] ------------------------------------------------------------------------
[INFO] Total time: 1:05.641s
[INFO] Finished at: Tue Sep 17 06:03:03 UTC 2013
[INFO] Final Memory: 11M/673M
[INFO] ------------------------------------------------------------------------
[ERROR] Failed to execute goal org.apache.maven.plugins:maven-compiler-plugin:2.3.1:compile
(default-compile) on project maven-jdev-plugin: Execution default-compile of goal org.apache.maven.plugins:maven-compiler-plugin:2.3.1:compile
failed: Plugin org.apache.maven.plugins:maven-compiler-plugin:2.3.1 or one of its dependencies
could not be resolved: Could not transfer artifact org.codehaus.plexus:plexus-compiler-api:jar:1.8
from/to central (http://repo.maven.apache.org/maven2): Failed to transfer file: http://repo.maven.apache.org/maven2/org/codehaus/plexus/plexus-compiler-api/1.8/plexus-compiler-api-1.8.jar.
Return code is: 503, ReasonPhrase:Service Unavailable. -> [Help 1]
[ERROR] 
[ERROR] To see the full stack trace of the errors, re-run Maven with the -e switch.
[ERROR] Re-run Maven using the -X switch to enable full debug logging.
[ERROR] 
[ERROR] For more information about the errors and possible solutions, please read the following
articles:
[ERROR] [Help 1] http://cwiki.apache.org/confluence/display/MAVEN/PluginResolutionException
[ERROR] 
[ERROR] After correcting the problems, you can resume the build with the command
[ERROR]   mvn <goals> -rf :maven-jdev-plugin
Build step 'Invoke top-level Maven targets' marked build as failure

Mime
View raw message