myfaces-commits mailing list archives

Site index · List index
Message view « Date » · « Thread »
Top « Date » · « Thread »
From Apache Jenkins Server <jenk...@builds.apache.org>
Subject Build failed in Jenkins: Trinidad Core Trunk (sanity) #819
Date Tue, 17 Sep 2013 18:41:14 GMT
See <https://builds.apache.org/job/Trinidad%20Core%20Trunk%20(sanity)/819/changes>

Changes:

[jwaldman] TRINIDAD-2398 add component tracking ability to RequestContext
Thanks to Jing Wu for the patch

------------------------------------------
[...truncated 10345 lines...]
[info] Generated 1 component(s)
Tests run: 3, Failures: 0, Errors: 0, Skipped: 0, Time elapsed: 0.303 sec
Running org.apache.myfaces.trinidadbuild.plugin.faces.GenerateFacesConfigMojoTest
[info] Generated META-INF/faces-config.xml
Tests run: 1, Failures: 0, Errors: 0, Skipped: 0, Time elapsed: 0.377 sec

Results :

Tests run: 4, Failures: 0, Errors: 0, Skipped: 0

[INFO] 
[INFO] --- maven-jar-plugin:2.3.1:jar (default-jar) @ maven-faces-plugin ---
[INFO] Building jar: <https://builds.apache.org/job/Trinidad%20Core%20Trunk%20(sanity)/ws/trinidad-maven/maven-faces-plugin/target/maven-faces-plugin-2.0.8-SNAPSHOT.jar>
[INFO] 
[INFO] --- maven-plugin-plugin:2.5.1:addPluginArtifactMetadata (default-addPluginArtifactMetadata)
@ maven-faces-plugin ---
[INFO] 
[INFO] --- maven-install-plugin:2.3:install (default-install) @ maven-faces-plugin ---
[INFO] Installing <https://builds.apache.org/job/Trinidad%20Core%20Trunk%20(sanity)/ws/trinidad-maven/maven-faces-plugin/target/maven-faces-plugin-2.0.8-SNAPSHOT.jar>
to <https://builds.apache.org/job/Trinidad%20Core%20Trunk%20(sanity)/ws/.repository/org/apache/myfaces/trinidadbuild/maven-faces-plugin/2.0.8-SNAPSHOT/maven-faces-plugin-2.0.8-SNAPSHOT.jar>
[INFO] Installing <https://builds.apache.org/job/Trinidad%20Core%20Trunk%20(sanity)/ws/trinidad-maven/maven-faces-plugin/pom.xml>
to <https://builds.apache.org/job/Trinidad%20Core%20Trunk%20(sanity)/ws/.repository/org/apache/myfaces/trinidadbuild/maven-faces-plugin/2.0.8-SNAPSHOT/maven-faces-plugin-2.0.8-SNAPSHOT.pom>
[INFO]                                                                         
[INFO] ------------------------------------------------------------------------
[INFO] Building Apache Trinidad Maven Javacc Plugin 2.0.8-SNAPSHOT
[INFO] ------------------------------------------------------------------------
Downloading: http://repo.maven.apache.org/maven2/plexus/plexus-compiler-api/1.4/plexus-compiler-api-1.4.pom
289/289 B    
            
Downloaded: http://repo.maven.apache.org/maven2/plexus/plexus-compiler-api/1.4/plexus-compiler-api-1.4.pom
(289 B at 4.7 KB/sec)
Downloading: http://repo.maven.apache.org/maven2/plexus/plexus-compiler/1.4/plexus-compiler-1.4.pom
506/506 B   
            
Downloaded: http://repo.maven.apache.org/maven2/plexus/plexus-compiler/1.4/plexus-compiler-1.4.pom
(506 B at 8.2 KB/sec)
Downloading: http://repo.maven.apache.org/maven2/plexus/plexus-components/1.1/plexus-components-1.1.pom
2/2 KB      
2/2 KB   
         
Downloaded: http://repo.maven.apache.org/maven2/plexus/plexus-components/1.1/plexus-components-1.1.pom
(2 KB at 32.5 KB/sec)
Downloading: http://repo.maven.apache.org/maven2/plexus/plexus-root/1.0/plexus-root-1.0.pom
4/5 KB   
5/5 KB   
         
Downloaded: http://repo.maven.apache.org/maven2/plexus/plexus-root/1.0/plexus-root-1.0.pom
(5 KB at 595.2 KB/sec)
Downloading: http://repo.maven.apache.org/maven2/plexus/plexus-container-default/1.0-alpha-4/plexus-container-default-1.0-alpha-4.pom
806/806 B   
            
Downloaded: http://repo.maven.apache.org/maven2/plexus/plexus-container-default/1.0-alpha-4/plexus-container-default-1.0-alpha-4.pom
(806 B at 4.7 KB/sec)
Downloading: http://repo.maven.apache.org/maven2/plexus/plexus-containers/1.0/plexus-containers-1.0.pom
467/467 B   
            
Downloaded: http://repo.maven.apache.org/maven2/plexus/plexus-containers/1.0/plexus-containers-1.0.pom
(467 B at 7.5 KB/sec)
Downloading: http://repo.maven.apache.org/maven2/classworlds/classworlds/1.1-alpha-1/classworlds-1.1-alpha-1.pom
2/4 KB      
4/4 KB   
         
Downloaded: http://repo.maven.apache.org/maven2/classworlds/classworlds/1.1-alpha-1/classworlds-1.1-alpha-1.pom
(4 KB at 26.8 KB/sec)
Downloading: http://repo.maven.apache.org/maven2/plexus/plexus-utils/1.0-alpha-3/plexus-utils-1.0-alpha-3.pom
319/319 B   
            
Downloaded: http://repo.maven.apache.org/maven2/plexus/plexus-utils/1.0-alpha-3/plexus-utils-1.0-alpha-3.pom
(319 B at 5.1 KB/sec)
Downloading: http://repo.maven.apache.org/maven2/plexus/plexus-utils/1.0.1/plexus-utils-1.0.1.pom
312/312 B   
            
Downloaded: http://repo.maven.apache.org/maven2/plexus/plexus-utils/1.0.1/plexus-utils-1.0.1.pom
(312 B at 33.9 KB/sec)
Downloading: http://repo.maven.apache.org/maven2/javacc/javacc/3.2/javacc-3.2.pom
281/281 B   
            
Downloaded: http://repo.maven.apache.org/maven2/javacc/javacc/3.2/javacc-3.2.pom (281 B at
34.3 KB/sec)
Downloading: http://repo.maven.apache.org/maven2/net/java/dev/javacc/javacc/3.2/javacc-3.2.pom
162/162 B   
            
Downloaded: http://repo.maven.apache.org/maven2/net/java/dev/javacc/javacc/3.2/javacc-3.2.pom
(162 B at 19.8 KB/sec)
[WARNING] The artifact javacc:javacc:jar:3.2 has been relocated to net.java.dev.javacc:javacc:jar:3.2
Downloading: http://repo.maven.apache.org/maven2/plexus/plexus-compiler-api/1.4/plexus-compiler-api-1.4.jar
Downloading: http://repo.maven.apache.org/maven2/plexus/plexus-container-default/1.0-alpha-4/plexus-container-default-1.0-alpha-4.jar
Downloading: http://repo.maven.apache.org/maven2/plexus/plexus-utils/1.0.1/plexus-utils-1.0.1.jar
Downloading: http://repo.maven.apache.org/maven2/net/java/dev/javacc/javacc/3.2/javacc-3.2.jar
3/370 KB    
7/370 KB   
11/370 KB   
2/154 KB   11/370 KB   
2/154 KB   15/370 KB   
2/154 KB   19/370 KB   
2/154 KB   23/370 KB   
6/154 KB   23/370 KB   
10/154 KB   23/370 KB   
10/154 KB   27/370 KB   
14/154 KB   27/370 KB   
14/154 KB   31/370 KB   
18/154 KB   31/370 KB   
22/154 KB   31/370 KB   
22/154 KB   35/370 KB   
26/154 KB   35/370 KB   
26/154 KB   39/370 KB   
30/154 KB   39/370 KB   
34/154 KB   39/370 KB   
34/154 KB   43/370 KB   
38/154 KB   43/370 KB   
42/154 KB   43/370 KB   
42/154 KB   47/370 KB   
46/154 KB   47/370 KB   
46/154 KB   51/370 KB   
50/154 KB   51/370 KB   
50/154 KB   55/370 KB   
54/154 KB   55/370 KB   
58/154 KB   55/370 KB   
58/154 KB   59/370 KB   
62/154 KB   59/370 KB   
62/154 KB   63/370 KB   
66/154 KB   63/370 KB   
70/154 KB   63/370 KB   
70/154 KB   67/370 KB   
74/154 KB   67/370 KB   
74/154 KB   71/370 KB   
78/154 KB   71/370 KB   
78/154 KB   75/370 KB   
82/154 KB   75/370 KB   
82/154 KB   79/370 KB   
86/154 KB   79/370 KB   
86/154 KB   83/370 KB   
90/154 KB   83/370 KB   
90/154 KB   87/370 KB   
94/154 KB   87/370 KB   
98/154 KB   87/370 KB   
98/154 KB   91/370 KB   
102/154 KB   91/370 KB   
102/154 KB   95/370 KB   
106/154 KB   95/370 KB   
106/154 KB   99/370 KB   
110/154 KB   99/370 KB   
110/154 KB   103/370 KB   
114/154 KB   103/370 KB   
118/154 KB   103/370 KB   
118/154 KB   107/370 KB   
122/154 KB   107/370 KB   
122/154 KB   111/370 KB   
126/154 KB   111/370 KB   
126/154 KB   115/370 KB   
130/154 KB   115/370 KB   
130/154 KB   119/370 KB   
134/154 KB   119/370 KB   
138/154 KB   119/370 KB   
138/154 KB   123/370 KB   
142/154 KB   123/370 KB   
142/154 KB   127/370 KB   
146/154 KB   127/370 KB   
146/154 KB   131/370 KB   
150/154 KB   131/370 KB   
150/154 KB   135/370 KB   
154/154 KB   135/370 KB   
154/154 KB   139/370 KB   
154/154 KB   139/370 KB   
154/154 KB   143/370 KB   
154/154 KB   147/370 KB   
154/154 KB   151/370 KB   
154/154 KB   155/370 KB   
154/154 KB   159/370 KB   
154/154 KB   163/370 KB   
154/154 KB   167/370 KB   
154/154 KB   171/370 KB   
154/154 KB   175/370 KB   
154/154 KB   179/370 KB   
154/154 KB   183/370 KB   
154/154 KB   187/370 KB   
154/154 KB   191/370 KB   
154/154 KB   195/370 KB   
154/154 KB   199/370 KB   
154/154 KB   203/370 KB   
154/154 KB   207/370 KB   
154/154 KB   211/370 KB   
154/154 KB   215/370 KB   
154/154 KB   219/370 KB   
154/154 KB   223/370 KB   
154/154 KB   227/370 KB   
154/154 KB   231/370 KB   
154/154 KB   235/370 KB   
154/154 KB   239/370 KB   
154/154 KB   243/370 KB   
154/154 KB   247/370 KB   
154/154 KB   251/370 KB   
154/154 KB   255/370 KB   
154/154 KB   259/370 KB   
154/154 KB   263/370 KB   
154/154 KB   267/370 KB   
154/154 KB   271/370 KB   
                          
275/370 KB                
Downloaded: http://repo.maven.apache.org/maven2/plexus/plexus-utils/1.0.1/plexus-utils-1.0.1.jar
(154 KB at 9573.8 KB/sec)
279/370 KB   
283/370 KB   
287/370 KB   
291/370 KB   
295/370 KB   
299/370 KB   
303/370 KB   
307/370 KB   
311/370 KB   
315/370 KB   
319/370 KB   
323/370 KB   
327/370 KB   
331/370 KB   
335/370 KB   
339/370 KB   
343/370 KB   
347/370 KB   
351/370 KB   
355/370 KB   
359/370 KB   
363/370 KB   
367/370 KB   
370/370 KB   
             
Downloaded: http://repo.maven.apache.org/maven2/net/java/dev/javacc/javacc/3.2/javacc-3.2.jar
(370 KB at 16082.8 KB/sec)
3/18 KB      
7/18 KB   
11/18 KB   
15/18 KB   
18/18 KB   
           
Downloaded: http://repo.maven.apache.org/maven2/plexus/plexus-compiler-api/1.4/plexus-compiler-api-1.4.jar
(18 KB at 148.2 KB/sec)
           
[INFO] ------------------------------------------------------------------------
[INFO] Reactor Summary:
[INFO] 
[INFO] Apache Trinidad Maven Plugin Parent ............... SUCCESS [3.422s]
[INFO] Apache Trinidad Maven JDev Plugin ................. SUCCESS [3.980s]
[INFO] Apache Trinidad Maven Faces Plugin ................ SUCCESS [4.735s]
[INFO] Apache Trinidad Maven Javacc Plugin ............... FAILURE [1:01.018s]
[INFO] Apache Trinidad Maven i18n Plugin ................. SKIPPED
[INFO] Apache Trinidad Maven Javascript Plugin ........... SKIPPED
[INFO] Apache Trinidad Maven XRTS Plugin ................. SKIPPED
[INFO] Apache Trinidad Maven Tag Documentation Report .... SKIPPED
[INFO] ------------------------------------------------------------------------
[INFO] BUILD FAILURE
[INFO] ------------------------------------------------------------------------
[INFO] Total time: 1:14.189s
[INFO] Finished at: Tue Sep 17 18:41:14 UTC 2013
[INFO] Final Memory: 22M/500M
[INFO] ------------------------------------------------------------------------
[ERROR] Failed to execute goal on project maven-javacc-plugin: Could not resolve dependencies
for project org.apache.myfaces.trinidadbuild:maven-javacc-plugin:maven-plugin:2.0.8-SNAPSHOT:
Could not transfer artifact plexus:plexus-container-default:jar:1.0-alpha-4 from/to central
(http://repo.maven.apache.org/maven2): Failed to transfer file: http://repo.maven.apache.org/maven2/plexus/plexus-container-default/1.0-alpha-4/plexus-container-default-1.0-alpha-4.jar.
Return code is: 503, ReasonPhrase:Service Unavailable. -> [Help 1]
[ERROR] 
[ERROR] To see the full stack trace of the errors, re-run Maven with the -e switch.
[ERROR] Re-run Maven using the -X switch to enable full debug logging.
[ERROR] 
[ERROR] For more information about the errors and possible solutions, please read the following
articles:
[ERROR] [Help 1] http://cwiki.apache.org/confluence/display/MAVEN/DependencyResolutionException
[ERROR] 
[ERROR] After correcting the problems, you can resume the build with the command
[ERROR]   mvn <goals> -rf :maven-javacc-plugin
Build step 'Invoke top-level Maven targets' marked build as failure

Mime
View raw message