myfaces-commits mailing list archives

Site index · List index
Message view « Date » · « Thread »
Top « Date » · « Thread »
From Apache Jenkins Server <jenk...@builds.apache.org>
Subject Build failed in Jenkins: myfaces-current21_949 #1321
Date Mon, 16 Sep 2013 14:58:40 GMT
See <https://builds.apache.org/job/myfaces-current21_949/1321/>

------------------------------------------
[...truncated 3569 lines...]
[INFO] generated file myfaces_facelets_c.tld is up to date
[INFO] [myfaces-builder:make-config {execution: make_ui_facelet_tld}]
[INFO] generated file myfaces_facelets_ui.tld is up to date
[INFO] [myfaces-builder:make-config {execution: make_composite_facelet_tld}]
[INFO] generated file myfaces_facelets_composite.tld is up to date
[INFO] [myfaces-builder:make-config {execution: make_fn_facelet_tld}]
[INFO] generated file myfaces_facelet_fn.tld is up to date
[INFO] [myfaces-builder:make-config {execution: make_core_facelet_xsd}]
[INFO] generated file myfaces_facelets_core_2_1.xsd is up to date
[INFO] [myfaces-builder:make-config {execution: make_html_facelet_xsd}]
[INFO] generated file myfaces_facelets_html_2_1.xsd is up to date
[INFO] [myfaces-builder:make-config {execution: make_c_facelet_xsd}]
[INFO] generated file myfaces_facelets_c_2_1.xsd is up to date
[INFO] [myfaces-builder:make-config {execution: make_ui_facelet_xsd}]
[INFO] generated file myfaces_facelets_ui_2_1.xsd is up to date
[INFO] [myfaces-builder:make-config {execution: make_composite_facelet_xsd}]
[INFO] generated file myfaces_facelets_composite_2_1.xsd is up to date
ERROR: Could not find local repository for 2.2.1
[INFO] [source:jar {execution: attach-source}]
[INFO] Building jar: <https://builds.apache.org/job/myfaces-current21_949/ws/2.1.x-client-window/impl/target/myfaces-impl-2.1.9-CLIENT-WINDOW-SNAPSHOT-sources.jar>
[INFO] [jar:test-jar {execution: default}]
[INFO] Building jar: <https://builds.apache.org/job/myfaces-current21_949/ws/2.1.x-client-window/impl/target/myfaces-impl-2.1.9-CLIENT-WINDOW-SNAPSHOT-tests.jar>
[INFO] [shade:shade {execution: default}]
[JENKINS] Re-archiving <https://builds.apache.org/job/myfaces-current21_949/ws/2.1.x-client-window/impl/target/myfaces-impl-2.1.9-CLIENT-WINDOW-SNAPSHOT.jar[INFO]>
Excluding org.apache.myfaces.core:myfaces-api:jar:2.1.9-CLIENT-WINDOW-SNAPSHOT from the shaded
jar.
[INFO] Excluding org.apache.myfaces.core.internal:myfaces-impl-shared-public:jar:2.1.9-CLIENT-WINDOW-SNAPSHOT
from the shaded jar.
[INFO] Excluding commons-codec:commons-codec:jar:1.3 from the shaded jar.
[INFO] Including org.apache.myfaces.core.internal:myfaces-impl-shared:jar:2.1.9-CLIENT-WINDOW-SNAPSHOT
in the shaded jar.

[INFO] snapshot org.apache.myfaces.core.internal:myfaces-impl-shared:2.1.9-CLIENT-WINDOW-SNAPSHOT:
checking for updates from tomcat
[INFO] snapshot org.apache.myfaces.core.internal:myfaces-impl-shared:2.1.9-CLIENT-WINDOW-SNAPSHOT:
checking for updates from apache.snapshots
[INFO] Excluding org.apache.geronimo.specs:geronimo-validation_1.0_spec:jar:1.1 from the shaded
jar.
[INFO] Excluding org.apache.geronimo.specs:geronimo-jpa_3.0_spec:jar:1.1.1 from the shaded
jar.
[INFO] Excluding org.apache.geronimo.specs:geronimo-ejb_3.0_spec:jar:1.0.1 from the shaded
jar.
[INFO] Excluding commons-collections:commons-collections:jar:3.2 from the shaded jar.
[INFO] Excluding commons-beanutils:commons-beanutils:jar:1.8.3 from the shaded jar.
[INFO] Excluding commons-logging:commons-logging:jar:1.1.1 from the shaded jar.
[INFO] Excluding commons-digester:commons-digester:jar:1.8 from the shaded jar.
[INFO] Excluding org.apache.tomcat:catalina:jar:6.0.29 from the shaded jar.
[INFO] Excluding org.apache.tomcat:servlet-api:jar:6.0.29 from the shaded jar.
[INFO] Excluding org.apache.tomcat:juli:jar:6.0.29 from the shaded jar.
[INFO] Excluding org.apache.tomcat:annotations-api:jar:6.0.29 from the shaded jar.
[INFO] Excluding org.apache.tomcat:tomcat-catalina:jar:7.0.0 from the shaded jar.
[INFO] Excluding org.apache.tomcat:tomcat-servlet-api:jar:7.0.0 from the shaded jar.
[INFO] Excluding org.apache.tomcat:tomcat-juli:jar:7.0.0 from the shaded jar.
[INFO] Excluding org.apache.tomcat:tomcat-annotations-api:jar:7.0.0 from the shaded jar.
[INFO] Excluding org.apache.tomcat:tomcat-api:jar:7.0.0 from the shaded jar.
[INFO] Excluding org.apache.tomcat:tomcat-util:jar:7.0.0 from the shaded jar.
[INFO] Excluding com.google.code.guice:guice:jar:1.0 from the shaded jar.
[INFO] Replacing original artifact with shaded artifact.
[INFO] Replacing <https://builds.apache.org/job/myfaces-current21_949/ws/2.1.x-client-window/impl/target/myfaces-impl-2.1.9-CLIENT-WINDOW-SNAPSHOT.jar>
with <https://builds.apache.org/job/myfaces-current21_949/ws/2.1.x-client-window/impl/target/myfaces-impl-2.1.9-CLIENT-WINDOW-SNAPSHOT-shaded.jar>
[INFO] Replacing <https://builds.apache.org/job/myfaces-current21_949/ws/2.1.x-client-window/impl/target/myfaces-impl-2.1.9-CLIENT-WINDOW-SNAPSHOT-sources.jar>
with <https://builds.apache.org/job/myfaces-current21_949/ws/2.1.x-client-window/impl/target/myfaces-impl-2.1.9-CLIENT-WINDOW-SNAPSHOT-shaded-sources.jar>
[INFO] [checkstyle:check {execution: verify-style}]
[INFO] 
[INFO] [install:install {execution: default-install}]
[INFO] Installing <https://builds.apache.org/job/myfaces-current21_949/ws/2.1.x-client-window/impl/target/myfaces-impl-2.1.9-CLIENT-WINDOW-SNAPSHOT.jar>
to /home/jenkins/jenkins-slave/maven-repositories/0/org/apache/myfaces/core/myfaces-impl/2.1.9-CLIENT-WINDOW-SNAPSHOT/myfaces-impl-2.1.9-CLIENT-WINDOW-SNAPSHOT.jar
[INFO] Installing <https://builds.apache.org/job/myfaces-current21_949/ws/2.1.x-client-window/impl/target/myfaces-impl-2.1.9-CLIENT-WINDOW-SNAPSHOT-sources.jar>
to /home/jenkins/jenkins-slave/maven-repositories/0/org/apache/myfaces/core/myfaces-impl/2.1.9-CLIENT-WINDOW-SNAPSHOT/myfaces-impl-2.1.9-CLIENT-WINDOW-SNAPSHOT-sources.jar
[INFO] Installing <https://builds.apache.org/job/myfaces-current21_949/ws/2.1.x-client-window/impl/target/myfaces-impl-2.1.9-CLIENT-WINDOW-SNAPSHOT-tests.jar>
to /home/jenkins/jenkins-slave/maven-repositories/0/org/apache/myfaces/core/myfaces-impl/2.1.9-CLIENT-WINDOW-SNAPSHOT/myfaces-impl-2.1.9-CLIENT-WINDOW-SNAPSHOT-tests.jar
[INFO] Installing <https://builds.apache.org/job/myfaces-current21_949/ws/2.1.x-client-window/impl/target/myfaces-impl-2.1.9-CLIENT-WINDOW-SNAPSHOT-sources.jar>
to /home/jenkins/jenkins-slave/maven-repositories/0/org/apache/myfaces/core/myfaces-impl/2.1.9-CLIENT-WINDOW-SNAPSHOT/myfaces-impl-2.1.9-CLIENT-WINDOW-SNAPSHOT-sources.jar
[JENKINS] Archiving <https://builds.apache.org/job/myfaces-current21_949/ws/2.1.x-client-window/impl/target/myfaces-impl-2.1.9-CLIENT-WINDOW-SNAPSHOT-sources.jar>
to /home/hudson/hudson/jobs/myfaces-current21_949/modules/org.apache.myfaces.core$myfaces-impl/builds/2013-09-16_14-45-42/archive/org.apache.myfaces.core/myfaces-impl/2.1.9-CLIENT-WINDOW-SNAPSHOT/myfaces-impl-2.1.9-CLIENT-WINDOW-SNAPSHOT-sources.jar
[JENKINS] Archiving <https://builds.apache.org/job/myfaces-current21_949/ws/2.1.x-client-window/impl/target/myfaces-impl-2.1.9-CLIENT-WINDOW-SNAPSHOT-tests.jar>
to /home/hudson/hudson/jobs/myfaces-current21_949/modules/org.apache.myfaces.core$myfaces-impl/builds/2013-09-16_14-45-42/archive/org.apache.myfaces.core/myfaces-impl/2.1.9-CLIENT-WINDOW-SNAPSHOT/myfaces-impl-2.1.9-CLIENT-WINDOW-SNAPSHOT-tests.jar
[INFO] ------------------------------------------------------------------------
[INFO] Building Apache MyFaces JSF-2.1 Core OSGi Bundle
[INFO]    task-segment: [install]
[INFO] ------------------------------------------------------------------------
[INFO] [remote-resources:process {execution: default}]
[debug] execute contextualize
[INFO] [resources:resources {execution: default-resources}]
[INFO] Using 'UTF-8' encoding to copy filtered resources.
[INFO] skip non existing resourceDirectory <https://builds.apache.org/job/myfaces-current21_949/ws/2.1.x-client-window/bundle/src/main/resources>
[INFO] Copying 3 resources
[INFO] [compiler:compile {execution: default-compile}]
[INFO] No sources to compile
[debug] execute contextualize
[INFO] [resources:testResources {execution: default-testResources}]
[INFO] Using 'UTF-8' encoding to copy filtered resources.
[INFO] skip non existing resourceDirectory <https://builds.apache.org/job/myfaces-current21_949/ws/2.1.x-client-window/bundle/src/test/resources>
[INFO] Copying 3 resources
[INFO] [compiler:testCompile {execution: default-testCompile}]
[INFO] No sources to compile
[INFO] [surefire:test {execution: default-test}]
[INFO] Surefire report directory: <https://builds.apache.org/job/myfaces-current21_949/ws/2.1.x-client-window/bundle/target/surefire-reports>

-------------------------------------------------------
 T E S T S
-------------------------------------------------------

Results :

Tests run: 0, Failures: 0, Errors: 0, Skipped: 0

[JENKINS] Recording test results[INFO] [bundle:bundle {execution: default-bundle}]

[WARNING] Warning building bundle org.apache.myfaces.core:myfaces-bundle:bundle:2.1.9-CLIENT-WINDOW-SNAPSHOT
: Instructions in Export-Package that are never used: org\.apache\.myfaces\.ee6
Classpath: Jar:.,Jar:myfaces-api,Jar:myfaces-impl,Jar:commons-collections,Jar:commons-codec,Jar:commons-beanutils,Jar:commons-logging,Jar:commons-digester

[WARNING] Warning building bundle org.apache.myfaces.core:myfaces-bundle:bundle:2.1.9-CLIENT-WINDOW-SNAPSHOT
: Superfluous export-package instructions: [org.apache.myfaces.ee6]
[INFO] Preparing source:jar
[WARNING] Removing: jar from forked lifecycle, to prevent recursive invocation.
[INFO] No goals needed for project - skipping
[INFO] [source:jar {execution: attach-source}]
[INFO] Building jar: <https://builds.apache.org/job/myfaces-current21_949/ws/2.1.x-client-window/bundle/target/myfaces-bundle-2.1.9-CLIENT-WINDOW-SNAPSHOT-sources.jar>
[INFO] [checkstyle:check {execution: verify-style}]
[INFO] 
[INFO] [install:install {execution: default-install}]
[INFO] Installing <https://builds.apache.org/job/myfaces-current21_949/ws/2.1.x-client-window/bundle/target/myfaces-bundle-2.1.9-CLIENT-WINDOW-SNAPSHOT.jar>
to /home/jenkins/jenkins-slave/maven-repositories/0/org/apache/myfaces/core/myfaces-bundle/2.1.9-CLIENT-WINDOW-SNAPSHOT/myfaces-bundle-2.1.9-CLIENT-WINDOW-SNAPSHOT.jar
[INFO] Installing <https://builds.apache.org/job/myfaces-current21_949/ws/2.1.x-client-window/bundle/target/myfaces-bundle-2.1.9-CLIENT-WINDOW-SNAPSHOT-sources.jar>
to /home/jenkins/jenkins-slave/maven-repositories/0/org/apache/myfaces/core/myfaces-bundle/2.1.9-CLIENT-WINDOW-SNAPSHOT/myfaces-bundle-2.1.9-CLIENT-WINDOW-SNAPSHOT-sources.jar
[INFO] [bundle:install {execution: default-install}]
[INFO] Installing org/apache/myfaces/core/myfaces-bundle/2.1.9-CLIENT-WINDOW-SNAPSHOT/myfaces-bundle-2.1.9-CLIENT-WINDOW-SNAPSHOT.jar
[INFO] Writing OBR metadata
[JENKINS] Archiving <https://builds.apache.org/job/myfaces-current21_949/ws/2.1.x-client-window/bundle/pom.xml>
to /home/hudson/hudson/jobs/myfaces-current21_949/modules/org.apache.myfaces.core$myfaces-bundle/builds/2013-09-16_14-45-42/archive/org.apache.myfaces.core/myfaces-bundle/2.1.9-CLIENT-WINDOW-SNAPSHOT/myfaces-bundle-2.1.9-CLIENT-WINDOW-SNAPSHOT.pom
[JENKINS] Archiving <https://builds.apache.org/job/myfaces-current21_949/ws/2.1.x-client-window/bundle/target/myfaces-bundle-2.1.9-CLIENT-WINDOW-SNAPSHOT.jar>
to /home/hudson/hudson/jobs/myfaces-current21_949/modules/org.apache.myfaces.core$myfaces-bundle/builds/2013-09-16_14-45-42/archive/org.apache.myfaces.core/myfaces-bundle/2.1.9-CLIENT-WINDOW-SNAPSHOT/myfaces-bundle-2.1.9-CLIENT-WINDOW-SNAPSHOT.jar
[JENKINS] Archiving <https://builds.apache.org/job/myfaces-current21_949/ws/2.1.x-client-window/bundle/target/myfaces-bundle-2.1.9-CLIENT-WINDOW-SNAPSHOT-sources.jar>
to /home/hudson/hudson/jobs/myfaces-current21_949/modules/org.apache.myfaces.core$myfaces-bundle/builds/2013-09-16_14-45-42/archive/org.apache.myfaces.core/myfaces-bundle/2.1.9-CLIENT-WINDOW-SNAPSHOT/myfaces-bundle-2.1.9-CLIENT-WINDOW-SNAPSHOT-sources.jar
[INFO] ------------------------------------------------------------------------
[INFO] Building Apache MyFaces JSF-2.1 Core Module
[INFO]    task-segment: [install]
[INFO] ------------------------------------------------------------------------
[INFO] [remote-resources:process {execution: default}]
[INFO] [site:attach-descriptor {execution: default-attach-descriptor}]
[INFO] [checkstyle:check {execution: verify-style}]
[INFO] 
[INFO] [install:install {execution: default-install}]
[INFO] Installing <https://builds.apache.org/job/myfaces-current21_949/ws/2.1.x-client-window/pom.xml>
to /home/jenkins/jenkins-slave/maven-repositories/0/org/apache/myfaces/core/myfaces-core-module/2.1.9-CLIENT-WINDOW-SNAPSHOT/myfaces-core-module-2.1.9-CLIENT-WINDOW-SNAPSHOT.pom
[JENKINS] Archiving <https://builds.apache.org/job/myfaces-current21_949/ws/2.1.x-client-window/pom.xml>
to /home/hudson/hudson/jobs/myfaces-current21_949/modules/org.apache.myfaces.core$myfaces-core-module/builds/2013-09-16_14-45-35/archive/org.apache.myfaces.core/myfaces-core-module/2.1.9-CLIENT-WINDOW-SNAPSHOT/myfaces-core-module-2.1.9-CLIENT-WINDOW-SNAPSHOT.pom
[INFO] ------------------------------------------------------------------------
[INFO] Building client-window-example
[INFO]    task-segment: [install]
[INFO] ------------------------------------------------------------------------
[INFO] [remote-resources:process {execution: default}]
[JENKINS] Recording test results[debug] execute contextualize

[INFO] [resources:resources {execution: default-resources}]
[INFO] Using 'UTF-8' encoding to copy filtered resources.
[INFO] Copying 0 resource
[INFO] Copying 3 resources
[INFO] [compiler:compile {execution: default-compile}]
[INFO] Compiling 9 source files to <https://builds.apache.org/job/myfaces-current21_949/ws/2.1.x-client-window/client-window-example/target/classes>
[INFO] [build-helper:add-test-resource {execution: add-webapp-folder-as-test}]
[debug] execute contextualize
[INFO] [resources:testResources {execution: default-testResources}]
[INFO] Using 'UTF-8' encoding to copy filtered resources.
[INFO] Copying 1 resource
[INFO] Copying 3 resources
[INFO] Copying 25 resources to webapp
[INFO] [compiler:testCompile {execution: default-testCompile}]
[INFO] Compiling 1 source file to <https://builds.apache.org/job/myfaces-current21_949/ws/2.1.x-client-window/client-window-example/target/test-classes>
[INFO] [surefire:test {execution: default-test}]
[INFO] Surefire report directory: <https://builds.apache.org/job/myfaces-current21_949/ws/2.1.x-client-window/client-window-example/target/surefire-reports>

-------------------------------------------------------
 T E S T S
-------------------------------------------------------
Running org.apache.myfaces.example.clientWindow.CheckFaceletsFileTestCase
Sep 16, 2013 2:54:23 PM org.apache.myfaces.util.ExternalSpecifications isUnifiedELAvailable
INFO: MyFaces Unified EL support enabled
Tests run: 3, Failures: 0, Errors: 0, Skipped: 0, Time elapsed: 1.18 sec

Results :

Tests run: 3, Failures: 0, Errors: 0, Skipped: 0

[INFO] [war:war {execution: default-war}]
[INFO] Packaging webapp
[INFO] Assembling webapp[client-window-example] in [<https://builds.apache.org/job/myfaces-current21_949/ws/2.1.x-client-window/client-window-example/target/client-window-example]>
[INFO] Processing war project
[INFO] Copying webapp resources[<https://builds.apache.org/job/myfaces-current21_949/ws/2.1.x-client-window/client-window-example/src/main/webapp]>
[INFO] Webapp assembled in[88 msecs]
[INFO] Building war: <https://builds.apache.org/job/myfaces-current21_949/ws/2.1.x-client-window/client-window-example/target/client-window-example.war>
[INFO] [checkstyle:check {execution: verify-style}]
[INFO] 
[INFO] [install:install {execution: default-install}]
[INFO] Installing <https://builds.apache.org/job/myfaces-current21_949/ws/2.1.x-client-window/client-window-example/target/client-window-example.war>
to /home/jenkins/jenkins-slave/maven-repositories/0/org/apache/myfaces/example/clientWindow/client-window-example/2.1.9-CLIENT-WINDOW-SNAPSHOT/client-window-example-2.1.9-CLIENT-WINDOW-SNAPSHOT.war
[JENKINS] Archiving <https://builds.apache.org/job/myfaces-current21_949/ws/2.1.x-client-window/client-window-example/pom.xml>
to /home/hudson/hudson/jobs/myfaces-current21_949/modules/org.apache.myfaces.example.clientWindow$client-window-example/builds/2013-09-16_14-45-42/archive/org.apache.myfaces.example.clientWindow/client-window-example/2.1.9-CLIENT-WINDOW-SNAPSHOT/client-window-example-2.1.9-CLIENT-WINDOW-SNAPSHOT.pom
[JENKINS] Archiving <https://builds.apache.org/job/myfaces-current21_949/ws/2.1.x-client-window/client-window-example/target/client-window-example.war>
to /home/hudson/hudson/jobs/myfaces-current21_949/modules/org.apache.myfaces.example.clientWindow$client-window-example/builds/2013-09-16_14-45-42/archive/org.apache.myfaces.example.clientWindow/client-window-example/2.1.9-CLIENT-WINDOW-SNAPSHOT/client-window-example-2.1.9-CLIENT-WINDOW-SNAPSHOT.war
[INFO] 
[INFO] 
[INFO] ------------------------------------------------------------------------
[INFO] Reactor Summary:
[INFO] ------------------------------------------------------------------------
[INFO] Apache MyFaces JSF-2.1 Core Project ................... SUCCESS [36.588s]
[INFO] Apache MyFaces JSF-2.1 Core API ....................... SUCCESS [1:19.875s]
[INFO] Apache MyFaces Shared Public API For JSF 2.1 - Core ... SUCCESS [30.193s]
[INFO] Apache MyFaces Core For JSF 2.1 - Shared .............. SUCCESS [40.693s]
[INFO] Apache MyFaces JSF-2.1 Core Impl ...................... SUCCESS [2:01.491s]
[INFO] Apache MyFaces JSF-2.1 Core OSGi Bundle ............... SUCCESS [30.488s]
[INFO] Apache MyFaces JSF-2.1 Core Module .................... SUCCESS [16.418s]
[INFO] client-window-example ................................. SUCCESS [29.933s]
[INFO] ------------------------------------------------------------------------
[INFO] ------------------------------------------------------------------------
[INFO] BUILD SUCCESSFUL
[INFO] ------------------------------------------------------------------------
[INFO] Total time: 8 minutes 25 seconds
[INFO] Finished at: Mon Sep 16 14:54:29 UTC 2013
[INFO] Final Memory: 155M/537M
[INFO] ------------------------------------------------------------------------
Waiting for Jenkins to finish collecting data
channel stopped
Maven RedeployPublisher use remote ubuntu2 maven settings from : /home/jenkins/.m2/settings.xml
[INFO] Deployment in https://repository.apache.org/content/repositories/snapshots (id=apache.snapshots.https,uniqueVersion=false)
Deploying the main artifact myfaces-api-2.1.9-CLIENT-WINDOW-SNAPSHOT.jar
Deploying the main artifact myfaces-api-2.1.9-CLIENT-WINDOW-SNAPSHOT-sources.jar
Deploying the main artifact myfaces-api-2.1.9-CLIENT-WINDOW-SNAPSHOT-tests.jar
[INFO] Deployment in https://repository.apache.org/content/repositories/snapshots (id=apache.snapshots.https,uniqueVersion=false)
Deploying the main artifact myfaces-bundle-2.1.9-CLIENT-WINDOW-SNAPSHOT.jar
Deploying the main artifact myfaces-bundle-2.1.9-CLIENT-WINDOW-SNAPSHOT-sources.jar
ERROR: Error installing artifact's metadata: Error while deploying metadata: The target server
failed to respond
org.apache.maven.artifact.deployer.ArtifactDeploymentException: Error installing artifact's
metadata: Error while deploying metadata: The target server failed to respond
	at hudson.maven.artifact.deployer.DefaultArtifactDeployer.deploy(DefaultArtifactDeployer.java:183)
	at hudson.maven.reporters.MavenArtifactRecord.deploy(MavenArtifactRecord.java:195)
	at hudson.maven.RedeployPublisher.perform(RedeployPublisher.java:176)
	at hudson.tasks.BuildStepMonitor$1.perform(BuildStepMonitor.java:20)
	at hudson.model.AbstractBuild$AbstractBuildExecution.perform(AbstractBuild.java:782)
	at hudson.model.AbstractBuild$AbstractBuildExecution.performAllBuildSteps(AbstractBuild.java:754)
	at hudson.maven.MavenModuleSetBuild$MavenModuleSetBuildExecution.post2(MavenModuleSetBuild.java:1007)
	at hudson.model.AbstractBuild$AbstractBuildExecution.post(AbstractBuild.java:707)
	at hudson.model.Run.execute(Run.java:1628)
	at hudson.maven.MavenModuleSetBuild.run(MavenModuleSetBuild.java:506)
	at hudson.model.ResourceController.execute(ResourceController.java:88)
	at hudson.model.Executor.run(Executor.java:246)
Caused by: org.apache.maven.artifact.repository.metadata.RepositoryMetadataDeploymentException:
Error while deploying metadata: The target server failed to respond
	at org.apache.maven.artifact.repository.metadata.DefaultRepositoryMetadataManager.deploy(DefaultRepositoryMetadataManager.java:492)
	at hudson.maven.artifact.deployer.DefaultArtifactDeployer.deploy(DefaultArtifactDeployer.java:167)
	... 11 more
Caused by: org.apache.maven.wagon.TransferFailedException: The target server failed to respond
	at org.apache.maven.wagon.shared.http4.AbstractHttpClientWagon.put(AbstractHttpClientWagon.java:580)
	at org.apache.maven.wagon.shared.http4.AbstractHttpClientWagon.put(AbstractHttpClientWagon.java:524)
	at org.apache.maven.wagon.shared.http4.AbstractHttpClientWagon.put(AbstractHttpClientWagon.java:505)
	at org.apache.maven.wagon.shared.http4.AbstractHttpClientWagon.put(AbstractHttpClientWagon.java:485)
	at org.apache.maven.repository.legacy.DefaultWagonManager.putRemoteFile(DefaultWagonManager.java:543)
	at org.apache.maven.repository.legacy.DefaultWagonManager.putArtifactMetadata(DefaultWagonManager.java:501)
	at org.apache.maven.artifact.repository.metadata.DefaultRepositoryMetadataManager.deploy(DefaultRepositoryMetadataManager.java:488)
	... 12 more
Caused by: org.apache.http.NoHttpResponseException: The target server failed to respond
	at org.apache.http.impl.conn.DefaultHttpResponseParser.parseHead(DefaultHttpResponseParser.java:95)
	at org.apache.http.impl.conn.DefaultHttpResponseParser.parseHead(DefaultHttpResponseParser.java:62)
	at org.apache.http.impl.io.AbstractMessageParser.parse(AbstractMessageParser.java:254)
	at org.apache.http.impl.AbstractHttpClientConnection.receiveResponseHeader(AbstractHttpClientConnection.java:289)
	at org.apache.http.impl.conn.DefaultClientConnection.receiveResponseHeader(DefaultClientConnection.java:252)
	at org.apache.http.impl.conn.ManagedClientConnectionImpl.receiveResponseHeader(ManagedClientConnectionImpl.java:191)
	at org.apache.http.protocol.HttpRequestExecutor.doReceiveResponse(HttpRequestExecutor.java:300)
	at org.apache.http.protocol.HttpRequestExecutor.execute(HttpRequestExecutor.java:127)
	at org.apache.http.impl.client.DefaultRequestDirector.tryExecute(DefaultRequestDirector.java:715)
	at org.apache.http.impl.client.DefaultRequestDirector.execute(DefaultRequestDirector.java:520)
	at org.apache.http.impl.client.AbstractHttpClient.execute(AbstractHttpClient.java:906)
	at org.apache.http.impl.client.AbstractHttpClient.execute(AbstractHttpClient.java:805)
	at org.apache.maven.wagon.shared.http4.AbstractHttpClientWagon.execute(AbstractHttpClientWagon.java:746)
	at org.apache.maven.wagon.shared.http4.AbstractHttpClientWagon.put(AbstractHttpClientWagon.java:574)
	... 18 more
[INFO] Deployment failed after 2 min 23 sec
Build step 'Deploy artifacts to Maven repository' changed build result to FAILURE

Mime
View raw message