myfaces-commits mailing list archives

Site index · List index
Message view « Date » · « Thread »
Top « Date » · « Thread »
From Apache Jenkins Server <jenk...@builds.apache.org>
Subject Build failed in Jenkins: tobago-1.0.x-deploy #702
Date Tue, 08 Oct 2013 12:11:23 GMT
See <https://builds.apache.org/job/tobago-1.0.x-deploy/702/changes>

Changes:

[lofwyr] TOBAGO-1320: SessionSecret not compatible with portlets

[lofwyr] TOBAGO-1318: Meaning of TobagoConfig.isCheckSessionSecret() and isCreateSessionSecret()
is inverted

------------------------------------------
[...truncated 3842 lines...]
[INFO] Retrieving previous build number from apache.snapshots.https
[WARNING] *** CHECKSUM FAILED - Checksum failed on download: local = '71a8b74303d2fba6c1700b7098ab5ce3add8cdff';
remote = '64de1cffc75968b68aeebae6a31344cc97bbb955' - RETRYING
[WARNING] *** CHECKSUM FAILED - Checksum failed on download: local = '71a8b74303d2fba6c1700b7098ab5ce3add8cdff';
remote = '64de1cffc75968b68aeebae6a31344cc97bbb955' - IGNORING
Uploading: https://repository.apache.org/content/repositories/snapshots/org/apache/myfaces/tobago/tobago-theme-standard/1.0.41-SNAPSHOT/tobago-theme-standard-1.0.41-SNAPSHOT.jar
93K uploaded  (tobago-theme-standard-1.0.41-SNAPSHOT.jar)
[INFO] Uploading project information for tobago-theme-standard 1.0.41-SNAPSHOT
[INFO] Retrieving previous metadata from apache.snapshots.https
[WARNING] *** CHECKSUM FAILED - Checksum failed on download: local = '71a8b74303d2fba6c1700b7098ab5ce3add8cdff';
remote = '64de1cffc75968b68aeebae6a31344cc97bbb955' - RETRYING
[WARNING] *** CHECKSUM FAILED - Checksum failed on download: local = '71a8b74303d2fba6c1700b7098ab5ce3add8cdff';
remote = '64de1cffc75968b68aeebae6a31344cc97bbb955' - IGNORING
[INFO] Uploading repository metadata for: 'snapshot org.apache.myfaces.tobago:tobago-theme-standard:1.0.41-SNAPSHOT'
[INFO] Retrieving previous metadata from apache.snapshots.https
[WARNING] *** CHECKSUM FAILED - Checksum failed on download: local = '44b9c500a53dd50cf26f21d4561cc7ac570dd08e';
remote = 'e1a6aec1a28c15012b053ec91cb55146afb82400' - RETRYING
[WARNING] *** CHECKSUM FAILED - Checksum failed on download: local = '44b9c500a53dd50cf26f21d4561cc7ac570dd08e';
remote = 'e1a6aec1a28c15012b053ec91cb55146afb82400' - IGNORING
[INFO] Uploading repository metadata for: 'artifact org.apache.myfaces.tobago:tobago-theme-standard'
[INFO] Retrieving previous build number from apache.snapshots.https
Uploading: https://repository.apache.org/content/repositories/snapshots/org/apache/myfaces/tobago/tobago-theme-standard/1.0.41-SNAPSHOT/tobago-theme-standard-1.0.41-SNAPSHOT-sources.jar
86K uploaded  (tobago-theme-standard-1.0.41-SNAPSHOT-sources.jar)
[INFO] Retrieving previous build number from apache.snapshots.https
Uploading: https://repository.apache.org/content/repositories/snapshots/org/apache/myfaces/tobago/tobago-theme-standard/1.0.41-SNAPSHOT/tobago-theme-standard-1.0.41-SNAPSHOT-sources.jar
86K uploaded  (tobago-theme-standard-1.0.41-SNAPSHOT-sources.jar)
[INFO] ------------------------------------------------------------------------
[INFO] Building Theme Scarborough
[INFO]    task-segment: [clean, source:jar, deploy]
[INFO] ------------------------------------------------------------------------
[INFO] [clean:clean {execution: default-clean}]
[INFO] Preparing source:jar
[WARNING] Removing: jar from forked lifecycle, to prevent recursive invocation.
[JENKINS] Archiving <https://builds.apache.org/job/tobago-1.0.x-deploy/ws/tobago-1.0.x-deploy/theme/scarborough/pom.xml>
to /home/hudson/hudson/jobs/tobago-1.0.x-deploy/modules/org.apache.myfaces.tobago$tobago-theme-scarborough/builds/2013-10-08_11-47-41/archive/org.apache.myfaces.tobago/tobago-theme-scarborough/1.0.41-SNAPSHOT/tobago-theme-scarborough-1.0.41-SNAPSHOT.pom
[INFO] [buildnumber:create {execution: default}]
ERROR: Could not find local repository for 2.2.1
[INFO] [source:jar {execution: default-cli}]
[INFO] org already added, skipping
[INFO] org/apache already added, skipping
[INFO] org/apache/myfaces already added, skipping
[INFO] org/apache/myfaces/tobago already added, skipping
[INFO] org/apache/myfaces/tobago/renderkit already added, skipping
[INFO] org/apache/myfaces/tobago/renderkit/html already added, skipping
[INFO] org/apache/myfaces/tobago/renderkit/html/scarborough already added, skipping
[INFO] org/apache/myfaces/tobago/renderkit/html/scarborough/mozilla_4_7 already added, skipping
[INFO] org/apache/myfaces/tobago/renderkit/html/scarborough/msie already added, skipping
[INFO] org/apache/myfaces/tobago/renderkit/html/scarborough/standard already added, skipping
[INFO] org/apache/myfaces/tobago/renderkit/html/scarborough/opera already added, skipping
[INFO] org/apache/myfaces/tobago/renderkit/html/scarborough/mozilla already added, skipping
[INFO] Building jar: <https://builds.apache.org/job/tobago-1.0.x-deploy/ws/tobago-1.0.x-deploy/theme/scarborough/target/tobago-theme-scarborough-1.0.41-SNAPSHOT-sources.jar>
[INFO] org already added, skipping
[INFO] org/apache already added, skipping
[INFO] org/apache/myfaces already added, skipping
[INFO] org/apache/myfaces/tobago already added, skipping
[INFO] org/apache/myfaces/tobago/renderkit already added, skipping
[INFO] org/apache/myfaces/tobago/renderkit/html already added, skipping
[INFO] org/apache/myfaces/tobago/renderkit/html/scarborough already added, skipping
[INFO] org/apache/myfaces/tobago/renderkit/html/scarborough/mozilla_4_7 already added, skipping
[INFO] org/apache/myfaces/tobago/renderkit/html/scarborough/msie already added, skipping
[INFO] org/apache/myfaces/tobago/renderkit/html/scarborough/standard already added, skipping
[INFO] org/apache/myfaces/tobago/renderkit/html/scarborough/opera already added, skipping
[INFO] org/apache/myfaces/tobago/renderkit/html/scarborough/mozilla already added, skipping
[INFO] [buildnumber:create {execution: default}]
[INFO] [remote-resources:process {execution: default}]
[INFO] [resources:resources {execution: default-resources}]
[INFO] Using 'UTF-8' encoding to copy filtered resources.
[INFO] Copying 121 resources
[INFO] Copying 3 resources
[INFO] [compiler:compile {execution: default-compile}]
[INFO] Compiling 57 source files to <https://builds.apache.org/job/tobago-1.0.x-deploy/ws/tobago-1.0.x-deploy/theme/scarborough/target/classes>
[INFO] [resources:testResources {execution: default-testResources}]
[JENKINS] Recording test results[INFO] Using 'UTF-8' encoding to copy filtered resources.

[INFO] skip non existing resourceDirectory <https://builds.apache.org/job/tobago-1.0.x-deploy/ws/tobago-1.0.x-deploy/theme/scarborough/src/test/resources>
[INFO] Copying 3 resources
[INFO] [compiler:testCompile {execution: default-testCompile}]
[INFO] Compiling 3 source files to <https://builds.apache.org/job/tobago-1.0.x-deploy/ws/tobago-1.0.x-deploy/theme/scarborough/target/test-classes>
[INFO] [surefire:test {execution: default-test}]
[INFO] Surefire report directory: <https://builds.apache.org/job/tobago-1.0.x-deploy/ws/tobago-1.0.x-deploy/theme/scarborough/target/surefire-reports>

-------------------------------------------------------
 T E S T S
-------------------------------------------------------
There are no tests to run.

Results :

Tests run: 0, Failures: 0, Errors: 0, Skipped: 0

[INFO] [jar:jar {execution: default-jar}]
[INFO] Building jar: <https://builds.apache.org/job/tobago-1.0.x-deploy/ws/tobago-1.0.x-deploy/theme/scarborough/target/tobago-theme-scarborough-1.0.41-SNAPSHOT.jar>
[INFO] [assembly:single {execution: source-release-assembly}]
[INFO] Skipping the assembly in this project because it's not the Execution Root
[INFO] Preparing source:jar
[WARNING] Removing: jar from forked lifecycle, to prevent recursive invocation.
[JENKINS] Archiving <https://builds.apache.org/job/tobago-1.0.x-deploy/ws/tobago-1.0.x-deploy/theme/scarborough/target/tobago-theme-scarborough-1.0.41-SNAPSHOT.jar>
to /home/hudson/hudson/jobs/tobago-1.0.x-deploy/modules/org.apache.myfaces.tobago$tobago-theme-scarborough/builds/2013-10-08_11-47-41/archive/org.apache.myfaces.tobago/tobago-theme-scarborough/1.0.41-SNAPSHOT/tobago-theme-scarborough-1.0.41-SNAPSHOT.jar
[JENKINS] Archiving <https://builds.apache.org/job/tobago-1.0.x-deploy/ws/tobago-1.0.x-deploy/theme/scarborough/target/tobago-theme-scarborough-1.0.41-SNAPSHOT-sources.jar>
to /home/hudson/hudson/jobs/tobago-1.0.x-deploy/modules/org.apache.myfaces.tobago$tobago-theme-scarborough/builds/2013-10-08_11-47-41/archive/org.apache.myfaces.tobago/tobago-theme-scarborough/1.0.41-SNAPSHOT/tobago-theme-scarborough-1.0.41-SNAPSHOT-sources.jar
[INFO] [buildnumber:create {execution: default}]
ERROR: Could not find local repository for 2.2.1
[INFO] [source:jar {execution: attach-source}]
[INFO] org already added, skipping
[INFO] org/apache already added, skipping
[INFO] org/apache/myfaces already added, skipping
[INFO] org/apache/myfaces/tobago already added, skipping
[INFO] org/apache/myfaces/tobago/renderkit already added, skipping
[INFO] org/apache/myfaces/tobago/renderkit/html already added, skipping
[INFO] org/apache/myfaces/tobago/renderkit/html/scarborough already added, skipping
[INFO] org/apache/myfaces/tobago/renderkit/html/scarborough/mozilla_4_7 already added, skipping
[INFO] org/apache/myfaces/tobago/renderkit/html/scarborough/msie already added, skipping
[INFO] org/apache/myfaces/tobago/renderkit/html/scarborough/standard already added, skipping
[INFO] org/apache/myfaces/tobago/renderkit/html/scarborough/opera already added, skipping
[INFO] org/apache/myfaces/tobago/renderkit/html/scarborough/mozilla already added, skipping
[INFO] META-INF already added, skipping
[INFO] META-INF already added, skipping
[INFO] META-INF/NOTICE already added, skipping
[INFO] META-INF/LICENSE already added, skipping
[INFO] META-INF/DEPENDENCIES already added, skipping
[INFO] [install:install {execution: default-install}]
[INFO] Installing <https://builds.apache.org/job/tobago-1.0.x-deploy/ws/tobago-1.0.x-deploy/theme/scarborough/target/tobago-theme-scarborough-1.0.41-SNAPSHOT.jar>
to /home/jenkins/jenkins-slave/maven-repositories/1/org/apache/myfaces/tobago/tobago-theme-scarborough/1.0.41-SNAPSHOT/tobago-theme-scarborough-1.0.41-SNAPSHOT.jar
[INFO] Installing <https://builds.apache.org/job/tobago-1.0.x-deploy/ws/tobago-1.0.x-deploy/theme/scarborough/target/tobago-theme-scarborough-1.0.41-SNAPSHOT-sources.jar>
to /home/jenkins/jenkins-slave/maven-repositories/1/org/apache/myfaces/tobago/tobago-theme-scarborough/1.0.41-SNAPSHOT/tobago-theme-scarborough-1.0.41-SNAPSHOT-sources.jar
[INFO] Installing <https://builds.apache.org/job/tobago-1.0.x-deploy/ws/tobago-1.0.x-deploy/theme/scarborough/target/tobago-theme-scarborough-1.0.41-SNAPSHOT-sources.jar>
to /home/jenkins/jenkins-slave/maven-repositories/1/org/apache/myfaces/tobago/tobago-theme-scarborough/1.0.41-SNAPSHOT/tobago-theme-scarborough-1.0.41-SNAPSHOT-sources.jar
[INFO] [deploy:deploy {execution: default-deploy}]
[INFO] Retrieving previous build number from apache.snapshots.https
[WARNING] *** CHECKSUM FAILED - Checksum failed on download: local = '5da2c40946625b6373f5ebebacd58eeb2e9f9e1b';
remote = '26c8d1a201e1c40d7cc441847b095664f0f09877' - RETRYING
[WARNING] *** CHECKSUM FAILED - Checksum failed on download: local = '5da2c40946625b6373f5ebebacd58eeb2e9f9e1b';
remote = '26c8d1a201e1c40d7cc441847b095664f0f09877' - IGNORING
Uploading: https://repository.apache.org/content/repositories/snapshots/org/apache/myfaces/tobago/tobago-theme-scarborough/1.0.41-SNAPSHOT/tobago-theme-scarborough-1.0.41-SNAPSHOT.jar
275K uploaded  (tobago-theme-scarborough-1.0.41-SNAPSHOT.jar)
[INFO] Retrieving previous metadata from apache.snapshots.https
[WARNING] *** CHECKSUM FAILED - Checksum failed on download: local = '5da2c40946625b6373f5ebebacd58eeb2e9f9e1b';
remote = '26c8d1a201e1c40d7cc441847b095664f0f09877' - RETRYING
[WARNING] *** CHECKSUM FAILED - Checksum failed on download: local = '5da2c40946625b6373f5ebebacd58eeb2e9f9e1b';
remote = '26c8d1a201e1c40d7cc441847b095664f0f09877' - IGNORING
[INFO] Uploading repository metadata for: 'snapshot org.apache.myfaces.tobago:tobago-theme-scarborough:1.0.41-SNAPSHOT'
[INFO] Uploading project information for tobago-theme-scarborough 1.0.41-SNAPSHOT
[INFO] Retrieving previous metadata from apache.snapshots.https
[WARNING] *** CHECKSUM FAILED - Checksum failed on download: local = 'd788bcb735998f9ea1fa77b3c9629f9efcca72ec';
remote = '2381d30f8568498556640d100519ddfb278a5b03' - RETRYING
[WARNING] *** CHECKSUM FAILED - Checksum failed on download: local = 'd788bcb735998f9ea1fa77b3c9629f9efcca72ec';
remote = '2381d30f8568498556640d100519ddfb278a5b03' - IGNORING
[INFO] Uploading repository metadata for: 'artifact org.apache.myfaces.tobago:tobago-theme-scarborough'
[INFO] Retrieving previous build number from apache.snapshots.https
Uploading: https://repository.apache.org/content/repositories/snapshots/org/apache/myfaces/tobago/tobago-theme-scarborough/1.0.41-SNAPSHOT/tobago-theme-scarborough-1.0.41-SNAPSHOT-sources.jar
223K uploaded  (tobago-theme-scarborough-1.0.41-SNAPSHOT-sources.jar)
[INFO] Retrieving previous build number from apache.snapshots.https
Uploading: https://repository.apache.org/content/repositories/snapshots/org/apache/myfaces/tobago/tobago-theme-scarborough/1.0.41-SNAPSHOT/tobago-theme-scarborough-1.0.41-SNAPSHOT-sources.jar
223K uploaded  (tobago-theme-scarborough-1.0.41-SNAPSHOT-sources.jar)
[INFO] ------------------------------------------------------------------------
[INFO] Building Theme Speyside
[INFO]    task-segment: [clean, source:jar, deploy]
[INFO] ------------------------------------------------------------------------
[INFO] [clean:clean {execution: default-clean}]
[INFO] Preparing source:jar
[WARNING] Removing: jar from forked lifecycle, to prevent recursive invocation.
[JENKINS] Archiving <https://builds.apache.org/job/tobago-1.0.x-deploy/ws/tobago-1.0.x-deploy/theme/speyside/pom.xml>
to /home/hudson/hudson/jobs/tobago-1.0.x-deploy/modules/org.apache.myfaces.tobago$tobago-theme-speyside/builds/2013-10-08_11-47-42/archive/org.apache.myfaces.tobago/tobago-theme-speyside/1.0.41-SNAPSHOT/tobago-theme-speyside-1.0.41-SNAPSHOT.pom
[INFO] [buildnumber:create {execution: default}]
ERROR: Could not find local repository for 2.2.1
[INFO] [source:jar {execution: default-cli}]
[INFO] org already added, skipping
[INFO] org/apache already added, skipping
[INFO] org/apache/myfaces already added, skipping
[INFO] org/apache/myfaces/tobago already added, skipping
[INFO] org/apache/myfaces/tobago/renderkit already added, skipping
[INFO] org/apache/myfaces/tobago/renderkit/html already added, skipping
[INFO] org/apache/myfaces/tobago/renderkit/html/speyside already added, skipping
[INFO] org/apache/myfaces/tobago/renderkit/html/speyside/standard already added, skipping
[INFO] Building jar: <https://builds.apache.org/job/tobago-1.0.x-deploy/ws/tobago-1.0.x-deploy/theme/speyside/target/tobago-theme-speyside-1.0.41-SNAPSHOT-sources.jar>
[INFO] org already added, skipping
[INFO] org/apache already added, skipping
[INFO] org/apache/myfaces already added, skipping
[INFO] org/apache/myfaces/tobago already added, skipping
[INFO] org/apache/myfaces/tobago/renderkit already added, skipping
[INFO] org/apache/myfaces/tobago/renderkit/html already added, skipping
[INFO] org/apache/myfaces/tobago/renderkit/html/speyside already added, skipping
[INFO] org/apache/myfaces/tobago/renderkit/html/speyside/standard already added, skipping
[INFO] [buildnumber:create {execution: default}]
[INFO] [remote-resources:process {execution: default}]
[INFO] [resources:resources {execution: default-resources}]
[INFO] Using 'UTF-8' encoding to copy filtered resources.
[INFO] Copying 100 resources
[INFO] Copying 3 resources
[INFO] [compiler:compile {execution: default-compile}]
[INFO] Compiling 2 source files to <https://builds.apache.org/job/tobago-1.0.x-deploy/ws/tobago-1.0.x-deploy/theme/speyside/target/classes>
[INFO] [resources:testResources {execution: default-testResources}]
[INFO] Using 'UTF-8' encoding to copy filtered resources.
[INFO] skip non existing resourceDirectory <https://builds.apache.org/job/tobago-1.0.x-deploy/ws/tobago-1.0.x-deploy/theme/speyside/src/test/resources>
[INFO] Copying 3 resources
[INFO] [compiler:testCompile {execution: default-testCompile}]
[INFO] No sources to compile
[INFO] [surefire:test {execution: default-test}]
[INFO] Surefire report directory: <https://builds.apache.org/job/tobago-1.0.x-deploy/ws/tobago-1.0.x-deploy/theme/speyside/target/surefire-reports>

-------------------------------------------------------
 T E S T S
-------------------------------------------------------
There are no tests to run.

Results :

Tests run: 0, Failures: 0, Errors: 0, Skipped: 0

[JENKINS] Recording test results
[INFO] [jar:jar {execution: default-jar}]
[INFO] Building jar: <https://builds.apache.org/job/tobago-1.0.x-deploy/ws/tobago-1.0.x-deploy/theme/speyside/target/tobago-theme-speyside-1.0.41-SNAPSHOT.jar>
[INFO] [assembly:single {execution: source-release-assembly}]
[INFO] Skipping the assembly in this project because it's not the Execution Root
[INFO] Preparing source:jar
[WARNING] Removing: jar from forked lifecycle, to prevent recursive invocation.
[JENKINS] Archiving <https://builds.apache.org/job/tobago-1.0.x-deploy/ws/tobago-1.0.x-deploy/theme/speyside/target/tobago-theme-speyside-1.0.41-SNAPSHOT.jar>
to /home/hudson/hudson/jobs/tobago-1.0.x-deploy/modules/org.apache.myfaces.tobago$tobago-theme-speyside/builds/2013-10-08_11-47-42/archive/org.apache.myfaces.tobago/tobago-theme-speyside/1.0.41-SNAPSHOT/tobago-theme-speyside-1.0.41-SNAPSHOT.jar
[JENKINS] Archiving <https://builds.apache.org/job/tobago-1.0.x-deploy/ws/tobago-1.0.x-deploy/theme/speyside/target/tobago-theme-speyside-1.0.41-SNAPSHOT-sources.jar>
to /home/hudson/hudson/jobs/tobago-1.0.x-deploy/modules/org.apache.myfaces.tobago$tobago-theme-speyside/builds/2013-10-08_11-47-42/archive/org.apache.myfaces.tobago/tobago-theme-speyside/1.0.41-SNAPSHOT/tobago-theme-speyside-1.0.41-SNAPSHOT-sources.jar
[INFO] [buildnumber:create {execution: default}]
ERROR: Could not find local repository for 2.2.1
[INFO] [source:jar {execution: attach-source}]
[INFO] org already added, skipping
[INFO] org/apache already added, skipping
[INFO] org/apache/myfaces already added, skipping
[INFO] org/apache/myfaces/tobago already added, skipping
[INFO] org/apache/myfaces/tobago/renderkit already added, skipping
[INFO] org/apache/myfaces/tobago/renderkit/html already added, skipping
[INFO] org/apache/myfaces/tobago/renderkit/html/speyside already added, skipping
[INFO] org/apache/myfaces/tobago/renderkit/html/speyside/standard already added, skipping
[INFO] META-INF already added, skipping
[INFO] META-INF already added, skipping
[INFO] META-INF/NOTICE already added, skipping
[INFO] META-INF/LICENSE already added, skipping
[INFO] META-INF/DEPENDENCIES already added, skipping
[INFO] [install:install {execution: default-install}]
[INFO] Installing <https://builds.apache.org/job/tobago-1.0.x-deploy/ws/tobago-1.0.x-deploy/theme/speyside/target/tobago-theme-speyside-1.0.41-SNAPSHOT.jar>
to /home/jenkins/jenkins-slave/maven-repositories/1/org/apache/myfaces/tobago/tobago-theme-speyside/1.0.41-SNAPSHOT/tobago-theme-speyside-1.0.41-SNAPSHOT.jar
[INFO] Installing <https://builds.apache.org/job/tobago-1.0.x-deploy/ws/tobago-1.0.x-deploy/theme/speyside/target/tobago-theme-speyside-1.0.41-SNAPSHOT-sources.jar>
to /home/jenkins/jenkins-slave/maven-repositories/1/org/apache/myfaces/tobago/tobago-theme-speyside/1.0.41-SNAPSHOT/tobago-theme-speyside-1.0.41-SNAPSHOT-sources.jar
[INFO] Installing <https://builds.apache.org/job/tobago-1.0.x-deploy/ws/tobago-1.0.x-deploy/theme/speyside/target/tobago-theme-speyside-1.0.41-SNAPSHOT-sources.jar>
to /home/jenkins/jenkins-slave/maven-repositories/1/org/apache/myfaces/tobago/tobago-theme-speyside/1.0.41-SNAPSHOT/tobago-theme-speyside-1.0.41-SNAPSHOT-sources.jar
[INFO] [deploy:deploy {execution: default-deploy}]
[INFO] Retrieving previous build number from apache.snapshots.https
[WARNING] *** CHECKSUM FAILED - Checksum failed on download: local = '7e696b0083584f475e0d39814a0abf76a54977bb';
remote = '47916060f91f577ec5fdc31d88829f6ae0538b65' - RETRYING
[WARNING] *** CHECKSUM FAILED - Checksum failed on download: local = '7e696b0083584f475e0d39814a0abf76a54977bb';
remote = '47916060f91f577ec5fdc31d88829f6ae0538b65' - IGNORING
Uploading: https://repository.apache.org/content/repositories/snapshots/org/apache/myfaces/tobago/tobago-theme-speyside/1.0.41-SNAPSHOT/tobago-theme-speyside-1.0.41-SNAPSHOT.jar
66K uploaded  (tobago-theme-speyside-1.0.41-SNAPSHOT.jar)
[INFO] Retrieving previous metadata from apache.snapshots.https
[WARNING] *** CHECKSUM FAILED - Checksum failed on download: local = '31087b836c6a6bd3a48ee0a65b1f647f11b67390';
remote = '5dea9d36c77033e9be306ee4113f90ad9f472e29' - RETRYING
[WARNING] *** CHECKSUM FAILED - Checksum failed on download: local = '31087b836c6a6bd3a48ee0a65b1f647f11b67390';
remote = '5dea9d36c77033e9be306ee4113f90ad9f472e29' - IGNORING
[INFO] Uploading repository metadata for: 'artifact org.apache.myfaces.tobago:tobago-theme-speyside'
[INFO] Retrieving previous metadata from apache.snapshots.https
[WARNING] *** CHECKSUM FAILED - Checksum failed on download: local = '7e696b0083584f475e0d39814a0abf76a54977bb';
remote = '47916060f91f577ec5fdc31d88829f6ae0538b65' - RETRYING
[WARNING] *** CHECKSUM FAILED - Checksum failed on download: local = '7e696b0083584f475e0d39814a0abf76a54977bb';
remote = '47916060f91f577ec5fdc31d88829f6ae0538b65' - IGNORING
[INFO] Uploading repository metadata for: 'snapshot org.apache.myfaces.tobago:tobago-theme-speyside:1.0.41-SNAPSHOT'
[INFO] Uploading project information for tobago-theme-speyside 1.0.41-SNAPSHOT
[INFO] Retrieving previous build number from apache.snapshots.https
Uploading: https://repository.apache.org/content/repositories/snapshots/org/apache/myfaces/tobago/tobago-theme-speyside/1.0.41-SNAPSHOT/tobago-theme-speyside-1.0.41-SNAPSHOT-sources.jar
58K uploaded  (tobago-theme-speyside-1.0.41-SNAPSHOT-sources.jar)
[INFO] Retrieving previous build number from apache.snapshots.https
Uploading: https://repository.apache.org/content/repositories/snapshots/org/apache/myfaces/tobago/tobago-theme-speyside/1.0.41-SNAPSHOT/tobago-theme-speyside-1.0.41-SNAPSHOT-sources.jar
58K uploaded  (tobago-theme-speyside-1.0.41-SNAPSHOT-sources.jar)
[INFO] ------------------------------------------------------------------------
[INFO] Building Theme Richmond
[INFO]    task-segment: [clean, source:jar, deploy]
[INFO] ------------------------------------------------------------------------
[INFO] [clean:clean {execution: default-clean}]
[INFO] Preparing source:jar
[WARNING] Removing: jar from forked lifecycle, to prevent recursive invocation.
ERROR: Maven JVM terminated unexpectedly with exit code 143


Mime
View raw message