myfaces-commits mailing list archives

Site index · List index
Message view « Date » · « Thread »
Top « Date » · « Thread »
From Apache Jenkins Server <jenk...@builds.apache.org>
Subject Build failed in Jenkins: Trinidad Core Trunk (sanity) #833
Date Wed, 06 Nov 2013 00:27:49 GMT
See <https://builds.apache.org/job/Trinidad%20Core%20Trunk%20(sanity)/833/changes>

Changes:

[jwaldman] TRINIDAD-2423 wrong assertion for font-size that it should be numeric
Thanks to Anand Nath for the patch

[andys] TRINIDAD-2410 LOCAL_VALUE_SET_KEY and SUBMITTED_VALUE_KEY should specify CAP_NOT_BOUND

------------------------------------------
[...truncated 15503 lines...]
136/353 KB   344/506 KB   
136/353 KB   348/506 KB   
136/353 KB   352/506 KB   
136/353 KB   356/506 KB   
136/353 KB   360/506 KB   
136/353 KB   364/506 KB   
136/353 KB   368/506 KB   
136/353 KB   372/506 KB   
136/353 KB   376/506 KB   
136/353 KB   380/506 KB   
136/353 KB   384/506 KB   
136/353 KB   388/506 KB   
136/353 KB   392/506 KB   
136/353 KB   396/506 KB   
136/353 KB   400/506 KB   
136/353 KB   404/506 KB   
136/353 KB   408/506 KB   
136/353 KB   412/506 KB   
136/353 KB   416/506 KB   
136/353 KB   420/506 KB   
136/353 KB   424/506 KB   
136/353 KB   428/506 KB   
136/353 KB   432/506 KB   
136/353 KB   436/506 KB   
136/353 KB   440/506 KB   
136/353 KB   444/506 KB   
136/353 KB   448/506 KB   
136/353 KB   452/506 KB   
136/353 KB   456/506 KB   
136/353 KB   460/506 KB   
136/353 KB   464/506 KB   
136/353 KB   468/506 KB   
136/353 KB   472/506 KB   
136/353 KB   476/506 KB   
136/353 KB   480/506 KB   
136/353 KB   484/506 KB   
136/353 KB   488/506 KB   
136/353 KB   492/506 KB   
136/353 KB   496/506 KB   
136/353 KB   500/506 KB   
136/353 KB   504/506 KB   
136/353 KB   506/506 KB   
136/353 KB   172/506 KB   
140/353 KB   506/506 KB   
144/353 KB   506/506 KB   
148/353 KB   506/506 KB   
152/353 KB   506/506 KB   
156/353 KB   506/506 KB   
160/353 KB   506/506 KB   
164/353 KB   506/506 KB   
168/353 KB   506/506 KB   
172/353 KB   506/506 KB   
176/353 KB   506/506 KB   
180/353 KB   506/506 KB   
184/353 KB   506/506 KB   
188/353 KB   506/506 KB   
192/353 KB   506/506 KB   
196/353 KB   506/506 KB   
200/353 KB   506/506 KB   
204/353 KB   506/506 KB   
208/353 KB   506/506 KB   
212/353 KB   506/506 KB   
216/353 KB   506/506 KB   
220/353 KB   506/506 KB   
224/353 KB   506/506 KB   
228/353 KB   506/506 KB   
232/353 KB   506/506 KB   
236/353 KB   506/506 KB   
240/353 KB   506/506 KB   
244/353 KB   506/506 KB   
248/353 KB   506/506 KB   
252/353 KB   506/506 KB   
256/353 KB   506/506 KB   
260/353 KB   506/506 KB   
264/353 KB   506/506 KB   
268/353 KB   506/506 KB   
272/353 KB   506/506 KB   
276/353 KB   506/506 KB   
280/353 KB   506/506 KB   
284/353 KB   506/506 KB   
288/353 KB   506/506 KB   
292/353 KB   506/506 KB   
296/353 KB   506/506 KB   
300/353 KB   506/506 KB   
304/353 KB   506/506 KB   
308/353 KB   506/506 KB   
312/353 KB   506/506 KB   
316/353 KB   506/506 KB   
320/353 KB   506/506 KB   
324/353 KB   506/506 KB   
328/353 KB   506/506 KB   
332/353 KB   506/506 KB   
336/353 KB   506/506 KB   
340/353 KB   506/506 KB   
344/353 KB   506/506 KB   
348/353 KB   506/506 KB   
352/353 KB   506/506 KB   
353/353 KB   506/506 KB   
                          
Downloaded: http://repo.maven.apache.org/maven2/velocity/velocity-dep/1.4/velocity-dep-1.4.jar
(506 KB at 17435.4 KB/sec)
                          
Downloaded: http://repo.maven.apache.org/maven2/velocity/velocity/1.4/velocity-1.4.jar (353
KB at 12162.3 KB/sec)
[INFO] 
[INFO] --- maven-enforcer-plugin:1.0.1:enforce (enforce-versions) @ maven-tagdoc-plugin ---
[INFO] 
[INFO] --- maven-plugin-plugin:2.8:descriptor (default-descriptor) @ maven-tagdoc-plugin ---
[ERROR] 

Artifact Ids of the format maven-___-plugin are reserved for 
plugins in the Group Id org.apache.maven.plugins
Please change your artifactId to the format ___-maven-plugin
In the future this error will break the build.


[INFO] Using 'UTF-8' encoding to read mojo metadata.
[INFO] Applying mojo extractor for language: java
[INFO] Mojo extractor for language: java found 1 mojo descriptors.
[INFO] Applying mojo extractor for language: bsh
[INFO] Mojo extractor for language: bsh found 0 mojo descriptors.
[INFO] 
[INFO] --- maven-remote-resources-plugin:1.2.1:process (default) @ maven-tagdoc-plugin ---
[INFO] 
[INFO] --- maven-resources-plugin:2.5:resources (default-resources) @ maven-tagdoc-plugin
---
[debug] execute contextualize
[INFO] Using 'UTF-8' encoding to copy filtered resources.
[INFO] Copying 0 resource
[INFO] Copying 2 resources
[INFO] 
[INFO] --- maven-compiler-plugin:2.3.2:compile (default-compile) @ maven-tagdoc-plugin ---
[INFO] Compiling 1 source file to <https://builds.apache.org/job/Trinidad%20Core%20Trunk%20(sanity)/ws/trinidad-maven/maven-tagdoc-plugin/target/classes>
[INFO] 
[INFO] --- maven-resources-plugin:2.5:testResources (default-testResources) @ maven-tagdoc-plugin
---
[debug] execute contextualize
[INFO] Using 'UTF-8' encoding to copy filtered resources.
[INFO] skip non existing resourceDirectory <https://builds.apache.org/job/Trinidad%20Core%20Trunk%20(sanity)/ws/trinidad-maven/maven-tagdoc-plugin/src/test/resources>
[INFO] Copying 2 resources
[INFO] 
[INFO] --- maven-compiler-plugin:2.3.2:testCompile (default-testCompile) @ maven-tagdoc-plugin
---
[INFO] No sources to compile
[INFO] 
[INFO] --- maven-surefire-plugin:2.9:test (default-test) @ maven-tagdoc-plugin ---
[INFO] Surefire report directory: <https://builds.apache.org/job/Trinidad%20Core%20Trunk%20(sanity)/ws/trinidad-maven/maven-tagdoc-plugin/target/surefire-reports>

-------------------------------------------------------
 T E S T S
-------------------------------------------------------

Results :

Tests run: 0, Failures: 0, Errors: 0, Skipped: 0

[INFO] 
[INFO] --- maven-jar-plugin:2.3.2:jar (default-jar) @ maven-tagdoc-plugin ---
[INFO] Building jar: <https://builds.apache.org/job/Trinidad%20Core%20Trunk%20(sanity)/ws/trinidad-maven/maven-tagdoc-plugin/target/maven-tagdoc-plugin-2.0.9-SNAPSHOT.jar>
[INFO] 
[INFO] --- maven-plugin-plugin:2.8:addPluginArtifactMetadata (default-addPluginArtifactMetadata)
@ maven-tagdoc-plugin ---
[INFO] 
[INFO] --- maven-site-plugin:3.0:attach-descriptor (attach-descriptor) @ maven-tagdoc-plugin
---
[INFO] 
[INFO] --- maven-checkstyle-plugin:2.7:check (verify-style) @ maven-tagdoc-plugin ---
[INFO] 
[INFO] 
[INFO] --- maven-install-plugin:2.3.1:install (default-install) @ maven-tagdoc-plugin ---
[INFO] Installing <https://builds.apache.org/job/Trinidad%20Core%20Trunk%20(sanity)/ws/trinidad-maven/maven-tagdoc-plugin/target/maven-tagdoc-plugin-2.0.9-SNAPSHOT.jar>
to <https://builds.apache.org/job/Trinidad%20Core%20Trunk%20(sanity)/ws/.repository/org/apache/myfaces/trinidadbuild/maven-tagdoc-plugin/2.0.9-SNAPSHOT/maven-tagdoc-plugin-2.0.9-SNAPSHOT.jar>
[INFO] Installing <https://builds.apache.org/job/Trinidad%20Core%20Trunk%20(sanity)/ws/trinidad-maven/maven-tagdoc-plugin/pom.xml>
to <https://builds.apache.org/job/Trinidad%20Core%20Trunk%20(sanity)/ws/.repository/org/apache/myfaces/trinidadbuild/maven-tagdoc-plugin/2.0.9-SNAPSHOT/maven-tagdoc-plugin-2.0.9-SNAPSHOT.pom>
[INFO] ------------------------------------------------------------------------
[INFO] Reactor Summary:
[INFO] 
[INFO] Apache Trinidad Maven Plugin Parent ............... SUCCESS [6.768s]
[INFO] Apache Trinidad Maven JDev Plugin ................. SUCCESS [4.419s]
[INFO] Apache Trinidad Maven Faces Plugin ................ SUCCESS [4.913s]
[INFO] Apache Trinidad Maven Javacc Plugin ............... SUCCESS [1.960s]
[INFO] Apache Trinidad Maven i18n Plugin ................. SUCCESS [1.511s]
[INFO] Apache Trinidad Maven Javascript Plugin ........... SUCCESS [5.067s]
[INFO] Apache Trinidad Maven XRTS Plugin ................. SUCCESS [1.165s]
[INFO] Apache Trinidad Maven Tag Documentation Report .... SUCCESS [1.883s]
[INFO] ------------------------------------------------------------------------
[INFO] BUILD SUCCESS
[INFO] ------------------------------------------------------------------------
[INFO] Total time: 28.401s
[INFO] Finished at: Tue Nov 05 23:51:33 UTC 2013
[INFO] Final Memory: 55M/665M
[INFO] ------------------------------------------------------------------------
Parsing POMs
maven3-agent.jar already up to date
maven3-interceptor.jar already up to date
maven3-interceptor-commons.jar already up to date
[Trinidad Core Trunk (sanity)] $ /home/hudson/tools/java/latest1.6/bin/java -Xms512m -Xmx1024m
-XX:PermSize=256m -XX:MaxPermSize=512m -cp /home/jenkins/jenkins-slave/maven3-agent.jar:/home/hudson/tools/maven/apache-maven-3.0.4/boot/plexus-classworlds-2.4.jar
org.jvnet.hudson.maven3.agent.Maven3Main /home/hudson/tools/maven/apache-maven-3.0.4 /home/jenkins/jenkins-slave/slave.jar
/home/jenkins/jenkins-slave/maven3-interceptor.jar /home/jenkins/jenkins-slave/maven3-interceptor-commons.jar
35186
<===[JENKINS REMOTING CAPACITY]===>channel started
   log4j:WARN No appenders could be found for logger (org.apache.commons.beanutils.converters.BooleanConverter).
log4j:WARN Please initialize the log4j system properly.
Executing Maven:  -B -f <https://builds.apache.org/job/Trinidad%20Core%20Trunk%20(sanity)/ws/pom.xml>
-Dmaven.repo.local=<https://builds.apache.org/job/Trinidad%20Core%20Trunk%20(sanity)/ws/.repository>
-PbuildSnapshot,enableRat,enableAssert clean install
[INFO] Scanning for projects...
[INFO] ------------------------------------------------------------------------
[INFO] Reactor Build Order:
[INFO] 
[INFO] Apache MyFaces Trinidad
[INFO] Apache MyFaces Trinidad Build
[INFO] Apache MyFaces Trinidad API
[INFO] Apache MyFaces Trinidad Impl
[INFO] Apache MyFaces Trinidad Examples
[INFO] Apache MyFaces Trinidad Blank Demo
[INFO] Apache MyFaces Trinidad Demo
[INFO] Apache MyFaces Trinidad Components Showcase
[INFO]                                                                         
[INFO] ------------------------------------------------------------------------
[INFO] Building Apache MyFaces Trinidad 2.1.1-SNAPSHOT
[INFO] ------------------------------------------------------------------------
Downloading: http://repo.maven.apache.org/maven2/org/apache/maven/plugins/maven-source-plugin/2.1.2/maven-source-plugin-2.1.2.pom
Downloaded: http://repo.maven.apache.org/maven2/org/apache/maven/plugins/maven-source-plugin/2.1.2/maven-source-plugin-2.1.2.pom
(6 KB at 43.1 KB/sec)
Downloading: http://repo.maven.apache.org/maven2/org/apache/maven/plugins/maven-source-plugin/2.1.2/maven-source-plugin-2.1.2.jar
Downloaded: http://repo.maven.apache.org/maven2/org/apache/maven/plugins/maven-source-plugin/2.1.2/maven-source-plugin-2.1.2.jar
(24 KB at 1678.2 KB/sec)
[WARNING] The POM for org.apache.myfaces.trinidadbuild:maven-xrts-plugin:jar:2.0.8-SNAPSHOT
is missing, no dependency information available
[INFO] ------------------------------------------------------------------------
[INFO] Reactor Summary:
[INFO] 
[INFO] Apache MyFaces Trinidad ........................... FAILURE [2.201s]
[INFO] Apache MyFaces Trinidad Build ..................... SKIPPED
[INFO] Apache MyFaces Trinidad API ....................... SKIPPED
[INFO] Apache MyFaces Trinidad Impl ...................... SKIPPED
[INFO] Apache MyFaces Trinidad Examples .................. SKIPPED
[INFO] Apache MyFaces Trinidad Blank Demo ................ SKIPPED
[INFO] Apache MyFaces Trinidad Demo ...................... SKIPPED
[INFO] Apache MyFaces Trinidad Components Showcase ....... SKIPPED
[INFO] ------------------------------------------------------------------------
[INFO] BUILD FAILURE
[INFO] ------------------------------------------------------------------------
[INFO] Total time: 5:05.026s
[INFO] Finished at: Tue Nov 05 23:56:48 UTC 2013
[INFO] Final Memory: 7M/490M
[INFO] ------------------------------------------------------------------------
Waiting for Jenkins to finish collecting data[ERROR] Plugin org.apache.myfaces.trinidadbuild:maven-xrts-plugin:2.0.8-SNAPSHOT
or one of its dependencies could not be resolved: Failed to read artifact descriptor for org.apache.myfaces.trinidadbuild:maven-xrts-plugin:jar:2.0.8-SNAPSHOT:
Could not find artifact org.apache.myfaces.trinidadbuild:maven-xrts-plugin:pom:2.0.8-SNAPSHOT
-> [Help 1]
[ERROR] 
[ERROR] To see the full stack trace of the errors, re-run Maven with the -e switch.
[ERROR] Re-run Maven using the -X switch to enable full debug logging.
[ERROR] 
[ERROR] For more information about the errors and possible solutions, please read the following
articles:
[ERROR] [Help 1] http://cwiki.apache.org/confluence/display/MAVEN/PluginResolutionException

[JENKINS] Archiving <https://builds.apache.org/job/Trinidad%20Core%20Trunk%20(sanity)/ws/trinidad-examples/trinidad-demo/pom.xml>
to org.apache.myfaces.trinidad/trinidad-demo/2.1.1-SNAPSHOT/trinidad-demo-2.1.1-SNAPSHOT.pom
[JENKINS] Archiving <https://builds.apache.org/job/Trinidad%20Core%20Trunk%20(sanity)/ws/trinidad-build/pom.xml>
to org.apache.myfaces.trinidad/trinidad-build/2.1.1-SNAPSHOT/trinidad-build-2.1.1-SNAPSHOT.pom
[JENKINS] Archiving <https://builds.apache.org/job/Trinidad%20Core%20Trunk%20(sanity)/ws/trinidad-examples/trinidad-components-showcase/pom.xml>
to org.apache.myfaces.trinidad/trinidad-components-showcase/2.1.1-SNAPSHOT/trinidad-components-showcase-2.1.1-SNAPSHOT.pom
[JENKINS] Archiving <https://builds.apache.org/job/Trinidad%20Core%20Trunk%20(sanity)/ws/pom.xml>
to org.apache.myfaces.trinidad/trinidad/2.1.1-SNAPSHOT/trinidad-2.1.1-SNAPSHOT.pom
[JENKINS] Archiving <https://builds.apache.org/job/Trinidad%20Core%20Trunk%20(sanity)/ws/trinidad-examples/pom.xml>
to org.apache.myfaces.trinidad/trinidad-example/2.1.1-SNAPSHOT/trinidad-example-2.1.1-SNAPSHOT.pom
[JENKINS] Archiving <https://builds.apache.org/job/Trinidad%20Core%20Trunk%20(sanity)/ws/trinidad-api/pom.xml>
to org.apache.myfaces.trinidad/trinidad-api/2.1.1-SNAPSHOT/trinidad-api-2.1.1-SNAPSHOT.pom
[JENKINS] Archiving <https://builds.apache.org/job/Trinidad%20Core%20Trunk%20(sanity)/ws/trinidad-examples/trinidad-blank/pom.xml>
to org.apache.myfaces.trinidad/trinidad-blank/2.1.1-SNAPSHOT/trinidad-blank-2.1.1-SNAPSHOT.pom
[JENKINS] Archiving <https://builds.apache.org/job/Trinidad%20Core%20Trunk%20(sanity)/ws/trinidad-impl/pom.xml>
to org.apache.myfaces.trinidad/trinidad-impl/2.1.1-SNAPSHOT/trinidad-impl-2.1.1-SNAPSHOT.pom
Sending e-mails to: commits@myfaces.apache.org null@apache.org
channel stopped

Mime
View raw message