myfaces-commits mailing list archives

Site index · List index
Message view « Date » · « Thread »
Top « Date » · « Thread »
From Apache Jenkins Server <jenk...@builds.apache.org>
Subject Build failed in Jenkins: myfaces-current-2.0 #2245
Date Fri, 01 Nov 2013 17:00:20 GMT
See <https://builds.apache.org/job/myfaces-current-2.0/2245/>

------------------------------------------
[...truncated 4344 lines...]
[INFO] No goals needed for project - skipping
[INFO] [source:jar {execution: attach-source}]
[INFO] META-INF already added, skipping
[INFO] META-INF already added, skipping
[INFO] META-INF/NOTICE already added, skipping
[INFO] META-INF/LICENSE already added, skipping
[INFO] META-INF/DEPENDENCIES already added, skipping
[INFO] META-INF already added, skipping
[INFO] Building jar: <https://builds.apache.org/job/myfaces-current-2.0/ws/current20/shared/core/target/myfaces-shared-core-4.0.20-SNAPSHOT-sources.jar>
[INFO] META-INF already added, skipping
[INFO] META-INF already added, skipping
[INFO] META-INF/NOTICE already added, skipping
[INFO] META-INF/LICENSE already added, skipping
[INFO] META-INF/DEPENDENCIES already added, skipping
[INFO] META-INF already added, skipping
[INFO] [checkstyle:check {execution: verify-style}]
[INFO] 
[INFO] [install:install {execution: default-install}]
[INFO] Installing <https://builds.apache.org/job/myfaces-current-2.0/ws/current20/shared/core/target/myfaces-shared-core-4.0.20-SNAPSHOT.jar>
to /home/jenkins/jenkins-slave/maven-repositories/0/org/apache/myfaces/shared/myfaces-shared-core/4.0.20-SNAPSHOT/myfaces-shared-core-4.0.20-SNAPSHOT.jar
[INFO] Installing <https://builds.apache.org/job/myfaces-current-2.0/ws/current20/shared/core/target/myfaces-shared-core-4.0.20-SNAPSHOT-sources.jar>
to /home/jenkins/jenkins-slave/maven-repositories/0/org/apache/myfaces/shared/myfaces-shared-core/4.0.20-SNAPSHOT/myfaces-shared-core-4.0.20-SNAPSHOT-sources.jar
[INFO] [deploy:deploy {execution: default-deploy}]
[INFO] Retrieving previous build number from apache.snapshots.https
[WARNING] *** CHECKSUM FAILED - Checksum failed on download: local = '081d35209a41a389a8d8917c4a89afff0ec62753';
remote = '22d80e6fc5b9d90ebf3e8630382c70eee3226767' - RETRYING
[WARNING] *** CHECKSUM FAILED - Checksum failed on download: local = '081d35209a41a389a8d8917c4a89afff0ec62753';
remote = '22d80e6fc5b9d90ebf3e8630382c70eee3226767' - IGNORING
Uploading: https://repository.apache.org/content/repositories/snapshots/org/apache/myfaces/shared/myfaces-shared-core/4.0.20-SNAPSHOT/myfaces-shared-core-4.0.20-20131101.153626-13.jar
451K uploaded  (myfaces-shared-core-4.0.20-20131101.153626-13.jar)
[INFO] Retrieving previous metadata from apache.snapshots.https
[WARNING] *** CHECKSUM FAILED - Checksum failed on download: local = '081d35209a41a389a8d8917c4a89afff0ec62753';
remote = '22d80e6fc5b9d90ebf3e8630382c70eee3226767' - RETRYING
[WARNING] *** CHECKSUM FAILED - Checksum failed on download: local = '081d35209a41a389a8d8917c4a89afff0ec62753';
remote = '22d80e6fc5b9d90ebf3e8630382c70eee3226767' - IGNORING
[INFO] Uploading repository metadata for: 'snapshot org.apache.myfaces.shared:myfaces-shared-core:4.0.20-SNAPSHOT'
[INFO] Uploading project information for myfaces-shared-core 4.0.20-20131101.153626-13
[INFO] Retrieving previous metadata from apache.snapshots.https
[INFO] Uploading repository metadata for: 'artifact org.apache.myfaces.shared:myfaces-shared-core'
[INFO] Retrieving previous build number from apache.snapshots.https
Uploading: https://repository.apache.org/content/repositories/snapshots/org/apache/myfaces/shared/myfaces-shared-core/4.0.20-SNAPSHOT/myfaces-shared-core-4.0.20-20131101.153626-13-sources.jar
411K uploaded  (myfaces-shared-core-4.0.20-20131101.153626-13-sources.jar)
[INFO] ------------------------------------------------------------------------
[INFO] Building MyFaces Shared Tomahawk
[INFO]    task-segment: [clean, deploy]
[INFO] ------------------------------------------------------------------------
[INFO] [clean:clean {execution: default-clean}]
[INFO] [dependency:unpack {execution: unpack-sources}]
[INFO] Configured Artifact: org.apache.myfaces.shared:myfaces-shared-core:sources:4.0.20-SNAPSHOT:jar
[INFO] snapshot org.apache.myfaces.shared:myfaces-shared-core:4.0.20-SNAPSHOT: checking for
updates from apache-maven-snapshots
[INFO] snapshot org.apache.myfaces.shared:myfaces-shared-core:4.0.20-SNAPSHOT: checking for
updates from apache.snapshots
[INFO] Unpacking /home/jenkins/jenkins-slave/maven-repositories/0/org/apache/myfaces/shared/myfaces-shared-core/4.0.20-SNAPSHOT/myfaces-shared-core-4.0.20-SNAPSHOT-sources.jarto
 <https://builds.apache.org/job/myfaces-current-2.0/ws/current20/shared/shared-tomahawk/target/unpacked-shared-sources>
with Includes null and excludes:null
[INFO] [dependency:unpack {execution: unpack-resources-sources}]
[INFO] Configured Artifact: org.apache.myfaces.shared:myfaces-shared-core:4.0.20-SNAPSHOT:jar
[INFO] Unpacking /home/jenkins/jenkins-slave/maven-repositories/0/org/apache/myfaces/shared/myfaces-shared-core/4.0.20-SNAPSHOT/myfaces-shared-core-4.0.20-SNAPSHOT.jarto
 <https://builds.apache.org/job/myfaces-current-2.0/ws/current20/shared/shared-tomahawk/target/refactored-shared-sources/main/resources>
with Includes META-INF/internal-resources/**,META-INF/resources/** and excludes:null
[INFO] [build-helper:add-source {execution: add-source-shared}]
[INFO] Source directory: <https://builds.apache.org/job/myfaces-current-2.0/ws/current20/shared/shared-tomahawk/target/refactored-shared-sources/main/java>
added.
[WARNING] DEPRECATED [sourceRoot]: Use the build-helper-maven-plugin to bind source directories
[WARNING] DEPRECATED [tasks]: Use target instead
[INFO] [antrun:run {execution: refactor-shared-sources}]
[WARNING] Parameter tasks is deprecated, use target instead
[INFO] Executing tasks

main:

refactor-java-sources:
    [mkdir] Created dir: <https://builds.apache.org/job/myfaces-current-2.0/ws/current20/shared/shared-tomahawk/target/refactored-shared-sources/main/java>
     [move] Moving 140 files to <https://builds.apache.org/job/myfaces-current-2.0/ws/current20/shared/shared-tomahawk/target/refactored-shared-sources/main/java/org/apache/myfaces/shared_tomahawk>
[INFO] Executed tasks
[INFO] Registering compile source root <https://builds.apache.org/job/myfaces-current-2.0/ws/current20/shared/shared-tomahawk/target/refactored-shared-sources/main/java>
[INFO] [remote-resources:process {execution: default}]
[WARNING] DEPRECATED [tasks]: Use target instead
[INFO] [antrun:run {execution: refactor-resources}]
[WARNING] Parameter tasks is deprecated, use target instead
[INFO] Executing tasks

main:

refactor-resources:
[INFO] Executed tasks
[debug] execute contextualize
[INFO] [resources:resources {execution: default-resources}]
[INFO] Using 'UTF-8' encoding to copy filtered resources.
[INFO] Copying 2 resources
[INFO] Copying 3 resources
[INFO] [dependency:unpack {execution: unpack-resources}]
[INFO] Configured Artifact: org.apache.myfaces.shared:myfaces-shared-core:4.0.20-SNAPSHOT:jar
[INFO] Unpacking /home/jenkins/jenkins-slave/maven-repositories/0/org/apache/myfaces/shared/myfaces-shared-core/4.0.20-SNAPSHOT/myfaces-shared-core-4.0.20-SNAPSHOT.jarto
 <https://builds.apache.org/job/myfaces-current-2.0/ws/current20/shared/shared-tomahawk/target/classes>
with Includes META-INF/internal-resources/**,META-INF/resources/** and excludes:null
[INFO] [compiler:compile {execution: default-compile}]
[INFO] Compiling 140 source files to <https://builds.apache.org/job/myfaces-current-2.0/ws/current20/shared/shared-tomahawk/target/classes>
[debug] execute contextualize
[INFO] [resources:testResources {execution: default-testResources}]
[INFO] Using 'UTF-8' encoding to copy filtered resources.
[INFO] skip non existing resourceDirectory <https://builds.apache.org/job/myfaces-current-2.0/ws/current20/shared/shared-tomahawk/src/test/resources>
[INFO] Copying 3 resources
[INFO] [compiler:testCompile {execution: default-testCompile}]
[INFO] No sources to compile
[INFO] [surefire:test {execution: default-test}]
[INFO] Surefire report directory: <https://builds.apache.org/job/myfaces-current-2.0/ws/current20/shared/shared-tomahawk/target/surefire-reports>

-------------------------------------------------------
 T E S T S
-------------------------------------------------------

Results :

Tests run: 0, Failures: 0, Errors: 0, Skipped: 0

[JENKINS] Recording test results
[INFO] [jar:jar {execution: default-jar}]
[INFO] Building jar: <https://builds.apache.org/job/myfaces-current-2.0/ws/current20/shared/shared-tomahawk/target/myfaces-shared-tomahawk-4.0.20-SNAPSHOT.jar>
[INFO] Preparing source:jar
[WARNING] Removing: jar from forked lifecycle, to prevent recursive invocation.
[INFO] [dependency:unpack {execution: unpack-sources}]
[INFO] Configured Artifact: org.apache.myfaces.shared:myfaces-shared-core:sources:4.0.20-SNAPSHOT:jar
[INFO] myfaces-shared-core-4.0.20-SNAPSHOT-sources.jar already unpacked.
[INFO] [dependency:unpack {execution: unpack-resources-sources}]
[INFO] Configured Artifact: org.apache.myfaces.shared:myfaces-shared-core:4.0.20-SNAPSHOT:jar
[INFO] Unpacking /home/jenkins/jenkins-slave/maven-repositories/0/org/apache/myfaces/shared/myfaces-shared-core/4.0.20-SNAPSHOT/myfaces-shared-core-4.0.20-SNAPSHOT.jarto
 <https://builds.apache.org/job/myfaces-current-2.0/ws/current20/shared/shared-tomahawk/target/refactored-shared-sources/main/resources>
with Includes META-INF/internal-resources/**,META-INF/resources/** and excludes:null
ERROR: Could not find local repository for 2.2.1
[INFO] [source:jar {execution: attach-source}]
[INFO] META-INF already added, skipping
[INFO] META-INF already added, skipping
[INFO] META-INF/NOTICE already added, skipping
[INFO] META-INF/LICENSE already added, skipping
[INFO] META-INF/DEPENDENCIES already added, skipping
[INFO] Building jar: <https://builds.apache.org/job/myfaces-current-2.0/ws/current20/shared/shared-tomahawk/target/myfaces-shared-tomahawk-4.0.20-SNAPSHOT-sources.jar>
[INFO] META-INF already added, skipping
[INFO] META-INF already added, skipping
[INFO] META-INF/NOTICE already added, skipping
[INFO] META-INF/LICENSE already added, skipping
[INFO] META-INF/DEPENDENCIES already added, skipping
[INFO] [checkstyle:check {execution: verify-style}]
[INFO] 
[INFO] [install:install {execution: default-install}]
[INFO] Installing <https://builds.apache.org/job/myfaces-current-2.0/ws/current20/shared/shared-tomahawk/target/myfaces-shared-tomahawk-4.0.20-SNAPSHOT.jar>
to /home/jenkins/jenkins-slave/maven-repositories/0/org/apache/myfaces/shared/myfaces-shared-tomahawk/4.0.20-SNAPSHOT/myfaces-shared-tomahawk-4.0.20-SNAPSHOT.jar
[INFO] Installing <https://builds.apache.org/job/myfaces-current-2.0/ws/current20/shared/shared-tomahawk/target/myfaces-shared-tomahawk-4.0.20-SNAPSHOT-sources.jar>
to /home/jenkins/jenkins-slave/maven-repositories/0/org/apache/myfaces/shared/myfaces-shared-tomahawk/4.0.20-SNAPSHOT/myfaces-shared-tomahawk-4.0.20-SNAPSHOT-sources.jar
[INFO] [deploy:deploy {execution: default-deploy}]
[INFO] Retrieving previous build number from apache.snapshots.https
[WARNING] *** CHECKSUM FAILED - Checksum failed on download: local = '2b0de43da62df98c385b24a3b9cde25db76e3ba6';
remote = '7d4717310ed132863e16a089a718a8a51b27ace6' - RETRYING
[WARNING] *** CHECKSUM FAILED - Checksum failed on download: local = '2b0de43da62df98c385b24a3b9cde25db76e3ba6';
remote = '7d4717310ed132863e16a089a718a8a51b27ace6' - IGNORING
Uploading: https://repository.apache.org/content/repositories/snapshots/org/apache/myfaces/shared/myfaces-shared-tomahawk/4.0.20-SNAPSHOT/myfaces-shared-tomahawk-4.0.20-20131101.153626-13.jar
421K uploaded  (myfaces-shared-tomahawk-4.0.20-20131101.153626-13.jar)
[INFO] Uploading project information for myfaces-shared-tomahawk 4.0.20-20131101.153626-13
[INFO] Retrieving previous metadata from apache.snapshots.https
[WARNING] *** CHECKSUM FAILED - Checksum failed on download: local = '2b0de43da62df98c385b24a3b9cde25db76e3ba6';
remote = '7d4717310ed132863e16a089a718a8a51b27ace6' - RETRYING
[WARNING] *** CHECKSUM FAILED - Checksum failed on download: local = '2b0de43da62df98c385b24a3b9cde25db76e3ba6';
remote = '7d4717310ed132863e16a089a718a8a51b27ace6' - IGNORING
[INFO] Uploading repository metadata for: 'snapshot org.apache.myfaces.shared:myfaces-shared-tomahawk:4.0.20-SNAPSHOT'
[INFO] Retrieving previous metadata from apache.snapshots.https
[INFO] Uploading repository metadata for: 'artifact org.apache.myfaces.shared:myfaces-shared-tomahawk'
[INFO] Retrieving previous build number from apache.snapshots.https
Uploading: https://repository.apache.org/content/repositories/snapshots/org/apache/myfaces/shared/myfaces-shared-tomahawk/4.0.20-SNAPSHOT/myfaces-shared-tomahawk-4.0.20-20131101.153626-13-sources.jar
379K uploaded  (myfaces-shared-tomahawk-4.0.20-20131101.153626-13-sources.jar)
[INFO] ------------------------------------------------------------------------
[INFO] Building Apache MyFaces Shared Public API For JSF 2.0 - Core
[INFO]    task-segment: [clean, deploy]
[INFO] ------------------------------------------------------------------------
[INFO] [clean:clean {execution: default-clean}]
[INFO] [myfaces-builder:build-metadata {execution: makemyfacesmetadata}]
Artifact: myfaces-api-2.0.20-SNAPSHOT.jar have META-INF/myfaces-metadata.xml
[INFO] [remote-resources:process {execution: default}]
[debug] execute contextualize
[INFO] [resources:resources {execution: default-resources}]
[INFO] Using 'UTF-8' encoding to copy filtered resources.
[INFO] Copying 2 resources
[INFO] Copying 1 resource
[INFO] Copying 3 resources
[INFO] [compiler:compile {execution: default-compile}]
[INFO] Compiling 21 source files to <https://builds.apache.org/job/myfaces-current-2.0/ws/current20/core/shared-public/target/classes>
[debug] execute contextualize
[INFO] [resources:testResources {execution: default-testResources}]
[INFO] Using 'UTF-8' encoding to copy filtered resources.
[INFO] Copying 15 resources
[INFO] Copying 3 resources
[INFO] [compiler:testCompile {execution: default-testCompile}]
[INFO] Compiling 1 source file to <https://builds.apache.org/job/myfaces-current-2.0/ws/current20/core/shared-public/target/test-classes>
[INFO] [surefire:test {execution: default-test}]
[INFO] Surefire report directory: <https://builds.apache.org/job/myfaces-current-2.0/ws/current20/core/shared-public/target/surefire-reports>

-------------------------------------------------------
 T E S T S
-------------------------------------------------------
Running org.apache.myfaces.shared.util.MessageUtilsTest
currency ?100.00
Tests run: 11, Failures: 0, Errors: 0, Skipped: 0, Time elapsed: 0.223 sec

Results :

Tests run: 11, Failures: 0, Errors: 0, Skipped: 0

[JENKINS] Recording test results
[INFO] [jar:jar {execution: default-jar}]
[INFO] Building jar: <https://builds.apache.org/job/myfaces-current-2.0/ws/current20/core/shared-public/target/myfaces-impl-shared-public-2.0.20-SNAPSHOT.jar>
[INFO] Preparing source:jar
[WARNING] Removing: jar from forked lifecycle, to prevent recursive invocation.
[INFO] [myfaces-builder:build-metadata {execution: makemyfacesmetadata}]
[INFO] model is up to date
ERROR: Could not find local repository for 2.2.1
[INFO] [source:jar {execution: attach-source}]
[INFO] Building jar: <https://builds.apache.org/job/myfaces-current-2.0/ws/current20/core/shared-public/target/myfaces-impl-shared-public-2.0.20-SNAPSHOT-sources.jar>
[INFO] [checkstyle:check {execution: verify-style}]
[INFO] 
[INFO] [install:install {execution: default-install}]
[INFO] Installing <https://builds.apache.org/job/myfaces-current-2.0/ws/current20/core/shared-public/target/myfaces-impl-shared-public-2.0.20-SNAPSHOT.jar>
to /home/jenkins/jenkins-slave/maven-repositories/0/org/apache/myfaces/core/internal/myfaces-impl-shared-public/2.0.20-SNAPSHOT/myfaces-impl-shared-public-2.0.20-SNAPSHOT.jar
[INFO] Installing <https://builds.apache.org/job/myfaces-current-2.0/ws/current20/core/shared-public/target/myfaces-impl-shared-public-2.0.20-SNAPSHOT-sources.jar>
to /home/jenkins/jenkins-slave/maven-repositories/0/org/apache/myfaces/core/internal/myfaces-impl-shared-public/2.0.20-SNAPSHOT/myfaces-impl-shared-public-2.0.20-SNAPSHOT-sources.jar
[INFO] [deploy:deploy {execution: default-deploy}]
[INFO] Retrieving previous build number from apache.snapshots.https
[WARNING] *** CHECKSUM FAILED - Checksum failed on download: local = 'c780370415fc3c66f0b241ea2fbe9801d440b664';
remote = '30107a254d1cb6942e40c59077ce13e1a3be5d76' - RETRYING
[WARNING] *** CHECKSUM FAILED - Checksum failed on download: local = 'c780370415fc3c66f0b241ea2fbe9801d440b664';
remote = '30107a254d1cb6942e40c59077ce13e1a3be5d76' - IGNORING
Uploading: https://repository.apache.org/content/repositories/snapshots/org/apache/myfaces/core/internal/myfaces-impl-shared-public/2.0.20-SNAPSHOT/myfaces-impl-shared-public-2.0.20-20131101.153626-12.jar
88K uploaded  (myfaces-impl-shared-public-2.0.20-20131101.153626-12.jar)
[INFO] Retrieving previous metadata from apache.snapshots.https
[WARNING] *** CHECKSUM FAILED - Checksum failed on download: local = 'c780370415fc3c66f0b241ea2fbe9801d440b664';
remote = '30107a254d1cb6942e40c59077ce13e1a3be5d76' - RETRYING
[WARNING] *** CHECKSUM FAILED - Checksum failed on download: local = 'c780370415fc3c66f0b241ea2fbe9801d440b664';
remote = '30107a254d1cb6942e40c59077ce13e1a3be5d76' - IGNORING
[INFO] Uploading repository metadata for: 'snapshot org.apache.myfaces.core.internal:myfaces-impl-shared-public:2.0.20-SNAPSHOT'
[INFO] Uploading project information for myfaces-impl-shared-public 2.0.20-20131101.153626-12
[INFO] Retrieving previous metadata from apache.snapshots.https
[INFO] Uploading repository metadata for: 'artifact org.apache.myfaces.core.internal:myfaces-impl-shared-public'
[INFO] Retrieving previous build number from apache.snapshots.https
Uploading: https://repository.apache.org/content/repositories/snapshots/org/apache/myfaces/core/internal/myfaces-impl-shared-public/2.0.20-SNAPSHOT/myfaces-impl-shared-public-2.0.20-20131101.153626-12-sources.jar
84K uploaded  (myfaces-impl-shared-public-2.0.20-20131101.153626-12-sources.jar)
Build timed out (after 60 minutes). Marking the build as failed.
[INFO] ------------------------------------------------------------------------
[ERROR] FATAL ERROR
[INFO] ------------------------------------------------------------------------
[INFO] Unable to call setResult. Invalid object ID 7
[INFO] ------------------------------------------------------------------------
[INFO] Trace
java.lang.IllegalStateException: Unable to call setResult. Invalid object ID 7
	at hudson.remoting.RemoteInvocationHandler$RPCRequest.perform(RemoteInvocationHandler.java:293)
	at hudson.remoting.RemoteInvocationHandler$RPCRequest.call(RemoteInvocationHandler.java:280)
	at hudson.remoting.RemoteInvocationHandler$RPCRequest.call(RemoteInvocationHandler.java:239)
	at hudson.remoting.UserRequest.perform(UserRequest.java:118)
	at hudson.remoting.UserRequest.perform(UserRequest.java:48)
	at hudson.remoting.Request$2.run(Request.java:326)
	at hudson.remoting.InterceptingExecutorService$1.call(InterceptingExecutorService.java:72)
	at java.util.concurrent.FutureTask$Sync.innerRun(FutureTask.java:334)
	at java.util.concurrent.FutureTask.run(FutureTask.java:166)
	at java.util.concurrent.ThreadPoolExecutor.runWorker(ThreadPoolExecutor.java:1145)
	at java.util.concurrent.ThreadPoolExecutor$Worker.run(ThreadPoolExecutor.java:615)
	at java.lang.Thread.run(Thread.java:724)
[INFO] ------------------------------------------------------------------------
[INFO] Total time: 59 minutes 2 seconds
[INFO] Finished at: Fri Nov 01 16:34:53 UTC 2013
[INFO] Final Memory: 124M/478M
[INFO] ------------------------------------------------------------------------
channel stopped

Mime
View raw message