myfaces-commits mailing list archives

Site index · List index
Message view « Date » · « Thread »
Top « Date » · « Thread »
From Apache Jenkins Server <jenk...@builds.apache.org>
Subject Build failed in Jenkins: Trinidad Core 2.0.x (sanity) #17
Date Sun, 03 Nov 2013 17:02:13 GMT
See <https://builds.apache.org/job/Trinidad%20Core%202.0.x%20(sanity)/17/changes>

Changes:

[sobryan] [maven-release-plugin] prepare release maven-plugin-parent-2.0.8

------------------------------------------
[...truncated 11506 lines...]
8/8 KB   70/226 KB   13/13 KB   12/12 KB   
8/8 KB   74/226 KB   13/13 KB   12/12 KB   
8/8 KB   78/226 KB   13/13 KB   12/12 KB   
8/8 KB   82/226 KB   13/13 KB   12/12 KB   
8/8 KB   86/226 KB   13/13 KB   12/12 KB   
8/8 KB   90/226 KB   13/13 KB   12/12 KB   
8/8 KB   94/226 KB   13/13 KB   12/12 KB   
8/8 KB   98/226 KB   13/13 KB   12/12 KB   
8/8 KB   102/226 KB   13/13 KB   12/12 KB   
8/8 KB   106/226 KB   13/13 KB   12/12 KB   
8/8 KB   110/226 KB   13/13 KB   12/12 KB   
8/8 KB   114/226 KB   13/13 KB   12/12 KB   
                                            
Downloaded: http://repo.maven.apache.org/maven2/org/apache/maven/doxia/doxia-site-renderer/1.0-alpha-7/doxia-site-renderer-1.0-alpha-7.jar
(13 KB at 1768.7 KB/sec)
8/8 KB   118/226 KB   12/12 KB              
Downloading: http://repo.maven.apache.org/maven2/commons-logging/commons-logging-api/1.0.4/commons-logging-api-1.0.4.jar
8/8 KB   122/226 KB   12/12 KB   
8/8 KB   126/226 KB   12/12 KB   
8/8 KB   130/226 KB   12/12 KB   
8/8 KB   134/226 KB   12/12 KB   
8/8 KB   138/226 KB   12/12 KB   
8/8 KB   142/226 KB   12/12 KB   
8/8 KB   146/226 KB   12/12 KB   
8/8 KB   150/226 KB   12/12 KB   
8/8 KB   154/226 KB   12/12 KB   
                                 
8/8 KB   158/226 KB              
Downloaded: http://repo.maven.apache.org/maven2/org/codehaus/plexus/plexus-i18n/1.0-beta-6/plexus-i18n-1.0-beta-6.jar
(12 KB at 1954.4 KB/sec)
Downloading: http://repo.maven.apache.org/maven2/org/apache/maven/doxia/doxia-decoration-model/1.0-alpha-7/doxia-decoration-model-1.0-alpha-7.jar
8/8 KB   162/226 KB   
8/8 KB   166/226 KB   
8/8 KB   170/226 KB   
4/157 KB   8/8 KB   170/226 KB   
4/157 KB   8/8 KB   174/226 KB   
4/157 KB   8/8 KB   178/226 KB   
4/157 KB   8/8 KB   182/226 KB   
4/157 KB   8/8 KB   186/226 KB   
4/157 KB   8/8 KB   190/226 KB   
4/157 KB   8/8 KB   194/226 KB   
7/157 KB   8/8 KB   194/226 KB   
7/157 KB   8/8 KB   198/226 KB   
11/157 KB   8/8 KB   198/226 KB   
11/157 KB   8/8 KB   202/226 KB   
15/157 KB   8/8 KB   202/226 KB   
15/157 KB   8/8 KB   206/226 KB   
19/157 KB   8/8 KB   206/226 KB   
19/157 KB   8/8 KB   210/226 KB   
23/157 KB   8/8 KB   210/226 KB   
23/157 KB   8/8 KB   214/226 KB   
27/157 KB   8/8 KB   214/226 KB   
27/157 KB   8/8 KB   218/226 KB   
31/157 KB   8/8 KB   218/226 KB   
31/157 KB   8/8 KB   222/226 KB   
35/157 KB   8/8 KB   222/226 KB   
35/157 KB   4/26 KB   8/8 KB   222/226 KB   
35/157 KB   4/26 KB   8/8 KB   226/226 KB   
39/157 KB   4/26 KB   8/8 KB   226/226 KB   
39/157 KB   4/26 KB   8/8 KB   226/226 KB   
43/157 KB   4/26 KB   8/8 KB   226/226 KB   
47/157 KB   4/26 KB   8/8 KB   226/226 KB   
                                            
51/157 KB   4/26 KB   226/226 KB            
51/157 KB   7/26 KB   226/226 KB   
55/157 KB   7/26 KB   226/226 KB   
55/157 KB   11/26 KB   226/226 KB   
59/157 KB   11/26 KB   226/226 KB   
59/157 KB   15/26 KB   226/226 KB   
63/157 KB   15/26 KB   226/226 KB   
63/157 KB   19/26 KB   226/226 KB   
67/157 KB   19/26 KB   226/226 KB   
67/157 KB   23/26 KB   226/226 KB   
71/157 KB   23/26 KB   226/226 KB   
71/157 KB   26/26 KB   226/226 KB   
75/157 KB   26/26 KB   226/226 KB   
79/157 KB   26/26 KB   226/226 KB   
83/157 KB   26/26 KB   226/226 KB   
Downloaded: http://repo.maven.apache.org/maven2/org/codehaus/plexus/plexus-velocity/1.1.2/plexus-velocity-1.1.2.jar
(8 KB at 972.5 KB/sec)
83/157 KB   26/26 KB   226/226 KB   4/38 KB   
87/157 KB   26/26 KB   226/226 KB   4/38 KB   
91/157 KB   26/26 KB   226/226 KB   4/38 KB   
95/157 KB   26/26 KB   226/226 KB   4/38 KB   
99/157 KB   26/26 KB   226/226 KB   4/38 KB   
103/157 KB   26/26 KB   226/226 KB   4/38 KB   
107/157 KB   26/26 KB   226/226 KB   4/38 KB   
111/157 KB   26/26 KB   226/226 KB   4/38 KB   
115/157 KB   26/26 KB   226/226 KB   4/38 KB   
119/157 KB   26/26 KB   226/226 KB   4/38 KB   
123/157 KB   26/26 KB   226/226 KB   4/38 KB   
127/157 KB   26/26 KB   226/226 KB   4/38 KB   
131/157 KB   26/26 KB   226/226 KB   4/38 KB   
135/157 KB   26/26 KB   226/226 KB   4/38 KB   
139/157 KB   26/26 KB   226/226 KB   4/38 KB   
143/157 KB   26/26 KB   226/226 KB   4/38 KB   
147/157 KB   26/26 KB   226/226 KB   4/38 KB   
151/157 KB   26/26 KB   226/226 KB   4/38 KB   
155/157 KB   26/26 KB   226/226 KB   4/38 KB   
157/157 KB   26/26 KB   226/226 KB   4/38 KB   
                                               
Downloaded: http://repo.maven.apache.org/maven2/org/apache/maven/doxia/doxia-core/1.0-alpha-7/doxia-core-1.0-alpha-7.jar
(226 KB at 16133.4 KB/sec)
157/157 KB   26/26 KB   7/38 KB                
157/157 KB   26/26 KB   11/38 KB   
157/157 KB   26/26 KB   15/38 KB   
157/157 KB   26/26 KB   19/38 KB   
157/157 KB   26/26 KB   23/38 KB   
157/157 KB   26/26 KB   27/38 KB   
157/157 KB   26/26 KB   31/38 KB   
157/157 KB   26/26 KB   35/38 KB   
157/157 KB   26/26 KB   38/38 KB   
                                   
Downloaded: http://repo.maven.apache.org/maven2/plexus/plexus-utils/1.0.2/plexus-utils-1.0.2.jar
(157 KB at 14238.5 KB/sec)
                                   
Downloaded: http://repo.maven.apache.org/maven2/org/apache/maven/doxia/doxia-decoration-model/1.0-alpha-7/doxia-decoration-model-1.0-alpha-7.jar
(38 KB at 3728.0 KB/sec)
                                   
Downloaded: http://repo.maven.apache.org/maven2/commons-logging/commons-logging-api/1.0.4/commons-logging-api-1.0.4.jar
(26 KB at 304.6 KB/sec)
[INFO] 
[INFO] --- maven-enforcer-plugin:1.0-beta-1:enforce (enforce-versions) @ maven-tagdoc-plugin
---
[INFO] 
[INFO] --- maven-plugin-plugin:2.5.1:descriptor (default-descriptor) @ maven-tagdoc-plugin
---
[INFO] Using 'UTF-8' encoding to read mojo metadata.
[INFO] Applying mojo extractor for language: java
[INFO] Mojo extractor for language: java found 1 mojo descriptors.
[INFO] Applying mojo extractor for language: bsh
[INFO] Mojo extractor for language: bsh found 0 mojo descriptors.
[INFO] 
[INFO] --- maven-remote-resources-plugin:1.1:process (default) @ maven-tagdoc-plugin ---
[INFO] 
[INFO] --- maven-resources-plugin:2.4.3:resources (default-resources) @ maven-tagdoc-plugin
---
[INFO] Using 'UTF-8' encoding to copy filtered resources.
[INFO] Copying 0 resource
[INFO] Copying 2 resources
[INFO] 
[INFO] --- maven-compiler-plugin:2.3.1:compile (default-compile) @ maven-tagdoc-plugin ---
[INFO] Compiling 1 source file to /home/hudson/jenkins-slave/workspace/Trinidad Core 2.0.x
(sanity)/trinidad-maven/maven-tagdoc-plugin/target/classes
[INFO] 
[INFO] --- maven-resources-plugin:2.4.3:testResources (default-testResources) @ maven-tagdoc-plugin
---
[INFO] Using 'UTF-8' encoding to copy filtered resources.
[INFO] skip non existing resourceDirectory /home/hudson/jenkins-slave/workspace/Trinidad Core
2.0.x (sanity)/trinidad-maven/maven-tagdoc-plugin/src/test/resources
[INFO] Copying 2 resources
[INFO] 
[INFO] --- maven-compiler-plugin:2.3.1:testCompile (default-testCompile) @ maven-tagdoc-plugin
---
[INFO] No sources to compile
[INFO] 
[INFO] --- maven-surefire-plugin:2.5:test (default-test) @ maven-tagdoc-plugin ---
[INFO] Surefire report directory: /home/hudson/jenkins-slave/workspace/Trinidad Core 2.0.x
(sanity)/trinidad-maven/maven-tagdoc-plugin/target/surefire-reports

-------------------------------------------------------
 T E S T S
-------------------------------------------------------
There are no tests to run.

Results :

Tests run: 0, Failures: 0, Errors: 0, Skipped: 0

[INFO] 
[INFO] --- maven-jar-plugin:2.3.1:jar (default-jar) @ maven-tagdoc-plugin ---
[INFO] Building jar: /home/hudson/jenkins-slave/workspace/Trinidad Core 2.0.x (sanity)/trinidad-maven/maven-tagdoc-plugin/target/maven-tagdoc-plugin-2.0.8.jar
[INFO] 
[INFO] --- maven-plugin-plugin:2.5.1:addPluginArtifactMetadata (default-addPluginArtifactMetadata)
@ maven-tagdoc-plugin ---
[INFO] 
[INFO] --- maven-install-plugin:2.3:install (default-install) @ maven-tagdoc-plugin ---
[INFO] Installing /home/hudson/jenkins-slave/workspace/Trinidad Core 2.0.x (sanity)/trinidad-maven/maven-tagdoc-plugin/target/maven-tagdoc-plugin-2.0.8.jar
to <https://builds.apache.org/job/Trinidad%20Core%202.0.x%20(sanity)/ws/.repository/org/apache/myfaces/trinidadbuild/maven-tagdoc-plugin/2.0.8/maven-tagdoc-plugin-2.0.8.jar>
[INFO] Installing /home/hudson/jenkins-slave/workspace/Trinidad Core 2.0.x (sanity)/trinidad-maven/maven-tagdoc-plugin/pom.xml
to <https://builds.apache.org/job/Trinidad%20Core%202.0.x%20(sanity)/ws/.repository/org/apache/myfaces/trinidadbuild/maven-tagdoc-plugin/2.0.8/maven-tagdoc-plugin-2.0.8.pom>
[INFO] ------------------------------------------------------------------------
[INFO] Reactor Summary:
[INFO] 
[INFO] Apache Trinidad Maven Plugin Parent ............... SUCCESS [4.470s]
[INFO] Apache Trinidad Maven JDev Plugin ................. SUCCESS [4.408s]
[INFO] Apache Trinidad Maven Faces Plugin ................ SUCCESS [5.380s]
[INFO] Apache Trinidad Maven Javacc Plugin ............... SUCCESS [1.505s]
[INFO] Apache Trinidad Maven i18n Plugin ................. SUCCESS [1.742s]
[INFO] Apache Trinidad Maven Javascript Plugin ........... SUCCESS [3.805s]
[INFO] Apache Trinidad Maven XRTS Plugin ................. SUCCESS [1.008s]
[INFO] Apache Trinidad Maven Tag Documentation Report .... SUCCESS [1.994s]
[INFO] ------------------------------------------------------------------------
[INFO] BUILD SUCCESS
[INFO] ------------------------------------------------------------------------
[INFO] Total time: 24.956s
[INFO] Finished at: Sun Nov 03 16:23:37 UTC 2013
[INFO] Final Memory: 44M/638M
[INFO] ------------------------------------------------------------------------
Parsing POMs
Downloaded artifact http://repo.maven.apache.org/maven2/org/apache/myfaces/myfaces/11/myfaces-11.pom
Downloaded artifact http://repo.maven.apache.org/maven2/org/apache/apache/10/apache-10.pom
maven3-agent.jar already up to date
maven3-interceptor.jar already up to date
maven3-interceptor-commons.jar already up to date
[Trinidad Core 2.0.x (sanity)] $ /home/hudson/tools/java/latest1.6/bin/java -Xms512m -Xmx1024m
-XX:PermSize=256m -XX:MaxPermSize=512m -cp /home/jenkins/jenkins-slave/maven3-agent.jar:/home/hudson/tools/maven/apache-maven-3.0.4/boot/plexus-classworlds-2.4.jar
org.jvnet.hudson.maven3.agent.Maven3Main /home/hudson/tools/maven/apache-maven-3.0.4 /home/hudson/jenkins-slave/slave.jar
/home/jenkins/jenkins-slave/maven3-interceptor.jar /home/jenkins/jenkins-slave/maven3-interceptor-commons.jar
55408
<===[JENKINS REMOTING CAPACITY]===>channel started
   log4j:WARN No appenders could be found for logger (org.apache.commons.beanutils.converters.BooleanConverter).
log4j:WARN Please initialize the log4j system properly.
Executing Maven:  -B -f <https://builds.apache.org/job/Trinidad%20Core%202.0.x%20(sanity)/ws/pom.xml>
-Dmaven.repo.local=<https://builds.apache.org/job/Trinidad%20Core%202.0.x%20(sanity)/ws/.repository>
-PbuildSnapshot,enableRat,enableAssert clean install
[INFO] Scanning for projects...
[INFO] ------------------------------------------------------------------------
[INFO] Reactor Build Order:
[INFO] 
[INFO] Apache MyFaces Trinidad 2.0
[INFO] Apache MyFaces Trinidad Build
[INFO] Apache MyFaces Trinidad API
[INFO] Apache MyFaces Trinidad Impl
[INFO] Apache MyFaces Trinidad Examples
[INFO] Apache MyFaces Trinidad Blank Demo
[INFO] Apache MyFaces Trinidad Demo
[INFO] Apache MyFaces Trinidad Components Showcase
[INFO]                                                                         
[INFO] ------------------------------------------------------------------------
[INFO] Building Apache MyFaces Trinidad 2.0 2.0.2-SNAPSHOT
[INFO] ------------------------------------------------------------------------
Downloading: http://repo.maven.apache.org/maven2/org/apache/maven/plugins/maven-source-plugin/2.1.2/maven-source-plugin-2.1.2.pom
Downloaded: http://repo.maven.apache.org/maven2/org/apache/maven/plugins/maven-source-plugin/2.1.2/maven-source-plugin-2.1.2.pom
(6 KB at 46.7 KB/sec)
Downloading: http://repo.maven.apache.org/maven2/org/apache/maven/plugins/maven-source-plugin/2.1.2/maven-source-plugin-2.1.2.jar
Downloaded: http://repo.maven.apache.org/maven2/org/apache/maven/plugins/maven-source-plugin/2.1.2/maven-source-plugin-2.1.2.jar
(24 KB at 1957.9 KB/sec)
[WARNING] The POM for org.apache.myfaces.trinidadbuild:maven-xrts-plugin:jar:2.0.8-SNAPSHOT
is missing, no dependency information available
[INFO] ------------------------------------------------------------------------
[INFO] Reactor Summary:
[INFO] 
[INFO] Apache MyFaces Trinidad 2.0 ....................... FAILURE [0.966s]
[INFO] Apache MyFaces Trinidad Build ..................... SKIPPED
[INFO] Apache MyFaces Trinidad API ....................... SKIPPED
[INFO] Apache MyFaces Trinidad Impl ...................... SKIPPED
[INFO] Apache MyFaces Trinidad Examples .................. SKIPPED
[INFO] Apache MyFaces Trinidad Blank Demo ................ SKIPPED
[INFO] Apache MyFaces Trinidad Demo ...................... SKIPPED
[INFO] Apache MyFaces Trinidad Components Showcase ....... SKIPPED
[INFO] ------------------------------------------------------------------------
[INFO] BUILD FAILURE
[INFO] ------------------------------------------------------------------------
[INFO] Total time: 5:02.305s
[INFO] Finished at: Sun Nov 03 16:28:57 UTC 2013
[INFO] Final Memory: 7M/490M
[INFO] ------------------------------------------------------------------------
Waiting for Jenkins to finish collecting data[ERROR] Plugin org.apache.myfaces.trinidadbuild:maven-xrts-plugin:2.0.8-SNAPSHOT
or one of its dependencies could not be resolved: Failed to read artifact descriptor for org.apache.myfaces.trinidadbuild:maven-xrts-plugin:jar:2.0.8-SNAPSHOT:
Could not find artifact org.apache.myfaces.trinidadbuild:maven-xrts-plugin:pom:2.0.8-SNAPSHOT
-> [Help 1]
[ERROR] 
[ERROR] To see the full stack trace of the errors, re-run Maven with the -e switch.
[ERROR] Re-run Maven using the -X switch to enable full debug logging.
[ERROR] 
[ERROR] For more information about the errors and possible solutions, please read the following
articles:
[ERROR] [Help 1] http://cwiki.apache.org/confluence/display/MAVEN/PluginResolutionException

[JENKINS] Archiving <https://builds.apache.org/job/Trinidad%20Core%202.0.x%20(sanity)/ws/trinidad-examples/trinidad-demo/pom.xml>
to org.apache.myfaces.trinidad/trinidad-demo/2.0.2-SNAPSHOT/trinidad-demo-2.0.2-SNAPSHOT.pom
[JENKINS] Archiving <https://builds.apache.org/job/Trinidad%20Core%202.0.x%20(sanity)/ws/trinidad-build/pom.xml>
to org.apache.myfaces.trinidad/trinidad-build/2.0.2-SNAPSHOT/trinidad-build-2.0.2-SNAPSHOT.pom
[JENKINS] Archiving <https://builds.apache.org/job/Trinidad%20Core%202.0.x%20(sanity)/ws/trinidad-examples/trinidad-components-showcase/pom.xml>
to org.apache.myfaces.trinidad/trinidad-components-showcase/2.0.2-SNAPSHOT/trinidad-components-showcase-2.0.2-SNAPSHOT.pom
[JENKINS] Archiving <https://builds.apache.org/job/Trinidad%20Core%202.0.x%20(sanity)/ws/pom.xml>
to org.apache.myfaces.trinidad/trinidad/2.0.2-SNAPSHOT/trinidad-2.0.2-SNAPSHOT.pom
[JENKINS] Archiving <https://builds.apache.org/job/Trinidad%20Core%202.0.x%20(sanity)/ws/trinidad-examples/pom.xml>
to org.apache.myfaces.trinidad/trinidad-example/2.0.2-SNAPSHOT/trinidad-example-2.0.2-SNAPSHOT.pom
[JENKINS] Archiving <https://builds.apache.org/job/Trinidad%20Core%202.0.x%20(sanity)/ws/trinidad-api/pom.xml>
to org.apache.myfaces.trinidad/trinidad-api/2.0.2-SNAPSHOT/trinidad-api-2.0.2-SNAPSHOT.pom
[JENKINS] Archiving <https://builds.apache.org/job/Trinidad%20Core%202.0.x%20(sanity)/ws/trinidad-examples/trinidad-blank/pom.xml>
to org.apache.myfaces.trinidad/trinidad-blank/2.0.2-SNAPSHOT/trinidad-blank-2.0.2-SNAPSHOT.pom
[JENKINS] Archiving <https://builds.apache.org/job/Trinidad%20Core%202.0.x%20(sanity)/ws/trinidad-impl/pom.xml>
to org.apache.myfaces.trinidad/trinidad-impl/2.0.2-SNAPSHOT/trinidad-impl-2.0.2-SNAPSHOT.pom
Sending e-mails to: commits@myfaces.apache.org null@apache.org darkarena@gmail.com
channel stopped

Mime
View raw message