myfaces-commits mailing list archives

Site index · List index
Message view « Date » · « Thread »
Top « Date » · « Thread »
From Apache Jenkins Server <jenk...@builds.apache.org>
Subject Build failed in Jenkins: Myfaces-Orchestra #1240
Date Fri, 01 Nov 2013 16:47:11 GMT
See <https://builds.apache.org/job/Myfaces-Orchestra/1240/>

------------------------------------------
[...truncated 424 lines...]
Nov 1, 2013 4:04:41 PM org.apache.myfaces.orchestra.conversation.MockAdvice invoke
INFO: after: Conversation Method
Nov 1, 2013 4:04:41 PM org.apache.myfaces.orchestra.conversation.MockAdvice invoke
INFO: before:Conversation Method
Nov 1, 2013 4:04:41 PM org.apache.myfaces.orchestra.conversation.MockAdvice invoke
INFO: after: Conversation Method
Nov 1, 2013 4:04:41 PM org.apache.myfaces.orchestra.conversation.MockAdvice invoke
INFO: before:Conversation Method
Nov 1, 2013 4:04:41 PM org.apache.myfaces.orchestra.conversation.MockAdvice invoke
INFO: before:Invoking
Nov 1, 2013 4:04:41 PM org.apache.myfaces.orchestra.conversation.MockAdvice invoke
INFO: after: Invoking
Nov 1, 2013 4:04:41 PM org.apache.myfaces.orchestra.conversation.MockAdvice invoke
INFO: after: Conversation Method
Nov 1, 2013 4:04:41 PM org.apache.myfaces.orchestra.conversation.MockAdvice invoke
INFO: before:Conversation Method
Nov 1, 2013 4:04:41 PM org.apache.myfaces.orchestra.conversation.MockAdvice invoke
INFO: before:Invoking
Nov 1, 2013 4:04:41 PM org.apache.myfaces.orchestra.conversation.MockAdvice invoke
INFO: after: Invoking
Nov 1, 2013 4:04:41 PM org.apache.myfaces.orchestra.conversation.MockAdvice invoke
INFO: after: Conversation Method
Tests run: 2, Failures: 0, Errors: 0, Skipped: 0, Time elapsed: 0.044 sec
Running org.apache.myfaces.orchestra.requestParameterProvider.TestRequestParameterProviderManager
Tests run: 1, Failures: 0, Errors: 0, Skipped: 0, Time elapsed: 0 sec
Running org.apache.myfaces.orchestra.viewController.TestDefaultViewControllerNameMapper
Tests run: 1, Failures: 0, Errors: 0, Skipped: 0, Time elapsed: 0 sec
Running org.apache.myfaces.orchestra.viewController.TestInterfaceViewControllerExecutor
Tests run: 1, Failures: 0, Errors: 0, Skipped: 0, Time elapsed: 0 sec
Running org.apache.myfaces.orchestra.viewController.TestReflectiveViewControllerExecutor
Tests run: 1, Failures: 0, Errors: 0, Skipped: 0, Time elapsed: 0 sec
Nov 1, 2013 4:04:41 PM org.springframework.context.support.AbstractApplicationContext doClose
INFO: Closing org.springframework.context.support.GenericApplicationContext@13a317a: display
name [org.springframework.context.support.GenericApplicationContext@13a317a]; startup date
[Fri Nov 01 16:04:35 GMT+00:00 2013]; root of context hierarchy
Nov 1, 2013 4:04:41 PM org.springframework.context.support.AbstractApplicationContext doClose
INFO: Closing org.springframework.context.support.GenericApplicationContext@1684706: display
name [org.springframework.context.support.GenericApplicationContext@1684706]; startup date
[Fri Nov 01 16:04:37 GMT+00:00 2013]; root of context hierarchy
Nov 1, 2013 4:04:41 PM org.springframework.beans.factory.support.DefaultSingletonBeanRegistry
destroySingletons
INFO: Destroying singletons in org.springframework.beans.factory.support.DefaultListableBeanFactory@18941f7:
defining beans [org.springframework.beans.factory.config.CustomScopeConfigurer,statelessConverter,statefulConverter];
root of factory hierarchy
Nov 1, 2013 4:04:41 PM org.springframework.context.support.AbstractApplicationContext doClose
INFO: Closing org.springframework.context.support.GenericApplicationContext@84f566: display
name [org.springframework.context.support.GenericApplicationContext@84f566]; startup date
[Fri Nov 01 16:04:40 GMT+00:00 2013]; root of context hierarchy
Nov 1, 2013 4:04:41 PM org.springframework.beans.factory.support.DefaultSingletonBeanRegistry
destroySingletons
INFO: Destroying singletons in org.springframework.beans.factory.support.DefaultListableBeanFactory@1dacccc:
defining beans [org.springframework.beans.factory.config.CustomScopeConfigurer,persistentContextConversationInterceptor,persistentContextFactory,org.springframework.orm.jpa.support.PersistenceAnnotationBeanPostProcessor,org.springframework.aop.config.internalAutoProxyCreator,org.springframework.transaction.interceptor.TransactionAttributeSourceAdvisor,transactionManager,entityManagerFactory,scopedTarget.persistentBackingBean,persistentBackingBean,scopedTarget.dummyBean,dummyBean];
root of factory hierarchy
Nov 1, 2013 4:04:41 PM org.springframework.context.support.AbstractApplicationContext doClose
INFO: Closing org.springframework.context.support.GenericApplicationContext@1f01a29: display
name [org.springframework.context.support.GenericApplicationContext@1f01a29]; startup date
[Fri Nov 01 16:04:36 GMT+00:00 2013]; root of context hierarchy
[TopLink Config]: 2013.11.01 04:04:41.114--ServerSession(1680250)--Connection(11872808)--Thread(Thread[Thread-4,5,main])--disconnect
[TopLink Info]: 2013.11.01 04:04:41.115--ServerSession(1680250)--Thread(Thread[Thread-4,5,main])--<https://builds.apache.org/job/Myfaces-Orchestra/ws/trunk/core/target/test-classes-default>
logout successful
[TopLink Config]: 2013.11.01 04:04:41.116--ServerSession(1680250)--Connection(33093832)--Thread(Thread[Thread-4,5,main])--disconnect
[TopLink Config]: 2013.11.01 04:04:41.117--ServerSession(1680250)--Connection(2746929)--Thread(Thread[Thread-4,5,main])--disconnect
[TopLink Config]: 2013.11.01 04:04:41.117--ServerSession(1680250)--Connection(29819669)--Thread(Thread[Thread-4,5,main])--disconnect
[TopLink Config]: 2013.11.01 04:04:41.117--ServerSession(1680250)--Connection(20364762)--Thread(Thread[Thread-4,5,main])--disconnect
[TopLink Config]: 2013.11.01 04:04:41.118--ServerSession(1680250)--Connection(5316106)--Thread(Thread[Thread-4,5,main])--disconnect
[TopLink Config]: 2013.11.01 04:04:41.119--ServerSession(1680250)--Connection(683317)--Thread(Thread[Thread-4,5,main])--disconnect
[TopLink Config]: 2013.11.01 04:04:41.120--ServerSession(1680250)--Connection(15911276)--Thread(Thread[Thread-4,5,main])--disconnect

Results :

Tests run: 15, Failures: 0, Errors: 0, Skipped: 0

[INFO] [jar:jar {execution: default-jar}]
[INFO] Building jar: <https://builds.apache.org/job/Myfaces-Orchestra/ws/trunk/core/target/myfaces-orchestra-core-1.6-SNAPSHOT.jar>
[INFO] Preparing source:jar
[WARNING] Removing: jar from forked lifecycle, to prevent recursive invocation.
[WARNING] DEPRECATED [tasks]: Use target instead
[INFO] [antrun:run {execution: javadoc.resources}]
[WARNING] Parameter tasks is deprecated, use target instead
[INFO] Executing tasks

main:
[INFO] Executed tasks
[INFO] [build-helper:add-source {execution: add-source}]
[INFO] Source directory: <https://builds.apache.org/job/Myfaces-Orchestra/ws/trunk/core/target/shared_sources>
added.
ERROR: Could not find local repository for 2.2.1
[INFO] [source:jar {execution: attach-source}]
[INFO] META-INF already added, skipping
[INFO] org already added, skipping
[INFO] org/apache already added, skipping
[INFO] org/apache/myfaces already added, skipping
[INFO] org already added, skipping
[INFO] org/apache already added, skipping
[INFO] org/apache/myfaces already added, skipping
[INFO] org/apache/myfaces/orchestra already added, skipping
[INFO] META-INF already added, skipping
[INFO] META-INF already added, skipping
[INFO] META-INF/NOTICE already added, skipping
[INFO] META-INF/LICENSE already added, skipping
[INFO] META-INF/DEPENDENCIES already added, skipping
[INFO] Building jar: <https://builds.apache.org/job/Myfaces-Orchestra/ws/trunk/core/target/myfaces-orchestra-core-1.6-SNAPSHOT-sources.jar>
[INFO] META-INF already added, skipping
[INFO] org already added, skipping
[INFO] org/apache already added, skipping
[INFO] org/apache/myfaces already added, skipping
[INFO] org already added, skipping
[INFO] org/apache already added, skipping
[INFO] org/apache/myfaces already added, skipping
[INFO] org/apache/myfaces/orchestra already added, skipping
[INFO] META-INF already added, skipping
[INFO] META-INF already added, skipping
[INFO] META-INF/NOTICE already added, skipping
[INFO] META-INF/LICENSE already added, skipping
[INFO] META-INF/DEPENDENCIES already added, skipping
[INFO] [checkstyle:check {execution: verify-style}]
[INFO] 
[INFO] [install:install {execution: default-install}]
[INFO] Installing <https://builds.apache.org/job/Myfaces-Orchestra/ws/trunk/core/target/myfaces-orchestra-core-1.6-SNAPSHOT.jar>
to /export/home/hudson/hudson-slave/maven-repositories/0/org/apache/myfaces/orchestra/myfaces-orchestra-core/1.6-SNAPSHOT/myfaces-orchestra-core-1.6-SNAPSHOT.jar
[INFO] Installing <https://builds.apache.org/job/Myfaces-Orchestra/ws/trunk/core/target/myfaces-orchestra-core-1.6-SNAPSHOT-sources.jar>
to /export/home/hudson/hudson-slave/maven-repositories/0/org/apache/myfaces/orchestra/myfaces-orchestra-core/1.6-SNAPSHOT/myfaces-orchestra-core-1.6-SNAPSHOT-sources.jar
[WARNING] DEPRECATED [tasks]: Use target instead
[INFO] [antrun:run {execution: javadoc.resources}]
[WARNING] Parameter tasks is deprecated, use target instead
[INFO] Executing tasks

main:
[INFO] Executed tasks
[INFO] [build-helper:add-source {execution: add-source}]
[INFO] Source directory: <https://builds.apache.org/job/Myfaces-Orchestra/ws/trunk/core/target/shared_sources>
added.
[INFO] [dependency:unpack {execution: unpack-shared-impl-sources}]
[INFO] Configured Artifact: org.apache.myfaces.shared:myfaces-shared-orchestra:sources:2.0.13:jar
[INFO] Unpacking /export/home/hudson/hudson-slave/maven-repositories/0/org/apache/myfaces/shared/myfaces-shared-orchestra/2.0.13/myfaces-shared-orchestra-2.0.13-sources.jar
to <https://builds.apache.org/job/Myfaces-Orchestra/ws/trunk/core/target/shared_sources>
with includes "" and excludes "META-INF/*"
[INFO] [xslt:transform {execution: default}]
[INFO] # of XML files: 1
[INFO] file up-to-date: <https://builds.apache.org/job/Myfaces-Orchestra/ws/trunk/core/target/classes/META-INF/myfaces_orchestra.tld>
[INFO] [remote-resources:process {execution: default}]
[debug] execute contextualize
[INFO] [resources:resources {execution: default-resources}]
[INFO] Using 'UTF-8' encoding to copy filtered resources.
[INFO] Copying 2 resources to META-INF
[INFO] Copying 6 resources
[INFO] Copying 3 resources
[INFO] Copying 3 resources
[INFO] [compiler:compile {execution: default-compile}]
[INFO] Nothing to compile - all classes are up to date
[debug] execute contextualize
[INFO] [resources:testResources {execution: default-testResources}]
[INFO] Using 'UTF-8' encoding to copy filtered resources.
[INFO] Copying 6 resources
[INFO] Copying 3 resources
[INFO] Copying 3 resources
[INFO] [compiler:testCompile {execution: default-testCompile}]
[INFO] Nothing to compile - all classes are up to date
[INFO] [surefire:test {execution: default-test}]
[INFO] Skipping execution of surefire because it has already been run for this configuration
[JENKINS] Recording test results
[INFO] [jar:jar {execution: default-jar}]
[INFO] Building jar: <https://builds.apache.org/job/Myfaces-Orchestra/ws/trunk/core/target/myfaces-orchestra-core-1.6-SNAPSHOT.jar>
[INFO] Preparing source:jar
[WARNING] Removing: jar from forked lifecycle, to prevent recursive invocation.
[WARNING] DEPRECATED [tasks]: Use target instead
[INFO] [antrun:run {execution: javadoc.resources}]
[WARNING] Parameter tasks is deprecated, use target instead
[INFO] Executing tasks

main:
[INFO] Executed tasks
[INFO] [build-helper:add-source {execution: add-source}]
[INFO] Source directory: <https://builds.apache.org/job/Myfaces-Orchestra/ws/trunk/core/target/shared_sources>
added.
ERROR: Could not find local repository for 2.2.1
[INFO] [source:jar {execution: attach-source}]
[INFO] META-INF already added, skipping
[INFO] META-INF/NOTICE already added, skipping
[INFO] META-INF/LICENSE already added, skipping
[INFO] META-INF/DEPENDENCIES already added, skipping
[INFO] META-INF already added, skipping
[INFO] org already added, skipping
[INFO] org/apache already added, skipping
[INFO] org/apache/myfaces already added, skipping
[INFO] org already added, skipping
[INFO] org/apache already added, skipping
[INFO] org/apache/myfaces already added, skipping
[INFO] org/apache/myfaces/orchestra already added, skipping
[INFO] META-INF already added, skipping
[INFO] META-INF already added, skipping
[INFO] META-INF/NOTICE already added, skipping
[INFO] META-INF/LICENSE already added, skipping
[INFO] META-INF/DEPENDENCIES already added, skipping
[INFO] META-INF already added, skipping
[INFO] META-INF/NOTICE already added, skipping
[INFO] META-INF/LICENSE already added, skipping
[INFO] META-INF/DEPENDENCIES already added, skipping
[INFO] Building jar: <https://builds.apache.org/job/Myfaces-Orchestra/ws/trunk/core/target/myfaces-orchestra-core-1.6-SNAPSHOT-sources.jar>
[INFO] META-INF already added, skipping
[INFO] META-INF/NOTICE already added, skipping
[INFO] META-INF/LICENSE already added, skipping
[INFO] META-INF/DEPENDENCIES already added, skipping
[INFO] META-INF already added, skipping
[INFO] org already added, skipping
[INFO] org/apache already added, skipping
[INFO] org/apache/myfaces already added, skipping
[INFO] org already added, skipping
[INFO] org/apache already added, skipping
[INFO] org/apache/myfaces already added, skipping
[INFO] org/apache/myfaces/orchestra already added, skipping
[INFO] META-INF already added, skipping
[INFO] META-INF already added, skipping
[INFO] META-INF/NOTICE already added, skipping
[INFO] META-INF/LICENSE already added, skipping
[INFO] META-INF/DEPENDENCIES already added, skipping
[INFO] META-INF already added, skipping
[INFO] META-INF/NOTICE already added, skipping
[INFO] META-INF/LICENSE already added, skipping
[INFO] META-INF/DEPENDENCIES already added, skipping
[INFO] [checkstyle:check {execution: verify-style}]
[INFO] 
[INFO] [install:install {execution: default-install}]
[INFO] Installing <https://builds.apache.org/job/Myfaces-Orchestra/ws/trunk/core/target/myfaces-orchestra-core-1.6-SNAPSHOT.jar>
to /export/home/hudson/hudson-slave/maven-repositories/0/org/apache/myfaces/orchestra/myfaces-orchestra-core/1.6-SNAPSHOT/myfaces-orchestra-core-1.6-SNAPSHOT.jar
[INFO] Installing <https://builds.apache.org/job/Myfaces-Orchestra/ws/trunk/core/target/myfaces-orchestra-core-1.6-SNAPSHOT-sources.jar>
to /export/home/hudson/hudson-slave/maven-repositories/0/org/apache/myfaces/orchestra/myfaces-orchestra-core/1.6-SNAPSHOT/myfaces-orchestra-core-1.6-SNAPSHOT-sources.jar
[INFO] Installing <https://builds.apache.org/job/Myfaces-Orchestra/ws/trunk/core/target/myfaces-orchestra-core-1.6-SNAPSHOT-sources.jar>
to /export/home/hudson/hudson-slave/maven-repositories/0/org/apache/myfaces/orchestra/myfaces-orchestra-core/1.6-SNAPSHOT/myfaces-orchestra-core-1.6-SNAPSHOT-sources.jar
[INFO] [deploy:deploy {execution: default-deploy}]
[INFO] Retrieving previous build number from apache.snapshots.https
[WARNING] *** CHECKSUM FAILED - Checksum failed on download: local = '139e1b47efea43d823b9282221ab2bd6ba1984ce';
remote = '83a070dbcae0cff8279ee22778cb92454785fb65' - RETRYING
[WARNING] *** CHECKSUM FAILED - Checksum failed on download: local = '139e1b47efea43d823b9282221ab2bd6ba1984ce';
remote = '83a070dbcae0cff8279ee22778cb92454785fb65' - IGNORING
Uploading: https://repository.apache.org/content/repositories/snapshots/org/apache/myfaces/orchestra/myfaces-orchestra-core/1.6-SNAPSHOT/myfaces-orchestra-core-1.6-20131101.155757-2223.jar
405K uploaded  (myfaces-orchestra-core-1.6-20131101.155757-2223.jar)
[INFO] Retrieving previous metadata from apache.snapshots.https
[INFO] Uploading repository metadata for: 'artifact org.apache.myfaces.orchestra:myfaces-orchestra-core'
[INFO] Uploading project information for myfaces-orchestra-core 1.6-20131101.155757-2223
[INFO] Retrieving previous metadata from apache.snapshots.https
[WARNING] *** CHECKSUM FAILED - Checksum failed on download: local = '139e1b47efea43d823b9282221ab2bd6ba1984ce';
remote = '83a070dbcae0cff8279ee22778cb92454785fb65' - RETRYING
[WARNING] *** CHECKSUM FAILED - Checksum failed on download: local = '139e1b47efea43d823b9282221ab2bd6ba1984ce';
remote = '83a070dbcae0cff8279ee22778cb92454785fb65' - IGNORING
[INFO] Uploading repository metadata for: 'snapshot org.apache.myfaces.orchestra:myfaces-orchestra-core:1.6-SNAPSHOT'
[INFO] Retrieving previous build number from apache.snapshots.https
Uploading: https://repository.apache.org/content/repositories/snapshots/org/apache/myfaces/orchestra/myfaces-orchestra-core/1.6-SNAPSHOT/myfaces-orchestra-core-1.6-20131101.155757-2223-sources.jar
466K uploaded  (myfaces-orchestra-core-1.6-20131101.155757-2223-sources.jar)
[INFO] Retrieving previous build number from apache.snapshots.https
Uploading: https://repository.apache.org/content/repositories/snapshots/org/apache/myfaces/orchestra/myfaces-orchestra-core/1.6-SNAPSHOT/myfaces-orchestra-core-1.6-20131101.155757-2223-sources.jar
466K uploaded  (myfaces-orchestra-core-1.6-20131101.155757-2223-sources.jar)
Build timed out (after 60 minutes). Marking the build as failed.
[INFO] ------------------------------------------------------------------------
[ERROR] FATAL ERROR
[INFO] ------------------------------------------------------------------------
[INFO] Unable to call setResult. Invalid object ID 9
[INFO] ------------------------------------------------------------------------
[INFO] Trace
java.lang.IllegalStateException: Unable to call setResult. Invalid object ID 9
	at hudson.remoting.RemoteInvocationHandler$RPCRequest.perform(RemoteInvocationHandler.java:293)
	at hudson.remoting.RemoteInvocationHandler$RPCRequest.call(RemoteInvocationHandler.java:280)
	at hudson.remoting.RemoteInvocationHandler$RPCRequest.call(RemoteInvocationHandler.java:239)
	at hudson.remoting.UserRequest.perform(UserRequest.java:118)
	at hudson.remoting.UserRequest.perform(UserRequest.java:48)
	at hudson.remoting.Request$2.run(Request.java:326)
	at hudson.remoting.InterceptingExecutorService$1.call(InterceptingExecutorService.java:72)
	at java.util.concurrent.FutureTask$Sync.innerRun(FutureTask.java:334)
	at java.util.concurrent.FutureTask.run(FutureTask.java:166)
	at java.util.concurrent.ThreadPoolExecutor.runWorker(ThreadPoolExecutor.java:1145)
	at java.util.concurrent.ThreadPoolExecutor$Worker.run(ThreadPoolExecutor.java:615)
	at java.lang.Thread.run(Thread.java:724)
[INFO] ------------------------------------------------------------------------
[INFO] Total time: 47 minutes 43 seconds
[INFO] Finished at: Fri Nov 01 16:31:11 GMT+00:00 2013
[INFO] Final Memory: 75M/422M
[INFO] ------------------------------------------------------------------------
channel stopped

Mime
View raw message