myfaces-commits mailing list archives

Site index · List index
Message view « Date » · « Thread »
Top « Date » · « Thread »
From Apache Jenkins Server <jenk...@builds.apache.org>
Subject Build failed in Jenkins: myfaces-current21 #2056
Date Tue, 10 Dec 2013 14:39:27 GMT
See <https://builds.apache.org/job/myfaces-current21/2056/>

------------------------------------------
[...truncated 3884 lines...]
[INFO] generated file myfaces_facelets_core.tld is up to date
[INFO] [myfaces-builder:make-config {execution: make_html_facelet_tld}]
[INFO] generated file myfaces_facelets_html.tld is up to date
[INFO] [myfaces-builder:make-config {execution: make_c_facelet_tld}]
[INFO] generated file myfaces_facelets_c.tld is up to date
[INFO] [myfaces-builder:make-config {execution: make_ui_facelet_tld}]
[INFO] generated file myfaces_facelets_ui.tld is up to date
[INFO] [myfaces-builder:make-config {execution: make_composite_facelet_tld}]
[INFO] generated file myfaces_facelets_composite.tld is up to date
[INFO] [myfaces-builder:make-config {execution: make_fn_facelet_tld}]
[INFO] generated file myfaces_facelet_fn.tld is up to date
[INFO] [myfaces-builder:make-config {execution: make_core_facelet_xsd}]
[INFO] generated file myfaces_facelets_core_2_1.xsd is up to date
[INFO] [myfaces-builder:make-config {execution: make_html_facelet_xsd}]
[INFO] generated file myfaces_facelets_html_2_1.xsd is up to date
[INFO] [myfaces-builder:make-config {execution: make_c_facelet_xsd}]
[INFO] generated file myfaces_facelets_c_2_1.xsd is up to date
[INFO] [myfaces-builder:make-config {execution: make_ui_facelet_xsd}]
[INFO] generated file myfaces_facelets_ui_2_1.xsd is up to date
[INFO] [myfaces-builder:make-config {execution: make_composite_facelet_xsd}]
[INFO] generated file myfaces_facelets_composite_2_1.xsd is up to date
ERROR: Could not find local repository for 2.2.1
[INFO] [source:jar {execution: attach-source}]
[INFO] Building jar: <https://builds.apache.org/job/myfaces-current21/ws/current21/core/impl/target/myfaces-impl-2.1.14-SNAPSHOT-sources.jar>
[INFO] [jar:test-jar {execution: default}]
[INFO] Building jar: <https://builds.apache.org/job/myfaces-current21/ws/current21/core/impl/target/myfaces-impl-2.1.14-SNAPSHOT-tests.jar>
[INFO] [shade:shade {execution: default}]
[INFO] Excluding org.apache.myfaces.core:myfaces-api:jar:2.1.14-SNAPSHOT from the shaded jar.
[INFO] Excluding org.apache.myfaces.core.internal:myfaces-impl-shared-public:jar:2.1.14-SNAPSHOT
from the shaded jar.
[INFO] Excluding commons-codec:commons-codec:jar:1.3 from the shaded jar.
[INFO] Including org.apache.myfaces.core.internal:myfaces-impl-shared:jar:2.1.14-SNAPSHOT
in the shaded jar.
[INFO] snapshot org.apache.myfaces.core.internal:myfaces-impl-shared:2.1.14-SNAPSHOT: checking
for updates from tomcat
[INFO] snapshot org.apache.myfaces.core.internal:myfaces-impl-shared:2.1.14-SNAPSHOT: checking
for updates from apache.snapshots
[INFO] Excluding org.apache.geronimo.specs:geronimo-validation_1.0_spec:jar:1.1 from the shaded
jar.
[INFO] Excluding org.apache.geronimo.specs:geronimo-jpa_3.0_spec:jar:1.1.1 from the shaded
jar.
[INFO] Excluding org.apache.geronimo.specs:geronimo-ejb_3.0_spec:jar:1.0.1 from the shaded
jar.
[INFO] Excluding commons-collections:commons-collections:jar:3.2 from the shaded jar.
[INFO] Excluding commons-beanutils:commons-beanutils:jar:1.8.3 from the shaded jar.
[INFO] Excluding commons-logging:commons-logging:jar:1.1.1 from the shaded jar.
[INFO] Excluding commons-digester:commons-digester:jar:1.8 from the shaded jar.
[INFO] Excluding org.apache.tomcat:catalina:jar:6.0.29 from the shaded jar.
[INFO] Excluding org.apache.tomcat:servlet-api:jar:6.0.29 from the shaded jar.
[INFO] Excluding org.apache.tomcat:juli:jar:6.0.29 from the shaded jar.
[INFO] Excluding org.apache.tomcat:annotations-api:jar:6.0.29 from the shaded jar.
[INFO] Excluding org.apache.tomcat:tomcat-catalina:jar:7.0.0 from the shaded jar.
[INFO] Excluding org.apache.tomcat:tomcat-servlet-api:jar:7.0.0 from the shaded jar.
[INFO] Excluding org.apache.tomcat:tomcat-juli:jar:7.0.0 from the shaded jar.
[INFO] Excluding org.apache.tomcat:tomcat-annotations-api:jar:7.0.0 from the shaded jar.
[INFO] Excluding org.apache.tomcat:tomcat-api:jar:7.0.0 from the shaded jar.
[INFO] Excluding org.apache.tomcat:tomcat-util:jar:7.0.0 from the shaded jar.
[INFO] Excluding com.google.code.guice:guice:jar:1.0 from the shaded jar.
[INFO] Replacing original artifact with shaded artifact.
[INFO] Replacing <https://builds.apache.org/job/myfaces-current21/ws/current21/core/impl/target/myfaces-impl-2.1.14-SNAPSHOT.jar>
with <https://builds.apache.org/job/myfaces-current21/ws/current21/core/impl/target/myfaces-impl-2.1.14-SNAPSHOT-shaded.jar>
[INFO] Replacing <https://builds.apache.org/job/myfaces-current21/ws/current21/core/impl/target/myfaces-impl-2.1.14-SNAPSHOT-sources.jar>
with <https://builds.apache.org/job/myfaces-current21/ws/current21/core/impl/target/myfaces-impl-2.1.14-SNAPSHOT-shaded-sources.jar>
[INFO] [checkstyle:check {execution: verify-style}]
[INFO] 
[INFO] [install:install {execution: default-install}]
[INFO] Installing <https://builds.apache.org/job/myfaces-current21/ws/current21/core/impl/target/myfaces-impl-2.1.14-SNAPSHOT.jar>
to /home/jenkins/jenkins-slave/maven-repositories/0/org/apache/myfaces/core/myfaces-impl/2.1.14-SNAPSHOT/myfaces-impl-2.1.14-SNAPSHOT.jar
[INFO] Installing <https://builds.apache.org/job/myfaces-current21/ws/current21/core/impl/target/myfaces-impl-2.1.14-SNAPSHOT-sources.jar>
to /home/jenkins/jenkins-slave/maven-repositories/0/org/apache/myfaces/core/myfaces-impl/2.1.14-SNAPSHOT/myfaces-impl-2.1.14-SNAPSHOT-sources.jar
[INFO] Installing <https://builds.apache.org/job/myfaces-current21/ws/current21/core/impl/target/myfaces-impl-2.1.14-SNAPSHOT-tests.jar>
to /home/jenkins/jenkins-slave/maven-repositories/0/org/apache/myfaces/core/myfaces-impl/2.1.14-SNAPSHOT/myfaces-impl-2.1.14-SNAPSHOT-tests.jar
[INFO] Installing <https://builds.apache.org/job/myfaces-current21/ws/current21/core/impl/target/myfaces-impl-2.1.14-SNAPSHOT-sources.jar>
to /home/jenkins/jenkins-slave/maven-repositories/0/org/apache/myfaces/core/myfaces-impl/2.1.14-SNAPSHOT/myfaces-impl-2.1.14-SNAPSHOT-sources.jar
[INFO] ------------------------------------------------------------------------
[INFO] Building Apache MyFaces JSF-2.1 Core OSGi Bundle
[INFO]    task-segment: [install]
[INFO] ------------------------------------------------------------------------
[INFO] [remote-resources:process {execution: default}]
[JENKINS] Recording test results[debug] execute contextualize

[INFO] [resources:resources {execution: default-resources}]
[INFO] Using 'UTF-8' encoding to copy filtered resources.
[INFO] skip non existing resourceDirectory <https://builds.apache.org/job/myfaces-current21/ws/current21/core/bundle/src/main/resources>
[INFO] Copying 3 resources
[INFO] [compiler:compile {execution: default-compile}]
[INFO] No sources to compile
[debug] execute contextualize
[INFO] [resources:testResources {execution: default-testResources}]
[INFO] Using 'UTF-8' encoding to copy filtered resources.
[INFO] skip non existing resourceDirectory <https://builds.apache.org/job/myfaces-current21/ws/current21/core/bundle/src/test/resources>
[INFO] Copying 3 resources
[INFO] [compiler:testCompile {execution: default-testCompile}]
[INFO] No sources to compile
[INFO] [surefire:test {execution: default-test}]
[INFO] Surefire report directory: <https://builds.apache.org/job/myfaces-current21/ws/current21/core/bundle/target/surefire-reports>

-------------------------------------------------------
 T E S T S
-------------------------------------------------------

Results :

Tests run: 0, Failures: 0, Errors: 0, Skipped: 0

[INFO] [bundle:bundle {execution: default-bundle}]
[INFO] Preparing source:jar
[WARNING] Removing: jar from forked lifecycle, to prevent recursive invocation.
[INFO] No goals needed for project - skipping
[INFO] [source:jar {execution: attach-source}]
[INFO] Building jar: <https://builds.apache.org/job/myfaces-current21/ws/current21/core/bundle/target/myfaces-bundle-2.1.14-SNAPSHOT-sources.jar>
[INFO] [checkstyle:check {execution: verify-style}]
[INFO] 
[INFO] [install:install {execution: default-install}]
[INFO] Installing <https://builds.apache.org/job/myfaces-current21/ws/current21/core/bundle/target/myfaces-bundle-2.1.14-SNAPSHOT.jar>
to /home/jenkins/jenkins-slave/maven-repositories/0/org/apache/myfaces/core/myfaces-bundle/2.1.14-SNAPSHOT/myfaces-bundle-2.1.14-SNAPSHOT.jar
[INFO] Installing <https://builds.apache.org/job/myfaces-current21/ws/current21/core/bundle/target/myfaces-bundle-2.1.14-SNAPSHOT-sources.jar>
to /home/jenkins/jenkins-slave/maven-repositories/0/org/apache/myfaces/core/myfaces-bundle/2.1.14-SNAPSHOT/myfaces-bundle-2.1.14-SNAPSHOT-sources.jar
[INFO] [bundle:install {execution: default-install}]
[INFO] Installing org/apache/myfaces/core/myfaces-bundle/2.1.14-SNAPSHOT/myfaces-bundle-2.1.14-SNAPSHOT.jar
[INFO] Writing OBR metadata
[INFO] ------------------------------------------------------------------------
[INFO] Building Apache MyFaces JSF-2.1 Core Module
[INFO]    task-segment: [install]
[INFO] ------------------------------------------------------------------------
[INFO] [remote-resources:process {execution: default}]
[INFO] [site:attach-descriptor {execution: default-attach-descriptor}]
[INFO] [checkstyle:check {execution: verify-style}]
[INFO] 
[INFO] [install:install {execution: default-install}]
[INFO] Installing <https://builds.apache.org/job/myfaces-current21/ws/current21/core/pom.xml>
to /home/jenkins/jenkins-slave/maven-repositories/0/org/apache/myfaces/core/myfaces-core-module/2.1.14-SNAPSHOT/myfaces-core-module-2.1.14-SNAPSHOT.pom
[INFO] ------------------------------------------------------------------------
[INFO] Building Apache MyFaces Composite Build
[INFO]    task-segment: [install]
[INFO] ------------------------------------------------------------------------
[INFO] [remote-resources:process {execution: default}]
[INFO] [site:attach-descriptor {execution: default-attach-descriptor}]
[INFO] [checkstyle:check {execution: verify-style}]
[INFO] 
[INFO] [install:install {execution: default-install}]
[INFO] Installing <https://builds.apache.org/job/myfaces-current21/ws/current21/pom.xml>
to /home/jenkins/jenkins-slave/maven-repositories/0/org/apache/myfaces/myfaces-base/2.1.0-SNAPSHOT/myfaces-base-2.1.0-SNAPSHOT.pom
[INFO] 
[INFO] 
[INFO] ------------------------------------------------------------------------
[INFO] Reactor Summary:
[INFO] ------------------------------------------------------------------------
[INFO] Apache MyFaces JSF-2.1 Core Project ................... SUCCESS [29.976s]
[INFO] Apache MyFaces JSF-2.1 Core API ....................... SUCCESS [1:47.363s]
[INFO] Apache MyFaces Shared For JSF 2.1 - Project ........... SUCCESS [37.504s]
[INFO] Apache MyFaces Shared For JSF 2.1 - Core Mirror ....... SUCCESS [43.596s]
[INFO] MyFaces Shared Tomahawk ............................... SUCCESS [52.124s]
[INFO] Apache MyFaces Shared Public API For JSF 2.1 - Core ... SUCCESS [42.641s]
[INFO] Apache MyFaces Core For JSF 2.1 - Shared .............. SUCCESS [1:16.604s]
[INFO] Apache MyFaces JSF-2.1 Core Impl ...................... SUCCESS [3:55.076s]
[INFO] Apache MyFaces JSF-2.1 Core OSGi Bundle ............... SUCCESS [36.630s]
[INFO] Apache MyFaces JSF-2.1 Core Module .................... SUCCESS [19.623s]
[INFO] Apache MyFaces Composite Build ........................ SUCCESS [21.984s]
[INFO] ------------------------------------------------------------------------
[INFO] ------------------------------------------------------------------------
[INFO] BUILD SUCCESSFUL
[INFO] ------------------------------------------------------------------------
[INFO] Total time: 16 minutes 35 seconds
[INFO] Finished at: Tue Dec 10 14:38:26 UTC 2013
[INFO] Final Memory: 176M/544M
[INFO] ------------------------------------------------------------------------
[JENKINS] Archiving <https://builds.apache.org/job/myfaces-current21/ws/current21/shared/shared-tomahawk/pom.xml>
to org.apache.myfaces.shared/myfaces-shared-tomahawk/4.1.12-SNAPSHOT/myfaces-shared-tomahawk-4.1.12-SNAPSHOT.pom
[JENKINS] Archiving <https://builds.apache.org/job/myfaces-current21/ws/current21/shared/shared-tomahawk/target/myfaces-shared-tomahawk-4.1.12-SNAPSHOT.jar>
to org.apache.myfaces.shared/myfaces-shared-tomahawk/4.1.12-SNAPSHOT/myfaces-shared-tomahawk-4.1.12-SNAPSHOT.jar
[JENKINS] Archiving <https://builds.apache.org/job/myfaces-current21/ws/current21/shared/shared-tomahawk/target/myfaces-shared-tomahawk-4.1.12-SNAPSHOT-sources.jar>
to org.apache.myfaces.shared/myfaces-shared-tomahawk/4.1.12-SNAPSHOT/myfaces-shared-tomahawk-4.1.12-SNAPSHOT-sources.jar
[JENKINS] Archiving <https://builds.apache.org/job/myfaces-current21/ws/current21/core/shared-public/pom.xml>
to org.apache.myfaces.core.internal/myfaces-impl-shared-public/2.1.14-SNAPSHOT/myfaces-impl-shared-public-2.1.14-SNAPSHOT.pom
[JENKINS] Archiving <https://builds.apache.org/job/myfaces-current21/ws/current21/core/shared-public/target/myfaces-impl-shared-public-2.1.14-SNAPSHOT.jar>
to org.apache.myfaces.core.internal/myfaces-impl-shared-public/2.1.14-SNAPSHOT/myfaces-impl-shared-public-2.1.14-SNAPSHOT.jar
[JENKINS] Archiving <https://builds.apache.org/job/myfaces-current21/ws/current21/core/shared-public/target/myfaces-impl-shared-public-2.1.14-SNAPSHOT-sources.jar>
to org.apache.myfaces.core.internal/myfaces-impl-shared-public/2.1.14-SNAPSHOT/myfaces-impl-shared-public-2.1.14-SNAPSHOT-sources.jar
[JENKINS] Archiving <https://builds.apache.org/job/myfaces-current21/ws/current21/core/impl/pom.xml>
to org.apache.myfaces.core/myfaces-impl/2.1.14-SNAPSHOT/myfaces-impl-2.1.14-SNAPSHOT.pom
[JENKINS] Archiving <https://builds.apache.org/job/myfaces-current21/ws/current21/core/impl/target/myfaces-impl-2.1.14-SNAPSHOT.jar>
to org.apache.myfaces.core/myfaces-impl/2.1.14-SNAPSHOT/myfaces-impl-2.1.14-SNAPSHOT.jar
[JENKINS] Archiving <https://builds.apache.org/job/myfaces-current21/ws/current21/core/impl/target/myfaces-impl-2.1.14-SNAPSHOT-sources.jar>
to org.apache.myfaces.core/myfaces-impl/2.1.14-SNAPSHOT/myfaces-impl-2.1.14-SNAPSHOT-sources.jar
[JENKINS] Archiving <https://builds.apache.org/job/myfaces-current21/ws/current21/core/impl/target/myfaces-impl-2.1.14-SNAPSHOT-tests.jar>
to org.apache.myfaces.core/myfaces-impl/2.1.14-SNAPSHOT/myfaces-impl-2.1.14-SNAPSHOT-tests.jar
[JENKINS] Archiving <https://builds.apache.org/job/myfaces-current21/ws/current21/shared/core/pom.xml>
to org.apache.myfaces.shared/myfaces-shared-core/4.1.12-SNAPSHOT/myfaces-shared-core-4.1.12-SNAPSHOT.pom
[JENKINS] Archiving <https://builds.apache.org/job/myfaces-current21/ws/current21/shared/core/target/myfaces-shared-core-4.1.12-SNAPSHOT.jar>
to org.apache.myfaces.shared/myfaces-shared-core/4.1.12-SNAPSHOT/myfaces-shared-core-4.1.12-SNAPSHOT.jar
[JENKINS] Archiving <https://builds.apache.org/job/myfaces-current21/ws/current21/shared/core/target/myfaces-shared-core-4.1.12-SNAPSHOT-sources.jar>
to org.apache.myfaces.shared/myfaces-shared-core/4.1.12-SNAPSHOT/myfaces-shared-core-4.1.12-SNAPSHOT-sources.jar
[JENKINS] Archiving <https://builds.apache.org/job/myfaces-current21/ws/current21/core/bundle/pom.xml>
to org.apache.myfaces.core/myfaces-bundle/2.1.14-SNAPSHOT/myfaces-bundle-2.1.14-SNAPSHOT.pom
[JENKINS] Archiving <https://builds.apache.org/job/myfaces-current21/ws/current21/core/bundle/target/myfaces-bundle-2.1.14-SNAPSHOT.jar>
to org.apache.myfaces.core/myfaces-bundle/2.1.14-SNAPSHOT/myfaces-bundle-2.1.14-SNAPSHOT.jar
[JENKINS] Archiving <https://builds.apache.org/job/myfaces-current21/ws/current21/core/bundle/target/myfaces-bundle-2.1.14-SNAPSHOT-sources.jar>
to org.apache.myfaces.core/myfaces-bundle/2.1.14-SNAPSHOT/myfaces-bundle-2.1.14-SNAPSHOT-sources.jar
[JENKINS] Archiving <https://builds.apache.org/job/myfaces-current21/ws/current21/core/api/pom.xml>
to org.apache.myfaces.core/myfaces-api/2.1.14-SNAPSHOT/myfaces-api-2.1.14-SNAPSHOT.pom
[JENKINS] Archiving <https://builds.apache.org/job/myfaces-current21/ws/current21/core/api/target/myfaces-api-2.1.14-SNAPSHOT.jar>
to org.apache.myfaces.core/myfaces-api/2.1.14-SNAPSHOT/myfaces-api-2.1.14-SNAPSHOT.jar
[JENKINS] Archiving <https://builds.apache.org/job/myfaces-current21/ws/current21/core/api/target/myfaces-api-2.1.14-SNAPSHOT-sources.jar>
to org.apache.myfaces.core/myfaces-api/2.1.14-SNAPSHOT/myfaces-api-2.1.14-SNAPSHOT-sources.jar
[JENKINS] Archiving <https://builds.apache.org/job/myfaces-current21/ws/current21/core/api/target/myfaces-api-2.1.14-SNAPSHOT-tests.jar>
to org.apache.myfaces.core/myfaces-api/2.1.14-SNAPSHOT/myfaces-api-2.1.14-SNAPSHOT-tests.jar
[JENKINS] Archiving /home/jenkins/jenkins-slave/maven-repositories/0/org/apache/myfaces/shared/myfaces-shared-project/4.1.12-SNAPSHOT/myfaces-shared-project-4.1.12-SNAPSHOT.pom
to org.apache.myfaces.shared/myfaces-shared-project/4.1.12-SNAPSHOT/myfaces-shared-project-4.1.12-SNAPSHOT.pom
[JENKINS] Archiving <https://builds.apache.org/job/myfaces-current21/ws/current21/shared/target/myfaces-shared-project-4.1.12-SNAPSHOT-site.xml>
to org.apache.myfaces.shared/myfaces-shared-project/4.1.12-SNAPSHOT/myfaces-shared-project-4.1.12-SNAPSHOT-site.xml
/x1/jenkins/jenkins-slave/maven-repositories/0/org/apache/myfaces/shared/myfaces-shared-project/4.1.12-SNAPSHOT/myfaces-shared-project-4.1.12-SNAPSHOT.pom
is not inside /x1/jenkins/jenkins-slave/workspace/myfaces-current21/current21/shared/; will
archive in a separate pass
[JENKINS] Archiving /home/jenkins/jenkins-slave/maven-repositories/0/org/apache/myfaces/core/myfaces-core-project/2.1.14-SNAPSHOT/myfaces-core-project-2.1.14-SNAPSHOT.pom
to org.apache.myfaces.core/myfaces-core-project/2.1.14-SNAPSHOT/myfaces-core-project-2.1.14-SNAPSHOT.pom
[JENKINS] Archiving <https://builds.apache.org/job/myfaces-current21/ws/current21/core/parent/target/myfaces-core-project-2.1.14-SNAPSHOT-site.xml>
to org.apache.myfaces.core/myfaces-core-project/2.1.14-SNAPSHOT/myfaces-core-project-2.1.14-SNAPSHOT-site.xml
/x1/jenkins/jenkins-slave/maven-repositories/0/org/apache/myfaces/core/myfaces-core-project/2.1.14-SNAPSHOT/myfaces-core-project-2.1.14-SNAPSHOT.pom
is not inside /x1/jenkins/jenkins-slave/workspace/myfaces-current21/current21/core/parent/;
will archive in a separate pass
[JENKINS] Archiving /home/jenkins/jenkins-slave/maven-repositories/0/org/apache/myfaces/core/myfaces-core-module/2.1.14-SNAPSHOT/myfaces-core-module-2.1.14-SNAPSHOT.pom
to org.apache.myfaces.core/myfaces-core-module/2.1.14-SNAPSHOT/myfaces-core-module-2.1.14-SNAPSHOT.pom
/x1/jenkins/jenkins-slave/maven-repositories/0/org/apache/myfaces/core/myfaces-core-module/2.1.14-SNAPSHOT/myfaces-core-module-2.1.14-SNAPSHOT.pom
is not inside /x1/jenkins/jenkins-slave/workspace/myfaces-current21/current21/core/; will
archive in a separate pass
[JENKINS] Archiving /home/jenkins/jenkins-slave/maven-repositories/0/org/apache/myfaces/myfaces-base/2.1.0-SNAPSHOT/myfaces-base-2.1.0-SNAPSHOT.pom
to org.apache.myfaces/myfaces-base/2.1.0-SNAPSHOT/myfaces-base-2.1.0-SNAPSHOT.pom
/x1/jenkins/jenkins-slave/maven-repositories/0/org/apache/myfaces/myfaces-base/2.1.0-SNAPSHOT/myfaces-base-2.1.0-SNAPSHOT.pom
is not inside /x1/jenkins/jenkins-slave/workspace/myfaces-current21/current21/; will archive
in a separate pass
[JENKINS] Archiving <https://builds.apache.org/job/myfaces-current21/ws/current21/core/shared/pom.xml>
to org.apache.myfaces.core.internal/myfaces-impl-shared/2.1.14-SNAPSHOT/myfaces-impl-shared-2.1.14-SNAPSHOT.pom
[JENKINS] Archiving <https://builds.apache.org/job/myfaces-current21/ws/current21/core/shared/target/myfaces-impl-shared-2.1.14-SNAPSHOT.jar>
to org.apache.myfaces.core.internal/myfaces-impl-shared/2.1.14-SNAPSHOT/myfaces-impl-shared-2.1.14-SNAPSHOT.jar
[JENKINS] Archiving <https://builds.apache.org/job/myfaces-current21/ws/current21/core/shared/target/myfaces-impl-shared-2.1.14-SNAPSHOT-sources.jar>
to org.apache.myfaces.core.internal/myfaces-impl-shared/2.1.14-SNAPSHOT/myfaces-impl-shared-2.1.14-SNAPSHOT-sources.jar
channel stopped
Maven RedeployPublisher use remote ubuntu3 maven settings from : /home/jenkins/.m2/settings.xml
[INFO] Deployment in https://repository.apache.org/content/repositories/snapshots (id=apache.snapshots.https,uniqueVersion=false)
Deploying the main artifact jenkins-3505336927506540943myfaces-base-2.1.0-SNAPSHOT.pom
[INFO] Deployment in https://repository.apache.org/content/repositories/snapshots (id=apache.snapshots.https,uniqueVersion=false)
Deploying the main artifact jenkins-301318665373212774myfaces-api-2.1.14-SNAPSHOT.jar
Deploying the main artifact jenkins-6539675171466011278myfaces-api-2.1.14-SNAPSHOT-sources.jar
Deploying the main artifact jenkins-6109328265834001804myfaces-api-2.1.14-SNAPSHOT-tests.jar
[INFO] Deployment in https://repository.apache.org/content/repositories/snapshots (id=apache.snapshots.https,uniqueVersion=false)
Deploying the main artifact jenkins-1129344050907353239myfaces-bundle-2.1.14-SNAPSHOT.jar
Deploying the main artifact jenkins-3817652590189352375myfaces-bundle-2.1.14-SNAPSHOT-sources.jar
[INFO] Deployment in https://repository.apache.org/content/repositories/snapshots (id=apache.snapshots.https,uniqueVersion=false)
Deploying the main artifact jenkins-5540163050420142486myfaces-core-module-2.1.14-SNAPSHOT.pom
[INFO] Deployment in https://repository.apache.org/content/repositories/snapshots (id=apache.snapshots.https,uniqueVersion=false)
Deploying the main artifact jenkins-457468168041397645myfaces-core-project-2.1.14-SNAPSHOT.pom
Deploying the main artifact jenkins-5022612767106618122myfaces-core-project-2.1.14-SNAPSHOT-site.xml
[INFO] Deployment in https://repository.apache.org/content/repositories/snapshots (id=apache.snapshots.https,uniqueVersion=false)
Deploying the main artifact jenkins-2957187940386174660myfaces-impl-2.1.14-SNAPSHOT.jar
Deploying the main artifact jenkins-1814812054753305579myfaces-impl-2.1.14-SNAPSHOT-sources.jar
Deploying the main artifact jenkins-8030646000615521911myfaces-impl-2.1.14-SNAPSHOT-tests.jar
Deploying the main artifact jenkins-747615675000436848myfaces-impl-2.1.14-SNAPSHOT-sources.jar
ERROR: Error installing artifact's metadata: Error while deploying metadata: The target server
failed to respond
org.apache.maven.artifact.deployer.ArtifactDeploymentException: Error installing artifact's
metadata: Error while deploying metadata: The target server failed to respond
	at hudson.maven.artifact.deployer.DefaultArtifactDeployer.deploy(DefaultArtifactDeployer.java:183)
	at hudson.maven.reporters.MavenArtifactRecord.deploy(MavenArtifactRecord.java:200)
	at hudson.maven.RedeployPublisher.perform(RedeployPublisher.java:176)
	at hudson.tasks.BuildStepMonitor$1.perform(BuildStepMonitor.java:20)
	at hudson.model.AbstractBuild$AbstractBuildExecution.perform(AbstractBuild.java:785)
	at hudson.model.AbstractBuild$AbstractBuildExecution.performAllBuildSteps(AbstractBuild.java:757)
	at hudson.maven.MavenModuleSetBuild$MavenModuleSetBuildExecution.post2(MavenModuleSetBuild.java:1020)
	at hudson.model.AbstractBuild$AbstractBuildExecution.post(AbstractBuild.java:706)
	at hudson.model.Run.execute(Run.java:1702)
	at hudson.maven.MavenModuleSetBuild.run(MavenModuleSetBuild.java:509)
	at hudson.model.ResourceController.execute(ResourceController.java:88)
	at hudson.model.Executor.run(Executor.java:231)
Caused by: org.apache.maven.artifact.repository.metadata.RepositoryMetadataDeploymentException:
Error while deploying metadata: The target server failed to respond
	at org.apache.maven.artifact.repository.metadata.DefaultRepositoryMetadataManager.deploy(DefaultRepositoryMetadataManager.java:492)
	at hudson.maven.artifact.deployer.DefaultArtifactDeployer.deploy(DefaultArtifactDeployer.java:167)
	... 11 more
Caused by: org.apache.maven.wagon.TransferFailedException: The target server failed to respond
	at org.apache.maven.wagon.shared.http4.AbstractHttpClientWagon.put(AbstractHttpClientWagon.java:580)
	at org.apache.maven.wagon.shared.http4.AbstractHttpClientWagon.put(AbstractHttpClientWagon.java:524)
	at org.apache.maven.wagon.shared.http4.AbstractHttpClientWagon.put(AbstractHttpClientWagon.java:505)
	at org.apache.maven.wagon.shared.http4.AbstractHttpClientWagon.put(AbstractHttpClientWagon.java:485)
	at org.apache.maven.repository.legacy.DefaultWagonManager.putRemoteFile(DefaultWagonManager.java:543)
	at org.apache.maven.repository.legacy.DefaultWagonManager.putArtifactMetadata(DefaultWagonManager.java:501)
	at org.apache.maven.artifact.repository.metadata.DefaultRepositoryMetadataManager.deploy(DefaultRepositoryMetadataManager.java:488)
	... 12 more
Caused by: org.apache.http.NoHttpResponseException: The target server failed to respond
	at org.apache.http.impl.conn.DefaultHttpResponseParser.parseHead(DefaultHttpResponseParser.java:95)
	at org.apache.http.impl.conn.DefaultHttpResponseParser.parseHead(DefaultHttpResponseParser.java:62)
	at org.apache.http.impl.io.AbstractMessageParser.parse(AbstractMessageParser.java:254)
	at org.apache.http.impl.AbstractHttpClientConnection.receiveResponseHeader(AbstractHttpClientConnection.java:289)
	at org.apache.http.impl.conn.DefaultClientConnection.receiveResponseHeader(DefaultClientConnection.java:252)
	at org.apache.http.impl.conn.ManagedClientConnectionImpl.receiveResponseHeader(ManagedClientConnectionImpl.java:191)
	at org.apache.http.protocol.HttpRequestExecutor.doReceiveResponse(HttpRequestExecutor.java:300)
	at org.apache.http.protocol.HttpRequestExecutor.execute(HttpRequestExecutor.java:127)
	at org.apache.http.impl.client.DefaultRequestDirector.tryExecute(DefaultRequestDirector.java:715)
	at org.apache.http.impl.client.DefaultRequestDirector.execute(DefaultRequestDirector.java:520)
	at org.apache.http.impl.client.AbstractHttpClient.execute(AbstractHttpClient.java:906)
	at org.apache.http.impl.client.AbstractHttpClient.execute(AbstractHttpClient.java:805)
	at org.apache.maven.wagon.shared.http4.AbstractHttpClientWagon.execute(AbstractHttpClientWagon.java:746)
	at org.apache.maven.wagon.shared.http4.AbstractHttpClientWagon.put(AbstractHttpClientWagon.java:574)
	... 18 more
[INFO] Deployment failed after 58 sec
Build step 'Deploy artifacts to Maven repository' changed build result to FAILURE

Mime
View raw message