myfaces-commits mailing list archives

Site index · List index
Message view « Date » · « Thread »
Top « Date » · « Thread »
From Apache Jenkins Server <jenk...@builds.apache.org>
Subject Build failed in Jenkins: myfaces-current-2.0 #2264
Date Sat, 14 Dec 2013 08:38:05 GMT
See <https://builds.apache.org/job/myfaces-current-2.0/2264/>

------------------------------------------
[...truncated 4285 lines...]
[INFO] Retrieving previous build number from apache.snapshots.https
Uploading: https://repository.apache.org/content/repositories/snapshots/org/apache/myfaces/shared/myfaces-shared-project/4.0.20-SNAPSHOT/myfaces-shared-project-4.0.20-20131214.071238-21-site.xml
2K uploaded  (myfaces-shared-project-4.0.20-20131214.071238-21-site.xml)
[INFO] ------------------------------------------------------------------------
[INFO] Building Apache MyFaces Shared For JSF 2.0 - Core Mirror
[INFO]    task-segment: [clean, deploy]
[INFO] ------------------------------------------------------------------------
[INFO] [clean:clean {execution: default-clean}]
[INFO] [remote-resources:process {execution: default}]
[INFO] [build-helper:add-resource {execution: add-resource}]
[INFO] [myfaces-javascript:compile {execution: compile-myfacesscripts}]
[INFO] Reading assembler descriptor <https://builds.apache.org/job/myfaces-current-2.0/ws/current20/shared/core/src/assembler/myfacesscripts-compiler.xml>
[INFO] [myfaces-javascript:compile {execution: compile-myfacesscripts-uncompressed}]
[INFO] Reading assembler descriptor <https://builds.apache.org/job/myfaces-current-2.0/ws/current20/shared/core/src/assembler/myfacesscripts-uncompressed-compiler.xml>
[INFO] [myfaces-javascript:compress {execution: compress-myfacesscripts}]
[INFO] Compressing javascript using YahooUI
[INFO] ------------------------------------------------------------------------------

[WARNING] [WARNING] The variable i has already been declared in the same scope...
&&params!=null){for(var i ---> = <--- 0,param;(param=params[

[WARNING] [WARNING] The variable param has already been declared in the same scope...
){for(var i=0,param ---> ; <--- (param=params[i]);
[INFO] oamSubmit.js (5,742 bytes) ................................. compressed at 67%
[INFO] ------------------------------------------------------------------------------
[INFO] compression saved 3,868 bytes
[debug] execute contextualize
[INFO] [resources:resources {execution: default-resources}]
[INFO] Using 'UTF-8' encoding to copy filtered resources.
[INFO] Copying 3 resources
[INFO] Copying 3 resources
[INFO] Copying 2 resources
[INFO] [compiler:compile {execution: default-compile}]
[INFO] Compiling 140 source files to <https://builds.apache.org/job/myfaces-current-2.0/ws/current20/shared/core/target/classes>
[debug] execute contextualize
[INFO] [resources:testResources {execution: default-testResources}]
[INFO] Using 'UTF-8' encoding to copy filtered resources.
[INFO] Copying 15 resources
[INFO] Copying 3 resources
[JENKINS] Recording test results[INFO] [compiler:testCompile {execution: default-testCompile}]

[INFO] Compiling 20 source files to <https://builds.apache.org/job/myfaces-current-2.0/ws/current20/shared/core/target/test-classes>
[INFO] [surefire:test {execution: default-test}]
[INFO] Surefire report directory: <https://builds.apache.org/job/myfaces-current-2.0/ws/current20/shared/core/target/surefire-reports>

-------------------------------------------------------
 T E S T S
-------------------------------------------------------
Running org.apache.myfaces.shared.renderkit.html.HtmlResponseWriterImplTest
Tests run: 13, Failures: 0, Errors: 0, Skipped: 0, Time elapsed: 0.207 sec
Running org.apache.myfaces.shared.renderkit.html.HtmlRendererUtilsTest
No Renderer found for component {Component-Path : [Class: javax.faces.component.html.HtmlInputText,Id:
j_id0]} (component-family=javax.faces.Input, renderer-type=javax.faces.Text)
Dec 14, 2013 7:43:49 AM javax.faces.component.UIComponentBase getRenderer
WARNING: No Renderer found for component {Component-Path : [Class: javax.faces.component.html.HtmlInputText,Id:
j_id0]} (component-family=javax.faces.Input, renderer-type=javax.faces.Text)
Tests run: 2, Failures: 0, Errors: 0, Skipped: 0, Time elapsed: 0.033 sec
Running org.apache.myfaces.shared.renderkit.html.util.HTMLEncoderTest
Tests run: 26, Failures: 0, Errors: 0, Skipped: 0, Time elapsed: 0.028 sec
Running org.apache.myfaces.shared.renderkit.RendererUtilsTest
No Renderer found for component {Component-Path : [Class: javax.faces.component.html.HtmlGraphicImage,Id:
graphicImageId]} (component-family=javax.faces.Graphic, renderer-type=javax.faces.Image)
Dec 14, 2013 7:43:49 AM javax.faces.component.UIComponentBase getRenderer
WARNING: No Renderer found for component {Component-Path : [Class: javax.faces.component.html.HtmlGraphicImage,Id:
graphicImageId]} (component-family=javax.faces.Graphic, renderer-type=javax.faces.Image)
Tests run: 7, Failures: 0, Errors: 0, Skipped: 0, Time elapsed: 0.625 sec
Running org.apache.myfaces.shared.application.DefaultViewHandlerSupportTest
Tests run: 8, Failures: 0, Errors: 0, Skipped: 0, Time elapsed: 0.047 sec
Running org.apache.myfaces.shared.util.StateUtilsAES_CBCTest
Tests run: 11, Failures: 0, Errors: 0, Skipped: 0, Time elapsed: 0.569 sec
Running org.apache.myfaces.shared.util.SecretKeyConfigurationTest
Tests run: 4, Failures: 0, Errors: 0, Skipped: 0, Time elapsed: 0.002 sec
Running org.apache.myfaces.shared.util.CachedStateUtilsDefaultTest
Tests run: 11, Failures: 0, Errors: 0, Skipped: 0, Time elapsed: 0.013 sec
Running org.apache.myfaces.shared.util.CommentUtilsTest
Tests run: 5, Failures: 0, Errors: 0, Skipped: 0, Time elapsed: 0.003 sec
Running org.apache.myfaces.shared.util.StateUtilsBlowfish_ECBTest
Tests run: 11, Failures: 0, Errors: 0, Skipped: 0, Time elapsed: 0.125 sec
Running org.apache.myfaces.shared.util.StateUtilsTripleDES_ECBTest
Tests run: 11, Failures: 0, Errors: 0, Skipped: 0, Time elapsed: 0.011 sec
Running org.apache.myfaces.shared.util.SecretKeyCacheTest
Tests run: 3, Failures: 0, Errors: 0, Skipped: 0, Time elapsed: 0.001 sec
Running org.apache.myfaces.shared.util.StateUtilsDefaultTest
Tests run: 11, Failures: 0, Errors: 0, Skipped: 0, Time elapsed: 0.01 sec
Running org.apache.myfaces.shared.util.CachedStateUtilsBlowfish_ECBTest
Tests run: 11, Failures: 0, Errors: 0, Skipped: 0, Time elapsed: 0.015 sec
Running org.apache.myfaces.shared.util.CachedStateUtilsAES_CBCTest
Tests run: 11, Failures: 0, Errors: 0, Skipped: 0, Time elapsed: 0.01 sec
Running org.apache.myfaces.shared.util.CachedStateUtilsTripleDES_ECBTest
Tests run: 11, Failures: 0, Errors: 0, Skipped: 0, Time elapsed: 0.009 sec
Running org.apache.myfaces.shared.util.MessageUtilsTest
currency ?100.00
Tests run: 11, Failures: 0, Errors: 0, Skipped: 0, Time elapsed: 0.048 sec
Running org.apache.myfaces.shared.util.InitVector_CBCTestCase
Tests run: 2, Failures: 0, Errors: 0, Skipped: 0, Time elapsed: 0.001 sec
Running org.apache.myfaces.shared.webapp.webxml.ServletMappingTest
Tests run: 2, Failures: 0, Errors: 0, Skipped: 0, Time elapsed: 0 sec

Results :

Tests run: 171, Failures: 0, Errors: 0, Skipped: 0

[INFO] [jar:jar {execution: default-jar}]
[INFO] Building jar: <https://builds.apache.org/job/myfaces-current-2.0/ws/current20/shared/core/target/myfaces-shared-core-4.0.20-SNAPSHOT.jar>
[INFO] Preparing source:jar
[WARNING] Removing: jar from forked lifecycle, to prevent recursive invocation.
[INFO] No goals needed for project - skipping
[INFO] [source:jar {execution: attach-source}]
[INFO] META-INF already added, skipping
[INFO] META-INF already added, skipping
[INFO] META-INF/DEPENDENCIES already added, skipping
[INFO] META-INF/NOTICE already added, skipping
[INFO] META-INF/LICENSE already added, skipping
[INFO] META-INF already added, skipping
[INFO] Building jar: <https://builds.apache.org/job/myfaces-current-2.0/ws/current20/shared/core/target/myfaces-shared-core-4.0.20-SNAPSHOT-sources.jar>
[INFO] META-INF already added, skipping
[INFO] META-INF already added, skipping
[INFO] META-INF/DEPENDENCIES already added, skipping
[INFO] META-INF/NOTICE already added, skipping
[INFO] META-INF/LICENSE already added, skipping
[INFO] META-INF already added, skipping
[INFO] [checkstyle:check {execution: verify-style}]
[INFO] 
[INFO] [install:install {execution: default-install}]
[INFO] Installing <https://builds.apache.org/job/myfaces-current-2.0/ws/current20/shared/core/target/myfaces-shared-core-4.0.20-SNAPSHOT.jar>
to /export/home/hudson/hudson-slave/maven-repositories/1/org/apache/myfaces/shared/myfaces-shared-core/4.0.20-SNAPSHOT/myfaces-shared-core-4.0.20-SNAPSHOT.jar
[INFO] Installing <https://builds.apache.org/job/myfaces-current-2.0/ws/current20/shared/core/target/myfaces-shared-core-4.0.20-SNAPSHOT-sources.jar>
to /export/home/hudson/hudson-slave/maven-repositories/1/org/apache/myfaces/shared/myfaces-shared-core/4.0.20-SNAPSHOT/myfaces-shared-core-4.0.20-SNAPSHOT-sources.jar
[INFO] [deploy:deploy {execution: default-deploy}]
[INFO] Retrieving previous build number from apache.snapshots.https
[WARNING] *** CHECKSUM FAILED - Checksum failed on download: local = 'c43d02e91854a43cdde10562bac7478f2e23c96e';
remote = '9edaa71b3e4cba76d632204424a033403383e52d' - RETRYING
[WARNING] *** CHECKSUM FAILED - Checksum failed on download: local = 'c43d02e91854a43cdde10562bac7478f2e23c96e';
remote = '9edaa71b3e4cba76d632204424a033403383e52d' - IGNORING
Uploading: https://repository.apache.org/content/repositories/snapshots/org/apache/myfaces/shared/myfaces-shared-core/4.0.20-SNAPSHOT/myfaces-shared-core-4.0.20-20131214.071238-20.jar
451K uploaded  (myfaces-shared-core-4.0.20-20131214.071238-20.jar)
[INFO] Retrieving previous metadata from apache.snapshots.https
[WARNING] *** CHECKSUM FAILED - Checksum failed on download: local = 'c43d02e91854a43cdde10562bac7478f2e23c96e';
remote = '9edaa71b3e4cba76d632204424a033403383e52d' - RETRYING
[WARNING] *** CHECKSUM FAILED - Checksum failed on download: local = 'c43d02e91854a43cdde10562bac7478f2e23c96e';
remote = '9edaa71b3e4cba76d632204424a033403383e52d' - IGNORING
[INFO] Uploading repository metadata for: 'snapshot org.apache.myfaces.shared:myfaces-shared-core:4.0.20-SNAPSHOT'
[INFO] Uploading project information for myfaces-shared-core 4.0.20-20131214.071238-20
[INFO] Retrieving previous metadata from apache.snapshots.https
[INFO] Uploading repository metadata for: 'artifact org.apache.myfaces.shared:myfaces-shared-core'
[INFO] Retrieving previous build number from apache.snapshots.https
Uploading: https://repository.apache.org/content/repositories/snapshots/org/apache/myfaces/shared/myfaces-shared-core/4.0.20-SNAPSHOT/myfaces-shared-core-4.0.20-20131214.071238-20-sources.jar
411K uploaded  (myfaces-shared-core-4.0.20-20131214.071238-20-sources.jar)
[INFO] ------------------------------------------------------------------------
[INFO] Building MyFaces Shared Tomahawk
[INFO]    task-segment: [clean, deploy]
[INFO] ------------------------------------------------------------------------
[INFO] [clean:clean {execution: default-clean}]
[INFO] [dependency:unpack {execution: unpack-sources}]
[INFO] Configured Artifact: org.apache.myfaces.shared:myfaces-shared-core:sources:4.0.20-SNAPSHOT:jar
[INFO] snapshot org.apache.myfaces.shared:myfaces-shared-core:4.0.20-SNAPSHOT: checking for
updates from apache-maven-snapshots
[INFO] snapshot org.apache.myfaces.shared:myfaces-shared-core:4.0.20-SNAPSHOT: checking for
updates from apache.snapshots
[INFO] Unpacking /export/home/hudson/hudson-slave/maven-repositories/1/org/apache/myfaces/shared/myfaces-shared-core/4.0.20-SNAPSHOT/myfaces-shared-core-4.0.20-SNAPSHOT-sources.jarto
 <https://builds.apache.org/job/myfaces-current-2.0/ws/current20/shared/shared-tomahawk/target/unpacked-shared-sources>
with Includes null and excludes:null
[INFO] [dependency:unpack {execution: unpack-resources-sources}]
[INFO] Configured Artifact: org.apache.myfaces.shared:myfaces-shared-core:4.0.20-SNAPSHOT:jar
[INFO] Unpacking /export/home/hudson/hudson-slave/maven-repositories/1/org/apache/myfaces/shared/myfaces-shared-core/4.0.20-SNAPSHOT/myfaces-shared-core-4.0.20-SNAPSHOT.jarto
 <https://builds.apache.org/job/myfaces-current-2.0/ws/current20/shared/shared-tomahawk/target/refactored-shared-sources/main/resources>
with Includes META-INF/internal-resources/**,META-INF/resources/** and excludes:null
[INFO] [build-helper:add-source {execution: add-source-shared}]
[INFO] Source directory: <https://builds.apache.org/job/myfaces-current-2.0/ws/current20/shared/shared-tomahawk/target/refactored-shared-sources/main/java>
added.
[WARNING] DEPRECATED [sourceRoot]: Use the build-helper-maven-plugin to bind source directories
[WARNING] DEPRECATED [tasks]: Use target instead
[INFO] [antrun:run {execution: refactor-shared-sources}]
[WARNING] Parameter tasks is deprecated, use target instead
[INFO] Executing tasks

main:

refactor-java-sources:
    [mkdir] Created dir: <https://builds.apache.org/job/myfaces-current-2.0/ws/current20/shared/shared-tomahawk/target/refactored-shared-sources/main/java>
     [move] Moving 140 files to <https://builds.apache.org/job/myfaces-current-2.0/ws/current20/shared/shared-tomahawk/target/refactored-shared-sources/main/java/org/apache/myfaces/shared_tomahawk>
[INFO] Executed tasks
[INFO] Registering compile source root <https://builds.apache.org/job/myfaces-current-2.0/ws/current20/shared/shared-tomahawk/target/refactored-shared-sources/main/java>
[INFO] [remote-resources:process {execution: default}]
[WARNING] DEPRECATED [tasks]: Use target instead
[INFO] [antrun:run {execution: refactor-resources}]
[WARNING] Parameter tasks is deprecated, use target instead
[INFO] Executing tasks

main:

refactor-resources:
[INFO] Executed tasks
[debug] execute contextualize
[INFO] [resources:resources {execution: default-resources}]
[INFO] Using 'UTF-8' encoding to copy filtered resources.
[INFO] Copying 2 resources
[INFO] Copying 3 resources
[INFO] [dependency:unpack {execution: unpack-resources}]
[INFO] Configured Artifact: org.apache.myfaces.shared:myfaces-shared-core:4.0.20-SNAPSHOT:jar
[INFO] Unpacking /export/home/hudson/hudson-slave/maven-repositories/1/org/apache/myfaces/shared/myfaces-shared-core/4.0.20-SNAPSHOT/myfaces-shared-core-4.0.20-SNAPSHOT.jarto
 <https://builds.apache.org/job/myfaces-current-2.0/ws/current20/shared/shared-tomahawk/target/classes>
with Includes META-INF/internal-resources/**,META-INF/resources/** and excludes:null
[INFO] [compiler:compile {execution: default-compile}]
[INFO] Compiling 140 source files to <https://builds.apache.org/job/myfaces-current-2.0/ws/current20/shared/shared-tomahawk/target/classes>
[debug] execute contextualize
[INFO] [resources:testResources {execution: default-testResources}]
[INFO] Using 'UTF-8' encoding to copy filtered resources.
[INFO] skip non existing resourceDirectory <https://builds.apache.org/job/myfaces-current-2.0/ws/current20/shared/shared-tomahawk/src/test/resources>
[INFO] Copying 3 resources
[INFO] [compiler:testCompile {execution: default-testCompile}]
[INFO] No sources to compile
[INFO] [surefire:test {execution: default-test}]
[INFO] Surefire report directory: <https://builds.apache.org/job/myfaces-current-2.0/ws/current20/shared/shared-tomahawk/target/surefire-reports>

-------------------------------------------------------
 T E S T S
-------------------------------------------------------

Results :

Tests run: 0, Failures: 0, Errors: 0, Skipped: 0

[JENKINS] Recording test results
[INFO] [jar:jar {execution: default-jar}]
[INFO] Building jar: <https://builds.apache.org/job/myfaces-current-2.0/ws/current20/shared/shared-tomahawk/target/myfaces-shared-tomahawk-4.0.20-SNAPSHOT.jar>
[INFO] Preparing source:jar
[WARNING] Removing: jar from forked lifecycle, to prevent recursive invocation.
[INFO] [dependency:unpack {execution: unpack-sources}]
[INFO] Configured Artifact: org.apache.myfaces.shared:myfaces-shared-core:sources:4.0.20-SNAPSHOT:jar
[INFO] myfaces-shared-core-4.0.20-SNAPSHOT-sources.jar already unpacked.
[INFO] [dependency:unpack {execution: unpack-resources-sources}]
[INFO] Configured Artifact: org.apache.myfaces.shared:myfaces-shared-core:4.0.20-SNAPSHOT:jar
[INFO] Unpacking /export/home/hudson/hudson-slave/maven-repositories/1/org/apache/myfaces/shared/myfaces-shared-core/4.0.20-SNAPSHOT/myfaces-shared-core-4.0.20-SNAPSHOT.jarto
 <https://builds.apache.org/job/myfaces-current-2.0/ws/current20/shared/shared-tomahawk/target/refactored-shared-sources/main/resources>
with Includes META-INF/internal-resources/**,META-INF/resources/** and excludes:null
ERROR: Could not find local repository for 2.2.1
Build timed out (after 60 minutes). Marking the build as failed.
[INFO] ------------------------------------------------------------------------
[ERROR] FATAL ERROR
[INFO] ------------------------------------------------------------------------
[INFO] Unable to call setResult. Invalid object ID 6
[INFO] ------------------------------------------------------------------------
[INFO] Trace
java.lang.IllegalStateException: Unable to call setResult. Invalid object ID 6
	at hudson.remoting.RemoteInvocationHandler$RPCRequest.perform(RemoteInvocationHandler.java:293)
	at hudson.remoting.RemoteInvocationHandler$RPCRequest.call(RemoteInvocationHandler.java:280)
	at hudson.remoting.RemoteInvocationHandler$RPCRequest.call(RemoteInvocationHandler.java:239)
	at hudson.remoting.UserRequest.perform(UserRequest.java:118)
	at hudson.remoting.UserRequest.perform(UserRequest.java:48)
	at hudson.remoting.Request$2.run(Request.java:328)
	at hudson.remoting.InterceptingExecutorService$1.call(InterceptingExecutorService.java:72)
	at java.util.concurrent.FutureTask.run(FutureTask.java:262)
	at java.util.concurrent.ThreadPoolExecutor.runWorker(ThreadPoolExecutor.java:1145)
	at java.util.concurrent.ThreadPoolExecutor$Worker.run(ThreadPoolExecutor.java:615)
	at java.lang.Thread.run(Thread.java:744)
[INFO] ------------------------------------------------------------------------
[INFO] Total time: 48 minutes 48 seconds
[INFO] Finished at: Sat Dec 14 08:00:04 GMT+00:00 2013
[INFO] Final Memory: 120M/462M
[INFO] ------------------------------------------------------------------------
channel stopped

Mime
View raw message