myfaces-commits mailing list archives

Site index · List index
Message view « Date » · « Thread »
Top « Date » · « Thread »
From Apache Jenkins Server <jenk...@builds.apache.org>
Subject Build failed in Jenkins: ExtVal for JSF 2.0 (nightly) #218
Date Fri, 06 Dec 2013 22:45:31 GMT
See <https://builds.apache.org/job/ExtVal%20for%20JSF%202.0%20(nightly)/218/>

------------------------------------------
[...truncated 1690 lines...]
[INFO] Copying 0 resource
[INFO] Copying 3 resources
[INFO] [compiler:testCompile {execution: default-testCompile}]
[INFO] Compiling 7 source files to <https://builds.apache.org/job/ExtVal%20for%20JSF%202.0%20(nightly)/ws/branch_for_jsf_2_0/test-modules/base-test-infrastructure/target/test-classes>
[INFO] [surefire:test {execution: default-test}]
[INFO] Surefire report directory: <https://builds.apache.org/job/ExtVal%20for%20JSF%202.0%20(nightly)/ws/branch_for_jsf_2_0/test-modules/base-test-infrastructure/target/surefire-reports>
/bin/sh: 1: Syntax error: "(" unexpected
[ERROR] There are test failures.

Please refer to <https://builds.apache.org/job/ExtVal%20for%20JSF%202.0%20(nightly)/ws/branch_for_jsf_2_0/test-modules/base-test-infrastructure/target/surefire-reports>
for the individual test results.
[JENKINS] Recording test results
[INFO] [jar:jar {execution: default-jar}]
[INFO] Building jar: <https://builds.apache.org/job/ExtVal%20for%20JSF%202.0%20(nightly)/ws/branch_for_jsf_2_0/test-modules/base-test-infrastructure/target/myfaces-extval-base-test-infrastructure-2.0.8-SNAPSHOT.jar>
[INFO] Preparing source:jar
[WARNING] Removing: jar from forked lifecycle, to prevent recursive invocation.
[WARNING] DEPRECATED [tasks]: Use target instead
[INFO] [antrun:run {execution: javadoc.resources}]
[WARNING] Parameter tasks is deprecated, use target instead
[INFO] Executing tasks

main:
[INFO] Executed tasks
ERROR: Could not find local repository for 2.2.1
[INFO] [source:jar {execution: attach-sources}]
[INFO] META-INF already added, skipping
[INFO] META-INF/LICENSE already added, skipping
[INFO] META-INF/NOTICE already added, skipping
[INFO] META-INF/DEPENDENCIES already added, skipping
[INFO] Building jar: <https://builds.apache.org/job/ExtVal%20for%20JSF%202.0%20(nightly)/ws/branch_for_jsf_2_0/test-modules/base-test-infrastructure/target/myfaces-extval-base-test-infrastructure-2.0.8-SNAPSHOT-sources.jar>
[INFO] META-INF already added, skipping
[INFO] META-INF/LICENSE already added, skipping
[INFO] META-INF/NOTICE already added, skipping
[INFO] META-INF/DEPENDENCIES already added, skipping
[INFO] Preparing source:test-jar
[WARNING] Removing: jar from forked lifecycle, to prevent recursive invocation.
[WARNING] Removing: test-jar from forked lifecycle, to prevent recursive invocation.
[WARNING] DEPRECATED [tasks]: Use target instead
[INFO] [antrun:run {execution: javadoc.resources}]
[WARNING] Parameter tasks is deprecated, use target instead
[INFO] Executing tasks

main:
[INFO] Executed tasks
ERROR: Could not find local repository for 2.2.1
[INFO] [source:test-jar {execution: attach-sources}]
[INFO] META-INF already added, skipping
[INFO] META-INF/LICENSE already added, skipping
[INFO] META-INF/NOTICE already added, skipping
[INFO] META-INF/DEPENDENCIES already added, skipping
[INFO] Building jar: <https://builds.apache.org/job/ExtVal%20for%20JSF%202.0%20(nightly)/ws/branch_for_jsf_2_0/test-modules/base-test-infrastructure/target/myfaces-extval-base-test-infrastructure-2.0.8-SNAPSHOT-test-sources.jar>
[INFO] META-INF already added, skipping
[INFO] META-INF/LICENSE already added, skipping
[INFO] META-INF/NOTICE already added, skipping
[INFO] META-INF/DEPENDENCIES already added, skipping
[INFO] [jar:test-jar {execution: default}]
[INFO] Building jar: <https://builds.apache.org/job/ExtVal%20for%20JSF%202.0%20(nightly)/ws/branch_for_jsf_2_0/test-modules/base-test-infrastructure/target/myfaces-extval-base-test-infrastructure-2.0.8-SNAPSHOT-tests.jar>
[INFO] [checkstyle:check {execution: verify-style}]
[INFO] 
[INFO] [install:install {execution: default-install}]
[INFO] Installing <https://builds.apache.org/job/ExtVal%20for%20JSF%202.0%20(nightly)/ws/branch_for_jsf_2_0/test-modules/base-test-infrastructure/target/myfaces-extval-base-test-infrastructure-2.0.8-SNAPSHOT.jar>
to /home/jenkins/jenkins-slave/maven-repositories/1/org/apache/myfaces/extensions/validator/test-modules/myfaces-extval-base-test-infrastructure/2.0.8-SNAPSHOT/myfaces-extval-base-test-infrastructure-2.0.8-SNAPSHOT.jar
[INFO] Installing <https://builds.apache.org/job/ExtVal%20for%20JSF%202.0%20(nightly)/ws/branch_for_jsf_2_0/test-modules/base-test-infrastructure/target/myfaces-extval-base-test-infrastructure-2.0.8-SNAPSHOT-sources.jar>
to /home/jenkins/jenkins-slave/maven-repositories/1/org/apache/myfaces/extensions/validator/test-modules/myfaces-extval-base-test-infrastructure/2.0.8-SNAPSHOT/myfaces-extval-base-test-infrastructure-2.0.8-SNAPSHOT-sources.jar
[INFO] Installing <https://builds.apache.org/job/ExtVal%20for%20JSF%202.0%20(nightly)/ws/branch_for_jsf_2_0/test-modules/base-test-infrastructure/target/myfaces-extval-base-test-infrastructure-2.0.8-SNAPSHOT-test-sources.jar>
to /home/jenkins/jenkins-slave/maven-repositories/1/org/apache/myfaces/extensions/validator/test-modules/myfaces-extval-base-test-infrastructure/2.0.8-SNAPSHOT/myfaces-extval-base-test-infrastructure-2.0.8-SNAPSHOT-test-sources.jar
[INFO] Installing <https://builds.apache.org/job/ExtVal%20for%20JSF%202.0%20(nightly)/ws/branch_for_jsf_2_0/test-modules/base-test-infrastructure/target/myfaces-extval-base-test-infrastructure-2.0.8-SNAPSHOT-tests.jar>
to /home/jenkins/jenkins-slave/maven-repositories/1/org/apache/myfaces/extensions/validator/test-modules/myfaces-extval-base-test-infrastructure/2.0.8-SNAPSHOT/myfaces-extval-base-test-infrastructure-2.0.8-SNAPSHOT-tests.jar
[INFO] ------------------------------------------------------------------------
[INFO] Building MyFaces Extensions-Validator Core-Tests
[INFO]    task-segment: [clean, install]
[INFO] ------------------------------------------------------------------------
[INFO] [clean:clean {execution: default-clean}]
[WARNING] DEPRECATED [tasks]: Use target instead
[INFO] [antrun:run {execution: javadoc.resources}]
[WARNING] Parameter tasks is deprecated, use target instead
[INFO] Executing tasks

main:
[INFO] Executed tasks
[INFO] [remote-resources:process {execution: default}]
[debug] execute contextualize
[INFO] [resources:resources {execution: default-resources}]
[INFO] Using 'UTF-8' encoding to copy filtered resources.
[INFO] skip non existing resourceDirectory <https://builds.apache.org/job/ExtVal%20for%20JSF%202.0%20(nightly)/ws/branch_for_jsf_2_0/test-modules/core-tests/src/main/config>
[INFO] skip non existing resourceDirectory <https://builds.apache.org/job/ExtVal%20for%20JSF%202.0%20(nightly)/ws/branch_for_jsf_2_0/test-modules/core-tests/src/main/resources>
[INFO] skip non existing resourceDirectory <https://builds.apache.org/job/ExtVal%20for%20JSF%202.0%20(nightly)/ws/branch_for_jsf_2_0/test-modules/core-tests/src/main/java>
[INFO] Copying 3 resources
[INFO] [compiler:compile {execution: default-compile}]
[INFO] No sources to compile
[debug] execute contextualize
[INFO] [resources:testResources {execution: default-testResources}]
[INFO] Using 'UTF-8' encoding to copy filtered resources.
[INFO] Copying 2 resources
[INFO] Copying 3 resources
[INFO] [compiler:testCompile {execution: default-testCompile}]
[INFO] Compiling 70 source files to <https://builds.apache.org/job/ExtVal%20for%20JSF%202.0%20(nightly)/ws/branch_for_jsf_2_0/test-modules/core-tests/target/test-classes>
[INFO] [surefire:test {execution: default-test}]
[INFO] Surefire report directory: <https://builds.apache.org/job/ExtVal%20for%20JSF%202.0%20(nightly)/ws/branch_for_jsf_2_0/test-modules/core-tests/target/surefire-reports>
/bin/sh: 1: Syntax error: "(" unexpected
[ERROR] There are test failures.

Please refer to <https://builds.apache.org/job/ExtVal%20for%20JSF%202.0%20(nightly)/ws/branch_for_jsf_2_0/test-modules/core-tests/target/surefire-reports>
for the individual test results.
[JENKINS] Recording test results
[INFO] [jar:jar {execution: default-jar}]
[INFO] Building jar: <https://builds.apache.org/job/ExtVal%20for%20JSF%202.0%20(nightly)/ws/branch_for_jsf_2_0/test-modules/core-tests/target/myfaces-extval-core-tests-2.0.8-SNAPSHOT.jar>
[INFO] Preparing source:jar
[WARNING] Removing: jar from forked lifecycle, to prevent recursive invocation.
[WARNING] DEPRECATED [tasks]: Use target instead
[INFO] [antrun:run {execution: javadoc.resources}]
[WARNING] Parameter tasks is deprecated, use target instead
[INFO] Executing tasks

main:
[INFO] Executed tasks
ERROR: Could not find local repository for 2.2.1
[INFO] [source:jar {execution: attach-sources}]
[INFO] META-INF already added, skipping
[INFO] META-INF/LICENSE already added, skipping
[INFO] META-INF/NOTICE already added, skipping
[INFO] META-INF/DEPENDENCIES already added, skipping
[INFO] Building jar: <https://builds.apache.org/job/ExtVal%20for%20JSF%202.0%20(nightly)/ws/branch_for_jsf_2_0/test-modules/core-tests/target/myfaces-extval-core-tests-2.0.8-SNAPSHOT-sources.jar>
[INFO] META-INF already added, skipping
[INFO] META-INF/LICENSE already added, skipping
[INFO] META-INF/NOTICE already added, skipping
[INFO] META-INF/DEPENDENCIES already added, skipping
[INFO] Preparing source:test-jar
[WARNING] Removing: jar from forked lifecycle, to prevent recursive invocation.
[WARNING] Removing: test-jar from forked lifecycle, to prevent recursive invocation.
[WARNING] DEPRECATED [tasks]: Use target instead
[INFO] [antrun:run {execution: javadoc.resources}]
[WARNING] Parameter tasks is deprecated, use target instead
[INFO] Executing tasks

main:
[INFO] Executed tasks
ERROR: Could not find local repository for 2.2.1
[INFO] [source:test-jar {execution: attach-sources}]
[INFO] org already added, skipping
[INFO] org/apache already added, skipping
[INFO] org/apache/myfaces already added, skipping
[INFO] org/apache/myfaces/extensions already added, skipping
[INFO] org/apache/myfaces/extensions/validator already added, skipping
[INFO] META-INF already added, skipping
[INFO] META-INF/LICENSE already added, skipping
[INFO] META-INF/NOTICE already added, skipping
[INFO] META-INF/DEPENDENCIES already added, skipping
[INFO] Building jar: <https://builds.apache.org/job/ExtVal%20for%20JSF%202.0%20(nightly)/ws/branch_for_jsf_2_0/test-modules/core-tests/target/myfaces-extval-core-tests-2.0.8-SNAPSHOT-test-sources.jar>
[INFO] org already added, skipping
[INFO] org/apache already added, skipping
[INFO] org/apache/myfaces already added, skipping
[INFO] org/apache/myfaces/extensions already added, skipping
[INFO] org/apache/myfaces/extensions/validator already added, skipping
[INFO] META-INF already added, skipping
[INFO] META-INF/LICENSE already added, skipping
[INFO] META-INF/NOTICE already added, skipping
[INFO] META-INF/DEPENDENCIES already added, skipping
[INFO] [jar:test-jar {execution: default}]
[INFO] Building jar: <https://builds.apache.org/job/ExtVal%20for%20JSF%202.0%20(nightly)/ws/branch_for_jsf_2_0/test-modules/core-tests/target/myfaces-extval-core-tests-2.0.8-SNAPSHOT-tests.jar>
[INFO] [checkstyle:check {execution: verify-style}]
[INFO] 
[INFO] [install:install {execution: default-install}]
[INFO] Installing <https://builds.apache.org/job/ExtVal%20for%20JSF%202.0%20(nightly)/ws/branch_for_jsf_2_0/test-modules/core-tests/target/myfaces-extval-core-tests-2.0.8-SNAPSHOT.jar>
to /home/jenkins/jenkins-slave/maven-repositories/1/org/apache/myfaces/extensions/validator/test-modules/myfaces-extval-core-tests/2.0.8-SNAPSHOT/myfaces-extval-core-tests-2.0.8-SNAPSHOT.jar
[INFO] Installing <https://builds.apache.org/job/ExtVal%20for%20JSF%202.0%20(nightly)/ws/branch_for_jsf_2_0/test-modules/core-tests/target/myfaces-extval-core-tests-2.0.8-SNAPSHOT-sources.jar>
to /home/jenkins/jenkins-slave/maven-repositories/1/org/apache/myfaces/extensions/validator/test-modules/myfaces-extval-core-tests/2.0.8-SNAPSHOT/myfaces-extval-core-tests-2.0.8-SNAPSHOT-sources.jar
[INFO] Installing <https://builds.apache.org/job/ExtVal%20for%20JSF%202.0%20(nightly)/ws/branch_for_jsf_2_0/test-modules/core-tests/target/myfaces-extval-core-tests-2.0.8-SNAPSHOT-test-sources.jar>
to /home/jenkins/jenkins-slave/maven-repositories/1/org/apache/myfaces/extensions/validator/test-modules/myfaces-extval-core-tests/2.0.8-SNAPSHOT/myfaces-extval-core-tests-2.0.8-SNAPSHOT-test-sources.jar
[INFO] Installing <https://builds.apache.org/job/ExtVal%20for%20JSF%202.0%20(nightly)/ws/branch_for_jsf_2_0/test-modules/core-tests/target/myfaces-extval-core-tests-2.0.8-SNAPSHOT-tests.jar>
to /home/jenkins/jenkins-slave/maven-repositories/1/org/apache/myfaces/extensions/validator/test-modules/myfaces-extval-core-tests/2.0.8-SNAPSHOT/myfaces-extval-core-tests-2.0.8-SNAPSHOT-tests.jar
[INFO] ------------------------------------------------------------------------
[INFO] Building MyFaces Extensions-Validator Property-Validation-Tests
[INFO]    task-segment: [clean, install]
[INFO] ------------------------------------------------------------------------
[INFO] [clean:clean {execution: default-clean}]
[WARNING] DEPRECATED [tasks]: Use target instead
[INFO] [antrun:run {execution: javadoc.resources}]
[WARNING] Parameter tasks is deprecated, use target instead
[INFO] Executing tasks

main:
[INFO] Executed tasks
[INFO] [remote-resources:process {execution: default}]
[debug] execute contextualize
[INFO] [resources:resources {execution: default-resources}]
[INFO] Using 'UTF-8' encoding to copy filtered resources.
[INFO] skip non existing resourceDirectory <https://builds.apache.org/job/ExtVal%20for%20JSF%202.0%20(nightly)/ws/branch_for_jsf_2_0/test-modules/property-validation-tests/src/main/config>
[INFO] skip non existing resourceDirectory <https://builds.apache.org/job/ExtVal%20for%20JSF%202.0%20(nightly)/ws/branch_for_jsf_2_0/test-modules/property-validation-tests/src/main/resources>
[INFO] skip non existing resourceDirectory <https://builds.apache.org/job/ExtVal%20for%20JSF%202.0%20(nightly)/ws/branch_for_jsf_2_0/test-modules/property-validation-tests/src/main/java>
[INFO] Copying 3 resources
[INFO] [compiler:compile {execution: default-compile}]
[INFO] No sources to compile
[debug] execute contextualize
[INFO] [resources:testResources {execution: default-testResources}]
[INFO] Using 'UTF-8' encoding to copy filtered resources.
[INFO] Copying 0 resource
[INFO] Copying 3 resources
[INFO] [compiler:testCompile {execution: default-testCompile}]
[INFO] Compiling 97 source files to <https://builds.apache.org/job/ExtVal%20for%20JSF%202.0%20(nightly)/ws/branch_for_jsf_2_0/test-modules/property-validation-tests/target/test-classes>
[INFO] [surefire:test {execution: default-test}]
[INFO] Surefire report directory: <https://builds.apache.org/job/ExtVal%20for%20JSF%202.0%20(nightly)/ws/branch_for_jsf_2_0/test-modules/property-validation-tests/target/surefire-reports>
/bin/sh: 1: Syntax error: "(" unexpected
[ERROR] There are test failures.

Please refer to <https://builds.apache.org/job/ExtVal%20for%20JSF%202.0%20(nightly)/ws/branch_for_jsf_2_0/test-modules/property-validation-tests/target/surefire-reports>
for the individual test results.
[JENKINS] Recording test results
[INFO] [jar:jar {execution: default-jar}]
[INFO] Building jar: <https://builds.apache.org/job/ExtVal%20for%20JSF%202.0%20(nightly)/ws/branch_for_jsf_2_0/test-modules/property-validation-tests/target/myfaces-extval-property-validation-tests-2.0.8-SNAPSHOT.jar>
[INFO] Preparing source:jar
[WARNING] Removing: jar from forked lifecycle, to prevent recursive invocation.
[WARNING] DEPRECATED [tasks]: Use target instead
[INFO] [antrun:run {execution: javadoc.resources}]
[WARNING] Parameter tasks is deprecated, use target instead
[INFO] Executing tasks

main:
[INFO] Executed tasks
ERROR: Could not find local repository for 2.2.1
[INFO] [source:jar {execution: attach-sources}]
[INFO] META-INF already added, skipping
[INFO] META-INF/LICENSE already added, skipping
[INFO] META-INF/NOTICE already added, skipping
[INFO] META-INF/DEPENDENCIES already added, skipping
[INFO] Building jar: <https://builds.apache.org/job/ExtVal%20for%20JSF%202.0%20(nightly)/ws/branch_for_jsf_2_0/test-modules/property-validation-tests/target/myfaces-extval-property-validation-tests-2.0.8-SNAPSHOT-sources.jar>
[INFO] META-INF already added, skipping
[INFO] META-INF/LICENSE already added, skipping
[INFO] META-INF/NOTICE already added, skipping
[INFO] META-INF/DEPENDENCIES already added, skipping
[INFO] Preparing source:test-jar
[WARNING] Removing: jar from forked lifecycle, to prevent recursive invocation.
[WARNING] Removing: test-jar from forked lifecycle, to prevent recursive invocation.
[WARNING] DEPRECATED [tasks]: Use target instead
Build timed out (after 180 minutes). Marking the build as failed.
[INFO] ------------------------------------------------------------------------
[ERROR] FATAL ERROR
[INFO] ------------------------------------------------------------------------
[INFO] Unable to call setResult. Invalid object ID 11
[INFO] ------------------------------------------------------------------------
[INFO] Trace
java.lang.IllegalStateException: Unable to call setResult. Invalid object ID 11
	at hudson.remoting.RemoteInvocationHandler$RPCRequest.perform(RemoteInvocationHandler.java:293)
	at hudson.remoting.RemoteInvocationHandler$RPCRequest.call(RemoteInvocationHandler.java:280)
	at hudson.remoting.RemoteInvocationHandler$RPCRequest.call(RemoteInvocationHandler.java:239)
	at hudson.remoting.UserRequest.perform(UserRequest.java:118)
	at hudson.remoting.UserRequest.perform(UserRequest.java:48)
	at hudson.remoting.Request$2.run(Request.java:328)
	at hudson.remoting.InterceptingExecutorService$1.call(InterceptingExecutorService.java:72)
	at java.util.concurrent.FutureTask$Sync.innerRun(FutureTask.java:334)
	at java.util.concurrent.FutureTask.run(FutureTask.java:166)
	at java.util.concurrent.ThreadPoolExecutor.runWorker(ThreadPoolExecutor.java:1145)
	at java.util.concurrent.ThreadPoolExecutor$Worker.run(ThreadPoolExecutor.java:615)
	at java.lang.Thread.run(Thread.java:724)
[INFO] ------------------------------------------------------------------------
[INFO] Total time: 179 minutes 1 second
[INFO] Finished at: Fri Dec 06 22:19:25 UTC 2013
[INFO] Final Memory: 84M/379M
[INFO] ------------------------------------------------------------------------
channel stopped

Mime
View raw message