myfaces-commits mailing list archives

Site index · List index
Message view « Date » · « Thread »
Top « Date » · « Thread »
From Apache Jenkins Server <jenk...@builds.apache.org>
Subject Build failed in Jenkins: myfaces-current21 #2085
Date Tue, 04 Feb 2014 08:24:37 GMT
See <https://builds.apache.org/job/myfaces-current21/2085/>

------------------------------------------
[...truncated 3857 lines...]
[INFO] generated file myfaces_facelets_html_2_1.xsd is up to date
[INFO] [myfaces-builder:make-config {execution: make_c_facelet_xsd}]
[INFO] generated file myfaces_facelets_c_2_1.xsd is up to date
[INFO] [myfaces-builder:make-config {execution: make_ui_facelet_xsd}]
[INFO] generated file myfaces_facelets_ui_2_1.xsd is up to date
[INFO] [myfaces-builder:make-config {execution: make_composite_facelet_xsd}]
[INFO] generated file myfaces_facelets_composite_2_1.xsd is up to date
ERROR: Could not find local repository for 2.2.1
[INFO] [source:jar {execution: attach-source}]
[INFO] Building jar: <https://builds.apache.org/job/myfaces-current21/ws/current21/core/impl/target/myfaces-impl-2.1.15-SNAPSHOT-sources.jar>
[INFO] [jar:test-jar {execution: default}]
[INFO] Building jar: <https://builds.apache.org/job/myfaces-current21/ws/current21/core/impl/target/myfaces-impl-2.1.15-SNAPSHOT-tests.jar>
[INFO] [shade:shade {execution: default}]
[INFO] Excluding org.apache.myfaces.core:myfaces-api:jar:2.1.15-SNAPSHOT from the shaded jar.
[INFO] Excluding org.apache.myfaces.core.internal:myfaces-impl-shared-public:jar:2.1.15-SNAPSHOT
from the shaded jar.
[INFO] Excluding commons-codec:commons-codec:jar:1.3 from the shaded jar.
[INFO] Including org.apache.myfaces.core.internal:myfaces-impl-shared:jar:2.1.15-SNAPSHOT
in the shaded jar.
[INFO] snapshot org.apache.myfaces.core.internal:myfaces-impl-shared:2.1.15-SNAPSHOT: checking
for updates from tomcat
[INFO] snapshot org.apache.myfaces.core.internal:myfaces-impl-shared:2.1.15-SNAPSHOT: checking
for updates from apache.snapshots
[INFO] Excluding org.apache.geronimo.specs:geronimo-validation_1.0_spec:jar:1.1 from the shaded
jar.
[INFO] Excluding org.apache.geronimo.specs:geronimo-jpa_3.0_spec:jar:1.1.1 from the shaded
jar.
[INFO] Excluding org.apache.geronimo.specs:geronimo-ejb_3.0_spec:jar:1.0.1 from the shaded
jar.
[INFO] Excluding commons-collections:commons-collections:jar:3.2 from the shaded jar.
[INFO] Excluding commons-beanutils:commons-beanutils:jar:1.8.3 from the shaded jar.
[INFO] Excluding commons-logging:commons-logging:jar:1.1.1 from the shaded jar.
[INFO] Excluding commons-digester:commons-digester:jar:1.8 from the shaded jar.
[INFO] Excluding org.apache.tomcat:catalina:jar:6.0.29 from the shaded jar.
[INFO] Excluding org.apache.tomcat:servlet-api:jar:6.0.29 from the shaded jar.
[INFO] Excluding org.apache.tomcat:juli:jar:6.0.29 from the shaded jar.
[INFO] Excluding org.apache.tomcat:annotations-api:jar:6.0.29 from the shaded jar.
[INFO] Excluding org.apache.tomcat:tomcat-catalina:jar:7.0.0 from the shaded jar.
[INFO] Excluding org.apache.tomcat:tomcat-servlet-api:jar:7.0.0 from the shaded jar.
[INFO] Excluding org.apache.tomcat:tomcat-juli:jar:7.0.0 from the shaded jar.
[INFO] Excluding org.apache.tomcat:tomcat-annotations-api:jar:7.0.0 from the shaded jar.
[INFO] Excluding org.apache.tomcat:tomcat-api:jar:7.0.0 from the shaded jar.
[INFO] Excluding org.apache.tomcat:tomcat-util:jar:7.0.0 from the shaded jar.
[INFO] Excluding com.google.code.guice:guice:jar:1.0 from the shaded jar.
[INFO] Replacing original artifact with shaded artifact.
[INFO] Replacing <https://builds.apache.org/job/myfaces-current21/ws/current21/core/impl/target/myfaces-impl-2.1.15-SNAPSHOT.jar>
with <https://builds.apache.org/job/myfaces-current21/ws/current21/core/impl/target/myfaces-impl-2.1.15-SNAPSHOT-shaded.jar>
[INFO] Replacing <https://builds.apache.org/job/myfaces-current21/ws/current21/core/impl/target/myfaces-impl-2.1.15-SNAPSHOT-sources.jar>
with <https://builds.apache.org/job/myfaces-current21/ws/current21/core/impl/target/myfaces-impl-2.1.15-SNAPSHOT-shaded-sources.jar>
[INFO] [checkstyle:check {execution: verify-style}]
[INFO] 
[INFO] [install:install {execution: default-install}]
[INFO] Installing <https://builds.apache.org/job/myfaces-current21/ws/current21/core/impl/target/myfaces-impl-2.1.15-SNAPSHOT.jar>
to /home/jenkins/jenkins-slave/maven-repositories/1/org/apache/myfaces/core/myfaces-impl/2.1.15-SNAPSHOT/myfaces-impl-2.1.15-SNAPSHOT.jar
[INFO] Installing <https://builds.apache.org/job/myfaces-current21/ws/current21/core/impl/target/myfaces-impl-2.1.15-SNAPSHOT-sources.jar>
to /home/jenkins/jenkins-slave/maven-repositories/1/org/apache/myfaces/core/myfaces-impl/2.1.15-SNAPSHOT/myfaces-impl-2.1.15-SNAPSHOT-sources.jar
[INFO] Installing <https://builds.apache.org/job/myfaces-current21/ws/current21/core/impl/target/myfaces-impl-2.1.15-SNAPSHOT-tests.jar>
to /home/jenkins/jenkins-slave/maven-repositories/1/org/apache/myfaces/core/myfaces-impl/2.1.15-SNAPSHOT/myfaces-impl-2.1.15-SNAPSHOT-tests.jar
[INFO] Installing <https://builds.apache.org/job/myfaces-current21/ws/current21/core/impl/target/myfaces-impl-2.1.15-SNAPSHOT-sources.jar>
to /home/jenkins/jenkins-slave/maven-repositories/1/org/apache/myfaces/core/myfaces-impl/2.1.15-SNAPSHOT/myfaces-impl-2.1.15-SNAPSHOT-sources.jar
[INFO] ------------------------------------------------------------------------
[INFO] Building Apache MyFaces JSF-2.1 Core OSGi Bundle
[INFO]    task-segment: [install]
[INFO] ------------------------------------------------------------------------
[INFO] [remote-resources:process {execution: default}]
[debug] execute contextualize
[INFO] [resources:resources {execution: default-resources}]
[INFO] Using 'UTF-8' encoding to copy filtered resources.
[INFO] skip non existing resourceDirectory <https://builds.apache.org/job/myfaces-current21/ws/current21/core/bundle/src/main/resources>
[INFO] Copying 3 resources
[INFO] [compiler:compile {execution: default-compile}]
[INFO] No sources to compile
[debug] execute contextualize
[INFO] [resources:testResources {execution: default-testResources}]
[INFO] Using 'UTF-8' encoding to copy filtered resources.
[INFO] skip non existing resourceDirectory <https://builds.apache.org/job/myfaces-current21/ws/current21/core/bundle/src/test/resources>
[INFO] Copying 3 resources
[INFO] [compiler:testCompile {execution: default-testCompile}]
[INFO] No sources to compile
[INFO] [surefire:test {execution: default-test}]
[INFO] Surefire report directory: <https://builds.apache.org/job/myfaces-current21/ws/current21/core/bundle/target/surefire-reports>

-------------------------------------------------------
 T E S T S
-------------------------------------------------------

Results :

Tests run: 0, Failures: 0, Errors: 0, Skipped: 0

[JENKINS] Recording test results[INFO] [bundle:bundle {execution: default-bundle}]

[INFO] Preparing source:jar
[WARNING] Removing: jar from forked lifecycle, to prevent recursive invocation.
[INFO] No goals needed for project - skipping
[INFO] [source:jar {execution: attach-source}]
[INFO] Building jar: <https://builds.apache.org/job/myfaces-current21/ws/current21/core/bundle/target/myfaces-bundle-2.1.15-SNAPSHOT-sources.jar>
[INFO] [checkstyle:check {execution: verify-style}]
[INFO] 
[INFO] [install:install {execution: default-install}]
[INFO] Installing <https://builds.apache.org/job/myfaces-current21/ws/current21/core/bundle/target/myfaces-bundle-2.1.15-SNAPSHOT.jar>
to /home/jenkins/jenkins-slave/maven-repositories/1/org/apache/myfaces/core/myfaces-bundle/2.1.15-SNAPSHOT/myfaces-bundle-2.1.15-SNAPSHOT.jar
[INFO] Installing <https://builds.apache.org/job/myfaces-current21/ws/current21/core/bundle/target/myfaces-bundle-2.1.15-SNAPSHOT-sources.jar>
to /home/jenkins/jenkins-slave/maven-repositories/1/org/apache/myfaces/core/myfaces-bundle/2.1.15-SNAPSHOT/myfaces-bundle-2.1.15-SNAPSHOT-sources.jar
[INFO] [bundle:install {execution: default-install}]
[WARNING] Exception while updating local OBR: Unable to read repository xml: file:/home/jenkins/jenkins-slave/maven-repositories/1/repository.xml
org.apache.maven.plugin.MojoExecutionException: Unable to read repository xml: file:/home/jenkins/jenkins-slave/maven-repositories/1/repository.xml
	at org.apache.felix.obrplugin.ObrUpdate.parseRepositoryXml(ObrUpdate.java:295)
	at org.apache.felix.obrplugin.ObrInstall.execute(ObrInstall.java:140)
	at org.apache.maven.plugin.DefaultPluginManager.executeMojo(DefaultPluginManager.java:490)
	at hudson.maven.agent.PluginManagerInterceptor.executeMojo(PluginManagerInterceptor.java:182)
	at org.apache.maven.lifecycle.DefaultLifecycleExecutor.executeGoals(DefaultLifecycleExecutor.java:694)
	at org.apache.maven.lifecycle.DefaultLifecycleExecutor.executeGoalWithLifecycle(DefaultLifecycleExecutor.java:556)
	at org.apache.maven.lifecycle.DefaultLifecycleExecutor.executeGoal(DefaultLifecycleExecutor.java:535)
	at org.apache.maven.lifecycle.DefaultLifecycleExecutor.executeGoalAndHandleFailures(DefaultLifecycleExecutor.java:387)
	at org.apache.maven.lifecycle.DefaultLifecycleExecutor.executeTaskSegments(DefaultLifecycleExecutor.java:348)
	at org.apache.maven.lifecycle.DefaultLifecycleExecutor.execute(DefaultLifecycleExecutor.java:180)
	at org.apache.maven.lifecycle.LifecycleExecutorInterceptor.execute(LifecycleExecutorInterceptor.java:65)
	at org.apache.maven.DefaultMaven.doExecute(DefaultMaven.java:328)
	at org.apache.maven.DefaultMaven.execute(DefaultMaven.java:138)
	at org.apache.maven.cli.MavenCli.main(MavenCli.java:362)
	at sun.reflect.NativeMethodAccessorImpl.invoke0(Native Method)
	at sun.reflect.NativeMethodAccessorImpl.invoke(NativeMethodAccessorImpl.java:39)
	at sun.reflect.DelegatingMethodAccessorImpl.invoke(DelegatingMethodAccessorImpl.java:25)
	at java.lang.reflect.Method.invoke(Method.java:597)
	at org.codehaus.classworlds.Launcher.launchEnhanced(Launcher.java:315)
	at org.codehaus.classworlds.Launcher.launch(Launcher.java:255)
	at hudson.maven.agent.Main.launch(Main.java:204)
	at hudson.maven.MavenBuilder.call(MavenBuilder.java:154)
	at hudson.maven.Maven2Builder.call(Maven2Builder.java:79)
	at hudson.maven.Maven2Builder.call(Maven2Builder.java:55)
	at hudson.remoting.UserRequest.perform(UserRequest.java:118)
	at hudson.remoting.UserRequest.perform(UserRequest.java:48)
	at hudson.remoting.Request$2.run(Request.java:328)
	at hudson.remoting.InterceptingExecutorService$1.call(InterceptingExecutorService.java:72)
	at java.util.concurrent.FutureTask$Sync.innerRun(FutureTask.java:303)
	at java.util.concurrent.FutureTask.run(FutureTask.java:138)
	at java.util.concurrent.ThreadPoolExecutor$Worker.runTask(ThreadPoolExecutor.java:895)
	at java.util.concurrent.ThreadPoolExecutor$Worker.run(ThreadPoolExecutor.java:918)
	at java.lang.Thread.run(Thread.java:662)
Caused by: org.xmlpull.v1.XmlPullParserException: unexpected type (position:END_DOCUMENT null@3:1
in java.io.InputStreamReader@31e5ad) 
	at org.kxml2.io.KXmlParser.exception(Unknown Source)
	at org.kxml2.io.KXmlParser.nextTag(Unknown Source)
	at org.apache.felix.bundlerepository.impl.PullParser.parseRepository(PullParser.java:43)
	at org.apache.felix.bundlerepository.impl.DataModelHelperImpl.repository(DataModelHelperImpl.java:147)
	at org.apache.felix.bundlerepository.impl.DataModelHelperImpl.repository(DataModelHelperImpl.java:118)
	at org.apache.felix.obrplugin.ObrUpdate.parseRepositoryXml(ObrUpdate.java:291)
	... 32 more
[INFO] ------------------------------------------------------------------------
[INFO] Building Apache MyFaces JSF-2.1 Core Module
[INFO]    task-segment: [install]
[INFO] ------------------------------------------------------------------------
[INFO] [remote-resources:process {execution: default}]
[INFO] [site:attach-descriptor {execution: default-attach-descriptor}]
[INFO] [checkstyle:check {execution: verify-style}]
[INFO] 
[INFO] [install:install {execution: default-install}]
[INFO] Installing <https://builds.apache.org/job/myfaces-current21/ws/current21/core/pom.xml>
to /home/jenkins/jenkins-slave/maven-repositories/1/org/apache/myfaces/core/myfaces-core-module/2.1.15-SNAPSHOT/myfaces-core-module-2.1.15-SNAPSHOT.pom
[INFO] ------------------------------------------------------------------------
[INFO] Building Apache MyFaces Composite Build
[INFO]    task-segment: [install]
[INFO] ------------------------------------------------------------------------
[INFO] [remote-resources:process {execution: default}]
[INFO] [site:attach-descriptor {execution: default-attach-descriptor}]
[INFO] [checkstyle:check {execution: verify-style}]
[INFO] 
[INFO] [install:install {execution: default-install}]
[INFO] Installing <https://builds.apache.org/job/myfaces-current21/ws/current21/pom.xml>
to /home/jenkins/jenkins-slave/maven-repositories/1/org/apache/myfaces/myfaces-base/2.1.0-SNAPSHOT/myfaces-base-2.1.0-SNAPSHOT.pom
[INFO] 
[INFO] 
[INFO] ------------------------------------------------------------------------
[INFO] Reactor Summary:
[INFO] ------------------------------------------------------------------------
[INFO] Apache MyFaces JSF-2.1 Core Project ................... SUCCESS [10.235s]
[INFO] Apache MyFaces JSF-2.1 Core API ....................... SUCCESS [39.004s]
[INFO] Apache MyFaces Shared For JSF 2.1 - Project ........... SUCCESS [2.664s]
[INFO] Apache MyFaces Shared For JSF 2.1 - Core Mirror ....... SUCCESS [11.061s]
[INFO] MyFaces Shared Tomahawk ............................... SUCCESS [10.108s]
[INFO] Apache MyFaces Shared Public API For JSF 2.1 - Core ... SUCCESS [6.056s]
[INFO] Apache MyFaces Core For JSF 2.1 - Shared .............. SUCCESS [18.665s]
[INFO] Apache MyFaces JSF-2.1 Core Impl ...................... SUCCESS [1:18.449s]
[INFO] Apache MyFaces JSF-2.1 Core OSGi Bundle ............... SUCCESS [3.031s]
[INFO] Apache MyFaces JSF-2.1 Core Module .................... SUCCESS [0.657s]
[INFO] Apache MyFaces Composite Build ........................ SUCCESS [0.727s]
[INFO] ------------------------------------------------------------------------
[INFO] ------------------------------------------------------------------------
[INFO] BUILD SUCCESSFUL
[INFO] ------------------------------------------------------------------------
[INFO] Total time: 3 minutes 20 seconds
[INFO] Finished at: Tue Feb 04 08:23:52 UTC 2014
[INFO] Final Memory: 168M/502M
[INFO] ------------------------------------------------------------------------
[JENKINS] Archiving <https://builds.apache.org/job/myfaces-current21/ws/current21/shared/shared-tomahawk/pom.xml>
to org.apache.myfaces.shared/myfaces-shared-tomahawk/4.1.13-SNAPSHOT/myfaces-shared-tomahawk-4.1.13-SNAPSHOT.pom
[JENKINS] Archiving <https://builds.apache.org/job/myfaces-current21/ws/current21/shared/shared-tomahawk/target/myfaces-shared-tomahawk-4.1.13-SNAPSHOT.jar>
to org.apache.myfaces.shared/myfaces-shared-tomahawk/4.1.13-SNAPSHOT/myfaces-shared-tomahawk-4.1.13-SNAPSHOT.jar
[JENKINS] Archiving <https://builds.apache.org/job/myfaces-current21/ws/current21/shared/shared-tomahawk/target/myfaces-shared-tomahawk-4.1.13-SNAPSHOT-sources.jar>
to org.apache.myfaces.shared/myfaces-shared-tomahawk/4.1.13-SNAPSHOT/myfaces-shared-tomahawk-4.1.13-SNAPSHOT-sources.jar
[JENKINS] Archiving <https://builds.apache.org/job/myfaces-current21/ws/current21/core/shared-public/pom.xml>
to org.apache.myfaces.core.internal/myfaces-impl-shared-public/2.1.15-SNAPSHOT/myfaces-impl-shared-public-2.1.15-SNAPSHOT.pom
[JENKINS] Archiving <https://builds.apache.org/job/myfaces-current21/ws/current21/core/shared-public/target/myfaces-impl-shared-public-2.1.15-SNAPSHOT.jar>
to org.apache.myfaces.core.internal/myfaces-impl-shared-public/2.1.15-SNAPSHOT/myfaces-impl-shared-public-2.1.15-SNAPSHOT.jar
[JENKINS] Archiving <https://builds.apache.org/job/myfaces-current21/ws/current21/core/shared-public/target/myfaces-impl-shared-public-2.1.15-SNAPSHOT-sources.jar>
to org.apache.myfaces.core.internal/myfaces-impl-shared-public/2.1.15-SNAPSHOT/myfaces-impl-shared-public-2.1.15-SNAPSHOT-sources.jar
[JENKINS] Archiving <https://builds.apache.org/job/myfaces-current21/ws/current21/core/impl/pom.xml>
to org.apache.myfaces.core/myfaces-impl/2.1.15-SNAPSHOT/myfaces-impl-2.1.15-SNAPSHOT.pom
[JENKINS] Archiving <https://builds.apache.org/job/myfaces-current21/ws/current21/core/impl/target/myfaces-impl-2.1.15-SNAPSHOT.jar>
to org.apache.myfaces.core/myfaces-impl/2.1.15-SNAPSHOT/myfaces-impl-2.1.15-SNAPSHOT.jar
[JENKINS] Archiving <https://builds.apache.org/job/myfaces-current21/ws/current21/core/impl/target/myfaces-impl-2.1.15-SNAPSHOT-sources.jar>
to org.apache.myfaces.core/myfaces-impl/2.1.15-SNAPSHOT/myfaces-impl-2.1.15-SNAPSHOT-sources.jar
[JENKINS] Archiving <https://builds.apache.org/job/myfaces-current21/ws/current21/core/impl/target/myfaces-impl-2.1.15-SNAPSHOT-tests.jar>
to org.apache.myfaces.core/myfaces-impl/2.1.15-SNAPSHOT/myfaces-impl-2.1.15-SNAPSHOT-tests.jar
[JENKINS] Archiving <https://builds.apache.org/job/myfaces-current21/ws/current21/shared/core/pom.xml>
to org.apache.myfaces.shared/myfaces-shared-core/4.1.13-SNAPSHOT/myfaces-shared-core-4.1.13-SNAPSHOT.pom
[JENKINS] Archiving <https://builds.apache.org/job/myfaces-current21/ws/current21/shared/core/target/myfaces-shared-core-4.1.13-SNAPSHOT.jar>
to org.apache.myfaces.shared/myfaces-shared-core/4.1.13-SNAPSHOT/myfaces-shared-core-4.1.13-SNAPSHOT.jar
[JENKINS] Archiving <https://builds.apache.org/job/myfaces-current21/ws/current21/shared/core/target/myfaces-shared-core-4.1.13-SNAPSHOT-sources.jar>
to org.apache.myfaces.shared/myfaces-shared-core/4.1.13-SNAPSHOT/myfaces-shared-core-4.1.13-SNAPSHOT-sources.jar
[JENKINS] Archiving <https://builds.apache.org/job/myfaces-current21/ws/current21/core/bundle/pom.xml>
to org.apache.myfaces.core/myfaces-bundle/2.1.15-SNAPSHOT/myfaces-bundle-2.1.15-SNAPSHOT.pom
[JENKINS] Archiving <https://builds.apache.org/job/myfaces-current21/ws/current21/core/bundle/target/myfaces-bundle-2.1.15-SNAPSHOT.jar>
to org.apache.myfaces.core/myfaces-bundle/2.1.15-SNAPSHOT/myfaces-bundle-2.1.15-SNAPSHOT.jar
[JENKINS] Archiving <https://builds.apache.org/job/myfaces-current21/ws/current21/core/bundle/target/myfaces-bundle-2.1.15-SNAPSHOT-sources.jar>
to org.apache.myfaces.core/myfaces-bundle/2.1.15-SNAPSHOT/myfaces-bundle-2.1.15-SNAPSHOT-sources.jar
[JENKINS] Archiving <https://builds.apache.org/job/myfaces-current21/ws/current21/core/api/pom.xml>
to org.apache.myfaces.core/myfaces-api/2.1.15-SNAPSHOT/myfaces-api-2.1.15-SNAPSHOT.pom
[JENKINS] Archiving <https://builds.apache.org/job/myfaces-current21/ws/current21/core/api/target/myfaces-api-2.1.15-SNAPSHOT.jar>
to org.apache.myfaces.core/myfaces-api/2.1.15-SNAPSHOT/myfaces-api-2.1.15-SNAPSHOT.jar
[JENKINS] Archiving <https://builds.apache.org/job/myfaces-current21/ws/current21/core/api/target/myfaces-api-2.1.15-SNAPSHOT-sources.jar>
to org.apache.myfaces.core/myfaces-api/2.1.15-SNAPSHOT/myfaces-api-2.1.15-SNAPSHOT-sources.jar
[JENKINS] Archiving <https://builds.apache.org/job/myfaces-current21/ws/current21/core/api/target/myfaces-api-2.1.15-SNAPSHOT-tests.jar>
to org.apache.myfaces.core/myfaces-api/2.1.15-SNAPSHOT/myfaces-api-2.1.15-SNAPSHOT-tests.jar
[JENKINS] Archiving /home/jenkins/jenkins-slave/maven-repositories/1/org/apache/myfaces/shared/myfaces-shared-project/4.1.13-SNAPSHOT/myfaces-shared-project-4.1.13-SNAPSHOT.pom
to org.apache.myfaces.shared/myfaces-shared-project/4.1.13-SNAPSHOT/myfaces-shared-project-4.1.13-SNAPSHOT.pom
[JENKINS] Archiving <https://builds.apache.org/job/myfaces-current21/ws/current21/shared/target/myfaces-shared-project-4.1.13-SNAPSHOT-site.xml>
to org.apache.myfaces.shared/myfaces-shared-project/4.1.13-SNAPSHOT/myfaces-shared-project-4.1.13-SNAPSHOT-site.xml
/home/jenkins/jenkins-slave/maven-repositories/1/org/apache/myfaces/shared/myfaces-shared-project/4.1.13-SNAPSHOT/myfaces-shared-project-4.1.13-SNAPSHOT.pom
is not inside <https://builds.apache.org/job/myfaces-current21/ws/current21/shared/;>
will archive in a separate pass
[JENKINS] Archiving /home/jenkins/jenkins-slave/maven-repositories/1/org/apache/myfaces/core/myfaces-core-project/2.1.15-SNAPSHOT/myfaces-core-project-2.1.15-SNAPSHOT.pom
to org.apache.myfaces.core/myfaces-core-project/2.1.15-SNAPSHOT/myfaces-core-project-2.1.15-SNAPSHOT.pom
[JENKINS] Archiving <https://builds.apache.org/job/myfaces-current21/ws/current21/core/parent/target/myfaces-core-project-2.1.15-SNAPSHOT-site.xml>
to org.apache.myfaces.core/myfaces-core-project/2.1.15-SNAPSHOT/myfaces-core-project-2.1.15-SNAPSHOT-site.xml
/home/jenkins/jenkins-slave/maven-repositories/1/org/apache/myfaces/core/myfaces-core-project/2.1.15-SNAPSHOT/myfaces-core-project-2.1.15-SNAPSHOT.pom
is not inside <https://builds.apache.org/job/myfaces-current21/ws/current21/core/parent/;>
will archive in a separate pass
[JENKINS] Archiving /home/jenkins/jenkins-slave/maven-repositories/1/org/apache/myfaces/core/myfaces-core-module/2.1.15-SNAPSHOT/myfaces-core-module-2.1.15-SNAPSHOT.pom
to org.apache.myfaces.core/myfaces-core-module/2.1.15-SNAPSHOT/myfaces-core-module-2.1.15-SNAPSHOT.pom
/home/jenkins/jenkins-slave/maven-repositories/1/org/apache/myfaces/core/myfaces-core-module/2.1.15-SNAPSHOT/myfaces-core-module-2.1.15-SNAPSHOT.pom
is not inside <https://builds.apache.org/job/myfaces-current21/ws/current21/core/;>
will archive in a separate pass
[JENKINS] Archiving /home/jenkins/jenkins-slave/maven-repositories/1/org/apache/myfaces/myfaces-base/2.1.0-SNAPSHOT/myfaces-base-2.1.0-SNAPSHOT.pom
to org.apache.myfaces/myfaces-base/2.1.0-SNAPSHOT/myfaces-base-2.1.0-SNAPSHOT.pom
/home/jenkins/jenkins-slave/maven-repositories/1/org/apache/myfaces/myfaces-base/2.1.0-SNAPSHOT/myfaces-base-2.1.0-SNAPSHOT.pom
is not inside <https://builds.apache.org/job/myfaces-current21/ws/current21/;> will
archive in a separate pass
[JENKINS] Archiving <https://builds.apache.org/job/myfaces-current21/ws/current21/core/shared/pom.xml>
to org.apache.myfaces.core.internal/myfaces-impl-shared/2.1.15-SNAPSHOT/myfaces-impl-shared-2.1.15-SNAPSHOT.pom
[JENKINS] Archiving <https://builds.apache.org/job/myfaces-current21/ws/current21/core/shared/target/myfaces-impl-shared-2.1.15-SNAPSHOT.jar>
to org.apache.myfaces.core.internal/myfaces-impl-shared/2.1.15-SNAPSHOT/myfaces-impl-shared-2.1.15-SNAPSHOT.jar
[JENKINS] Archiving <https://builds.apache.org/job/myfaces-current21/ws/current21/core/shared/target/myfaces-impl-shared-2.1.15-SNAPSHOT-sources.jar>
to org.apache.myfaces.core.internal/myfaces-impl-shared/2.1.15-SNAPSHOT/myfaces-impl-shared-2.1.15-SNAPSHOT-sources.jar
channel stopped
Maven RedeployPublisher use remote ubuntu1 maven settings from : /home/jenkins/.m2/settings.xml
[INFO] Deployment in https://repository.apache.org/content/repositories/snapshots (id=apache.snapshots.https,uniqueVersion=false)
Deploying the main artifact jenkins-7752856676536556989myfaces-base-2.1.0-SNAPSHOT.pom
[INFO] Deployment in https://repository.apache.org/content/repositories/snapshots (id=apache.snapshots.https,uniqueVersion=false)
Deploying the main artifact jenkins-2243889180657745185myfaces-api-2.1.15-SNAPSHOT.jar
Deploying the main artifact jenkins-7610146123832529053myfaces-api-2.1.15-SNAPSHOT-sources.jar
Deploying the main artifact jenkins-4029727894882400526myfaces-api-2.1.15-SNAPSHOT-tests.jar
[INFO] Deployment in https://repository.apache.org/content/repositories/snapshots (id=apache.snapshots.https,uniqueVersion=false)
Deploying the main artifact jenkins-6971323906552582679myfaces-bundle-2.1.15-SNAPSHOT.jar
ERROR: Error installing artifact's metadata: Error while deploying metadata: Failed to transfer
file: https://repository.apache.org/content/repositories/snapshots/org/apache/myfaces/core/myfaces-bundle/2.1.15-SNAPSHOT/myfaces-bundle-2.1.15-SNAPSHOT.pom.md5.
Return code is: 502, ReasonPhrase: Proxy Error.
org.apache.maven.artifact.deployer.ArtifactDeploymentException: Error installing artifact's
metadata: Error while deploying metadata: Failed to transfer file: https://repository.apache.org/content/repositories/snapshots/org/apache/myfaces/core/myfaces-bundle/2.1.15-SNAPSHOT/myfaces-bundle-2.1.15-SNAPSHOT.pom.md5.
Return code is: 502, ReasonPhrase: Proxy Error.
	at hudson.maven.artifact.deployer.DefaultArtifactDeployer.deploy(DefaultArtifactDeployer.java:183)
	at hudson.maven.reporters.MavenArtifactRecord.deploy(MavenArtifactRecord.java:191)
	at hudson.maven.RedeployPublisher.perform(RedeployPublisher.java:176)
	at hudson.tasks.BuildStepMonitor$1.perform(BuildStepMonitor.java:20)
	at hudson.model.AbstractBuild$AbstractBuildExecution.perform(AbstractBuild.java:785)
	at hudson.model.AbstractBuild$AbstractBuildExecution.performAllBuildSteps(AbstractBuild.java:757)
	at hudson.maven.MavenModuleSetBuild$MavenModuleSetBuildExecution.post2(MavenModuleSetBuild.java:1030)
	at hudson.model.AbstractBuild$AbstractBuildExecution.post(AbstractBuild.java:706)
	at hudson.model.Run.execute(Run.java:1703)
	at hudson.maven.MavenModuleSetBuild.run(MavenModuleSetBuild.java:519)
	at hudson.model.ResourceController.execute(ResourceController.java:88)
	at hudson.model.Executor.run(Executor.java:231)
Caused by: org.apache.maven.artifact.repository.metadata.RepositoryMetadataDeploymentException:
Error while deploying metadata: Failed to transfer file: https://repository.apache.org/content/repositories/snapshots/org/apache/myfaces/core/myfaces-bundle/2.1.15-SNAPSHOT/myfaces-bundle-2.1.15-SNAPSHOT.pom.md5.
Return code is: 502, ReasonPhrase: Proxy Error.
	at org.apache.maven.artifact.repository.metadata.DefaultRepositoryMetadataManager.deploy(DefaultRepositoryMetadataManager.java:492)
	at hudson.maven.artifact.deployer.DefaultArtifactDeployer.deploy(DefaultArtifactDeployer.java:167)
	... 11 more
Caused by: org.apache.maven.wagon.TransferFailedException: Failed to transfer file: https://repository.apache.org/content/repositories/snapshots/org/apache/myfaces/core/myfaces-bundle/2.1.15-SNAPSHOT/myfaces-bundle-2.1.15-SNAPSHOT.pom.md5.
Return code is: 502, ReasonPhrase: Proxy Error.
	at org.apache.maven.wagon.shared.http4.AbstractHttpClientWagon.put(AbstractHttpClientWagon.java:626)
	at org.apache.maven.wagon.shared.http4.AbstractHttpClientWagon.put(AbstractHttpClientWagon.java:524)
	at org.apache.maven.wagon.shared.http4.AbstractHttpClientWagon.put(AbstractHttpClientWagon.java:505)
	at org.apache.maven.wagon.shared.http4.AbstractHttpClientWagon.put(AbstractHttpClientWagon.java:485)
	at org.apache.maven.repository.legacy.DefaultWagonManager.putRemoteFile(DefaultWagonManager.java:569)
	at org.apache.maven.repository.legacy.DefaultWagonManager.putArtifactMetadata(DefaultWagonManager.java:501)
	at org.apache.maven.artifact.repository.metadata.DefaultRepositoryMetadataManager.deploy(DefaultRepositoryMetadataManager.java:488)
	... 12 more
[INFO] Deployment failed after 39 sec
Build step 'Deploy artifacts to Maven repository' changed build result to FAILURE

Mime
View raw message