myfaces-commits mailing list archives

Site index · List index
Message view « Date » · « Thread »
Top « Date » · « Thread »
From Apache Jenkins Server <jenk...@builds.apache.org>
Subject Build failed in Jenkins: tobago-1.0.x #752
Date Tue, 04 Feb 2014 19:26:19 GMT
See <https://builds.apache.org/job/tobago-1.0.x/752/changes>

Changes:

[lofwyr] spell

------------------------------------------
[...truncated 2400 lines...]
[INFO]   Tobago Tool
[INFO]   Maven Apt Plugin
[INFO]   Maven Tobago Theme Plugin
[INFO]   Tobago Annotation
[INFO]   Tobago Apt
[INFO]   Tobago Core
[INFO]   Tobago Themes
[INFO]   Theme Standard
[INFO]   Theme Scarborough
[INFO]   Theme Speyside
[INFO]   Theme Richmond
[INFO]   Theme Charlotteville
[INFO]   Tobago Extensions
[INFO]   Tobago Fileupload
[INFO]   Tobago Security
[INFO]   Tobago Facelets
[INFO]   Tobago Examples
[INFO]   Example Addressbook
[INFO]   Example Addressbook Library
[INFO]   Example Addressbook Webapp
[INFO]   Example Blank
[INFO]   Data for Examples
[INFO]   Example Demo
[INFO]   Example Non-Faces-Request
[INFO]   Tobago Example Experimental
[INFO]   Tobago Example Test
[INFO]   Tobago Example for Portlets
[INFO]   Tobago Sandbox
[INFO]   Example Sandbox
[INFO]   Example Security
[INFO]   Example Facelets
[INFO]   Example Assembly
[INFO]   Theme Example
[INFO]   Tobago FacesMessage Ordering Fix
[INFO]   Tobago Assembly
[INFO] ------------------------------------------------------------------------
[INFO] Building Apache Tobago
[INFO]    task-segment: [clean, install, checkstyle:check]
[INFO] ------------------------------------------------------------------------
[INFO] [clean:clean {execution: default-clean}]
[INFO] Setting property: classpath.resource.loader.class => 'org.codehaus.plexus.velocity.ContextClassLoaderResourceLoader'.
[INFO] Setting property: velocimacro.messages.on => 'false'.
[INFO] Setting property: resource.loader => 'classpath'.
[INFO] Setting property: resource.manager.logwhenfound => 'false'.
[INFO] [remote-resources:process {execution: default}]
[INFO] [site:attach-descriptor {execution: default-attach-descriptor}]
[INFO] Parent project loaded from repository.
[INFO] [install:install {execution: default-install}]
[INFO] Installing <https://builds.apache.org/job/tobago-1.0.x/ws/tobago-1.0.x/pom.xml>
to /home/jenkins/jenkins-slave/maven-repositories/1/org/apache/myfaces/tobago/tobago/1.0.41-SNAPSHOT/tobago-1.0.41-SNAPSHOT.pom
[INFO] Installing <https://builds.apache.org/job/tobago-1.0.x/ws/tobago-1.0.x/target/tobago-1.0.41-SNAPSHOT-site.xml>
to /home/jenkins/jenkins-slave/maven-repositories/1/org/apache/myfaces/tobago/tobago/1.0.41-SNAPSHOT/tobago-1.0.41-SNAPSHOT-site.xml
[INFO] [checkstyle:check {execution: default-cli}]
[INFO] 
[INFO] ------------------------------------------------------------------------
[INFO] Building Tobago Tool
[INFO]    task-segment: [clean, install, checkstyle:check]
[INFO] ------------------------------------------------------------------------
[INFO] [clean:clean {execution: default-clean}]
[INFO] [remote-resources:process {execution: default}]
[INFO] [site:attach-descriptor {execution: default-attach-descriptor}]
[INFO] [install:install {execution: default-install}]
[INFO] Installing <https://builds.apache.org/job/tobago-1.0.x/ws/tobago-1.0.x/tobago-tool/pom.xml>
to /home/jenkins/jenkins-slave/maven-repositories/1/org/apache/myfaces/tobago/tobago-tool/1.0.41-SNAPSHOT/tobago-tool-1.0.41-SNAPSHOT.pom
[INFO] [checkstyle:check {execution: default-cli}]
[INFO] 
[INFO] ------------------------------------------------------------------------
[INFO] Building Maven Apt Plugin
[INFO]    task-segment: [clean, install, checkstyle:check]
[INFO] ------------------------------------------------------------------------
[INFO] [clean:clean {execution: default-clean}]
[INFO] [plugin:descriptor {execution: default-descriptor}]
[INFO] Using 'UTF-8' encoding to read mojo metadata.
[INFO] Applying mojo extractor for language: java
[INFO] Mojo extractor for language: java found 2 mojo descriptors.
[INFO] Applying mojo extractor for language: bsh
[INFO] Mojo extractor for language: bsh found 0 mojo descriptors.
[INFO] [remote-resources:process {execution: default}]
[INFO] [resources:resources {execution: default-resources}]
[INFO] Using 'UTF-8' encoding to copy filtered resources.
[INFO] Copying 2 resources
[INFO] Copying 3 resources
[INFO] [compiler:compile {execution: default-compile}]
[INFO] Compiling 4 source files to <https://builds.apache.org/job/tobago-1.0.x/ws/tobago-1.0.x/tobago-tool/maven-apt-plugin/target/classes>
[INFO] [resources:testResources {execution: default-testResources}]
[INFO] Using 'UTF-8' encoding to copy filtered resources.
[INFO] skip non existing resourceDirectory <https://builds.apache.org/job/tobago-1.0.x/ws/tobago-1.0.x/tobago-tool/maven-apt-plugin/src/test/resources>
[INFO] Copying 3 resources
[INFO] [compiler:testCompile {execution: default-testCompile}]
[INFO] No sources to compile
[INFO] [surefire:test {execution: default-test}]
[INFO] Surefire report directory: <https://builds.apache.org/job/tobago-1.0.x/ws/tobago-1.0.x/tobago-tool/maven-apt-plugin/target/surefire-reports>

-------------------------------------------------------
 T E S T S
-------------------------------------------------------
There are no tests to run.

Results :

Tests run: 0, Failures: 0, Errors: 0, Skipped: 0

[JENKINS] Recording test results
[INFO] [jar:jar {execution: default-jar}]
[INFO] Building jar: <https://builds.apache.org/job/tobago-1.0.x/ws/tobago-1.0.x/tobago-tool/maven-apt-plugin/target/maven-apt-plugin-1.0.41-SNAPSHOT.jar>
[INFO] [plugin:addPluginArtifactMetadata {execution: default-addPluginArtifactMetadata}]
[INFO] [install:install {execution: default-install}]
[INFO] Installing <https://builds.apache.org/job/tobago-1.0.x/ws/tobago-1.0.x/tobago-tool/maven-apt-plugin/target/maven-apt-plugin-1.0.41-SNAPSHOT.jar>
to /home/jenkins/jenkins-slave/maven-repositories/1/org/apache/myfaces/tobago/maven-apt-plugin/1.0.41-SNAPSHOT/maven-apt-plugin-1.0.41-SNAPSHOT.jar
[INFO] [checkstyle:check {execution: default-cli}]
[INFO] 
[INFO] ------------------------------------------------------------------------
[INFO] Building Maven Tobago Theme Plugin
[INFO]    task-segment: [clean, install, checkstyle:check]
[INFO] ------------------------------------------------------------------------
[INFO] [clean:clean {execution: default-clean}]
[INFO] [plugin:descriptor {execution: default-descriptor}]
[INFO] Using 'UTF-8' encoding to read mojo metadata.
[INFO] Applying mojo extractor for language: java
[WARNING] org.apache.myfaces.tobago.maven.plugin.PackThemeMojo#archiver:
[WARNING]   The syntax
[WARNING]     @parameter expression="${component.<role>#<roleHint>}"
[WARNING]   is deprecated, please use
[WARNING]     @component role="<role>" roleHint="<roleHint>"
[WARNING]   instead.
[WARNING] org.apache.myfaces.tobago.maven.plugin.UnPackThemeMojo#archiverManager:
[WARNING]   The syntax
[WARNING]     @parameter expression="${component.<role>#<roleHint>}"
[WARNING]   is deprecated, please use
[WARNING]     @component role="<role>" roleHint="<roleHint>"
[WARNING]   instead.
[INFO] Mojo extractor for language: java found 2 mojo descriptors.
[INFO] Applying mojo extractor for language: bsh
[INFO] Mojo extractor for language: bsh found 0 mojo descriptors.
[INFO] [remote-resources:process {execution: default}]
[INFO] [resources:resources {execution: default-resources}]
[INFO] Using 'UTF-8' encoding to copy filtered resources.
[INFO] Copying 2 resources
[INFO] Copying 3 resources
[INFO] [compiler:compile {execution: default-compile}]
[INFO] Compiling 3 source files to <https://builds.apache.org/job/tobago-1.0.x/ws/tobago-1.0.x/tobago-tool/maven-theme-plugin/target/classes>
[INFO] [resources:testResources {execution: default-testResources}]
[INFO] Using 'UTF-8' encoding to copy filtered resources.
[INFO] skip non existing resourceDirectory <https://builds.apache.org/job/tobago-1.0.x/ws/tobago-1.0.x/tobago-tool/maven-theme-plugin/src/test/resources>
[INFO] Copying 3 resources
[INFO] [compiler:testCompile {execution: default-testCompile}]
[INFO] No sources to compile
[INFO] [surefire:test {execution: default-test}]
[INFO] Surefire report directory: <https://builds.apache.org/job/tobago-1.0.x/ws/tobago-1.0.x/tobago-tool/maven-theme-plugin/target/surefire-reports>

-------------------------------------------------------
 T E S T S
-------------------------------------------------------
There are no tests to run.

Results :

Tests run: 0, Failures: 0, Errors: 0, Skipped: 0

[JENKINS] Recording test results
[INFO] [jar:jar {execution: default-jar}]
[INFO] Building jar: <https://builds.apache.org/job/tobago-1.0.x/ws/tobago-1.0.x/tobago-tool/maven-theme-plugin/target/maven-theme-plugin-1.0.41-SNAPSHOT.jar>
[INFO] [plugin:addPluginArtifactMetadata {execution: default-addPluginArtifactMetadata}]
[INFO] [install:install {execution: default-install}]
[INFO] Installing <https://builds.apache.org/job/tobago-1.0.x/ws/tobago-1.0.x/tobago-tool/maven-theme-plugin/target/maven-theme-plugin-1.0.41-SNAPSHOT.jar>
to /home/jenkins/jenkins-slave/maven-repositories/1/org/apache/myfaces/tobago/maven-theme-plugin/1.0.41-SNAPSHOT/maven-theme-plugin-1.0.41-SNAPSHOT.jar
[INFO] [checkstyle:check {execution: default-cli}]
[INFO] 
[INFO] ------------------------------------------------------------------------
[INFO] Building Tobago Annotation
[INFO]    task-segment: [clean, install, checkstyle:check]
[INFO] ------------------------------------------------------------------------
[INFO] [clean:clean {execution: default-clean}]
[INFO] [remote-resources:process {execution: default}]
[INFO] [resources:resources {execution: default-resources}]
[INFO] Using 'UTF-8' encoding to copy filtered resources.
[INFO] Copying 2 resources
[INFO] Copying 3 resources
[INFO] [compiler:compile {execution: default-compile}]
[INFO] Compiling 14 source files to <https://builds.apache.org/job/tobago-1.0.x/ws/tobago-1.0.x/tobago-tool/tobago-tool-annotation/target/classes>
[INFO] [resources:testResources {execution: default-testResources}]
[INFO] Using 'UTF-8' encoding to copy filtered resources.
[INFO] skip non existing resourceDirectory <https://builds.apache.org/job/tobago-1.0.x/ws/tobago-1.0.x/tobago-tool/tobago-tool-annotation/src/test/resources>
[INFO] Copying 3 resources
[INFO] [compiler:testCompile {execution: default-testCompile}]
[INFO] No sources to compile
[INFO] [surefire:test {execution: default-test}]
[INFO] Surefire report directory: <https://builds.apache.org/job/tobago-1.0.x/ws/tobago-1.0.x/tobago-tool/tobago-tool-annotation/target/surefire-reports>

-------------------------------------------------------
 T E S T S
-------------------------------------------------------
There are no tests to run.

Results :

Tests run: 0, Failures: 0, Errors: 0, Skipped: 0

[JENKINS] Recording test results
[INFO] [jar:jar {execution: default-jar}]
[INFO] Building jar: <https://builds.apache.org/job/tobago-1.0.x/ws/tobago-1.0.x/tobago-tool/tobago-tool-annotation/target/tobago-tool-annotation-1.0.41-SNAPSHOT.jar>
[INFO] [install:install {execution: default-install}]
[INFO] Installing <https://builds.apache.org/job/tobago-1.0.x/ws/tobago-1.0.x/tobago-tool/tobago-tool-annotation/target/tobago-tool-annotation-1.0.41-SNAPSHOT.jar>
to /home/jenkins/jenkins-slave/maven-repositories/1/org/apache/myfaces/tobago/tobago-tool-annotation/1.0.41-SNAPSHOT/tobago-tool-annotation-1.0.41-SNAPSHOT.jar
[INFO] [checkstyle:check {execution: default-cli}]
[INFO] 
[INFO] ------------------------------------------------------------------------
[INFO] Building Tobago Apt
[INFO]    task-segment: [clean, install, checkstyle:check]
[INFO] ------------------------------------------------------------------------
[INFO] [clean:clean {execution: default-clean}]
[INFO] [remote-resources:process {execution: default}]
[INFO] [resources:resources {execution: default-resources}]
[INFO] Using 'UTF-8' encoding to copy filtered resources.
[INFO] Copying 3 resources
[INFO] Copying 3 resources
[INFO] [compiler:compile {execution: default-compile}]
[INFO] Compiling 17 source files to <https://builds.apache.org/job/tobago-1.0.x/ws/tobago-1.0.x/tobago-tool/tobago-tool-apt/target/classes>
[INFO] -------------------------------------------------------------
[ERROR] COMPILATION ERROR : 
[INFO] -------------------------------------------------------------
[ERROR] <https://builds.apache.org/job/tobago-1.0.x/ws/tobago-1.0.x/tobago-tool/tobago-tool-apt/src/main/java/org/apache/myfaces/tobago/apt/FacesConfigAnnotationVisitor.java>:[22,-1]
cannot access com.sun.mirror.apt.AnnotationProcessorEnvironment
bad class file: /home/jenkins/tools/java/jdk1.7.0_25-64/jre/../lib/tools.jar(com/sun/mirror/apt/AnnotationProcessorEnvironment.class)
class file has wrong version 51.0, should be 49.0
[INFO] 1 error
[INFO] -------------------------------------------------------------
[INFO] ------------------------------------------------------------------------
[ERROR] BUILD FAILURE
[INFO] ------------------------------------------------------------------------
[INFO] Compilation failure
<https://builds.apache.org/job/tobago-1.0.x/ws/tobago-1.0.x/tobago-tool/tobago-tool-apt/src/main/java/org/apache/myfaces/tobago/apt/FacesConfigAnnotationVisitor.java>:[22,-1]
cannot access com.sun.mirror.apt.AnnotationProcessorEnvironment
bad class file: /home/jenkins/tools/java/jdk1.7.0_25-64/jre/../lib/tools.jar(com/sun/mirror/apt/AnnotationProcessorEnvironment.class)
class file has wrong version 51.0, should be 49.0

[INFO] ------------------------------------------------------------------------
[INFO] For more information, run Maven with the -e switch
[INFO] ------------------------------------------------------------------------
[INFO] Total time: 29 seconds
[INFO] Finished at: Tue Feb 04 19:26:03 UTC 2014
[INFO] Final Memory: 53M/595M
[INFO] ------------------------------------------------------------------------
[JENKINS] Archiving <https://builds.apache.org/job/tobago-1.0.x/ws/tobago-1.0.x/tobago-tool/maven-apt-plugin/pom.xml>
to org.apache.myfaces.tobago/maven-apt-plugin/1.0.41-SNAPSHOT/maven-apt-plugin-1.0.41-SNAPSHOT.pom
[JENKINS] Archiving <https://builds.apache.org/job/tobago-1.0.x/ws/tobago-1.0.x/tobago-tool/maven-apt-plugin/target/maven-apt-plugin-1.0.41-SNAPSHOT.jar>
to org.apache.myfaces.tobago/maven-apt-plugin/1.0.41-SNAPSHOT/maven-apt-plugin-1.0.41-SNAPSHOT.jar
[JENKINS] Archiving <https://builds.apache.org/job/tobago-1.0.x/ws/tobago-1.0.x/tobago-tool/tobago-tool-annotation/pom.xml>
to org.apache.myfaces.tobago/tobago-tool-annotation/1.0.41-SNAPSHOT/tobago-tool-annotation-1.0.41-SNAPSHOT.pom
[JENKINS] Archiving <https://builds.apache.org/job/tobago-1.0.x/ws/tobago-1.0.x/tobago-tool/tobago-tool-annotation/target/tobago-tool-annotation-1.0.41-SNAPSHOT.jar>
to org.apache.myfaces.tobago/tobago-tool-annotation/1.0.41-SNAPSHOT/tobago-tool-annotation-1.0.41-SNAPSHOT.jar
[JENKINS] Archiving <https://builds.apache.org/job/tobago-1.0.x/ws/tobago-1.0.x/tobago-tool/tobago-tool-apt/pom.xml>
to org.apache.myfaces.tobago/tobago-tool-apt/1.0.41-SNAPSHOT/tobago-tool-apt-1.0.41-SNAPSHOT.pom
[JENKINS] Archiving /home/jenkins/jenkins-slave/maven-repositories/1/org/apache/myfaces/tobago/tobago-tool/1.0.41-SNAPSHOT/tobago-tool-1.0.41-SNAPSHOT.pom
to org.apache.myfaces.tobago/tobago-tool/1.0.41-SNAPSHOT/tobago-tool-1.0.41-SNAPSHOT.pom
/home/jenkins/jenkins-slave/maven-repositories/1/org/apache/myfaces/tobago/tobago-tool/1.0.41-SNAPSHOT/tobago-tool-1.0.41-SNAPSHOT.pom
is not inside <https://builds.apache.org/job/tobago-1.0.x/ws/tobago-1.0.x/tobago-tool/;>
will archive in a separate pass
[JENKINS] Archiving <https://builds.apache.org/job/tobago-1.0.x/ws/tobago-1.0.x/tobago-tool/maven-theme-plugin/pom.xml>
to org.apache.myfaces.tobago/maven-theme-plugin/1.0.41-SNAPSHOT/maven-theme-plugin-1.0.41-SNAPSHOT.pom
[JENKINS] Archiving <https://builds.apache.org/job/tobago-1.0.x/ws/tobago-1.0.x/tobago-tool/maven-theme-plugin/target/maven-theme-plugin-1.0.41-SNAPSHOT.jar>
to org.apache.myfaces.tobago/maven-theme-plugin/1.0.41-SNAPSHOT/maven-theme-plugin-1.0.41-SNAPSHOT.jar
[JENKINS] Archiving /home/jenkins/jenkins-slave/maven-repositories/1/org/apache/myfaces/tobago/tobago/1.0.41-SNAPSHOT/tobago-1.0.41-SNAPSHOT.pom
to org.apache.myfaces.tobago/tobago/1.0.41-SNAPSHOT/tobago-1.0.41-SNAPSHOT.pom
[JENKINS] Archiving <https://builds.apache.org/job/tobago-1.0.x/ws/tobago-1.0.x/target/tobago-1.0.41-SNAPSHOT-site.xml>
to org.apache.myfaces.tobago/tobago/1.0.41-SNAPSHOT/tobago-1.0.41-SNAPSHOT-site.xml
/home/jenkins/jenkins-slave/maven-repositories/1/org/apache/myfaces/tobago/tobago/1.0.41-SNAPSHOT/tobago-1.0.41-SNAPSHOT.pom
is not inside <https://builds.apache.org/job/tobago-1.0.x/ws/tobago-1.0.x/;> will archive
in a separate pass
Sending e-mails to: commits@myfaces.apache.org
channel stopped

Mime
View raw message