myfaces-commits mailing list archives

Site index · List index
Message view « Date » · « Thread »
Top « Date » · « Thread »
From Apache Jenkins Server <jenk...@builds.apache.org>
Subject Build failed in Jenkins: Myfaces-Orchestra #1310
Date Thu, 24 Apr 2014 19:35:26 GMT
See <https://builds.apache.org/job/Myfaces-Orchestra/1310/>

------------------------------------------
[...truncated 420 lines...]
INFO: Bean '(inner bean)' is not eligible for getting processed by all BeanPostProcessors
(for example: not eligible for auto-proxying)
Apr 24, 2014 6:55:36 PM org.springframework.context.support.AbstractApplicationContext$BeanPostProcessorChecker
postProcessAfterInitialization
INFO: Bean 'org.springframework.transaction.interceptor.TransactionAttributeSourceAdvisor'
is not eligible for getting processed by all BeanPostProcessors (for example: not eligible
for auto-proxying)
Apr 24, 2014 6:55:36 PM org.springframework.beans.factory.support.DefaultListableBeanFactory
preInstantiateSingletons
INFO: Pre-instantiating singletons in org.springframework.beans.factory.support.DefaultListableBeanFactory@f07355:
defining beans [org.springframework.beans.factory.config.CustomScopeConfigurer,persistentContextConversationInterceptor,persistentContextFactory,org.springframework.orm.jpa.support.PersistenceAnnotationBeanPostProcessor,org.springframework.aop.config.internalAutoProxyCreator,org.springframework.transaction.interceptor.TransactionAttributeSourceAdvisor,transactionManager,entityManagerFactory,scopedTarget.persistentBackingBean,persistentBackingBean,scopedTarget.dummyBean,dummyBean];
root of factory hierarchy
[TopLink Fine]: 2014.04.24 06:55:38.021--ClientSession(16191201)--Connection(12890052)--Thread(Thread[main,5,main])--INSERT
INTO USERDATA (USERNAME, VERSION) VALUES (?, ?)
	bind => [test, 1]
[TopLink Fine]: 2014.04.24 06:55:38.098--ClientSession(16191201)--Connection(12890052)--Thread(Thread[main,5,main])--values
IDENTITY_VAL_LOCAL()
[TopLink Fine]: 2014.04.24 06:55:38.209--ClientSession(27695009)--Connection(31639617)--Thread(Thread[main,5,main])--INSERT
INTO USERDATA (USERNAME, VERSION) VALUES (?, ?)
	bind => [test, 1]
[TopLink Fine]: 2014.04.24 06:55:38.211--ClientSession(27695009)--Connection(31639617)--Thread(Thread[main,5,main])--values
IDENTITY_VAL_LOCAL()
Tests run: 2, Failures: 0, Errors: 0, Skipped: 0, Time elapsed: 6.64 sec
Running org.apache.myfaces.orchestra.conversation.TestConversation
Tests run: 1, Failures: 0, Errors: 0, Skipped: 0, Time elapsed: 0.024 sec
Running org.apache.myfaces.orchestra.requestParameterProvider.TestRequestParameterProviderManager
Tests run: 1, Failures: 0, Errors: 0, Skipped: 0, Time elapsed: 0 sec
Running org.apache.myfaces.orchestra.lib.jsf.TestSerializableConverter
Apr 24, 2014 6:55:38 PM org.springframework.test.AbstractSingleSpringContextTests loadContextLocations
INFO: Loading context for locations: classpath:org/apache/myfaces/orchestra/lib/jsf/TestSerializableConverter.xml
Apr 24, 2014 6:55:38 PM org.springframework.beans.factory.xml.XmlBeanDefinitionReader loadBeanDefinitions
INFO: Loading XML bean definitions from class path resource [org/apache/myfaces/orchestra/lib/jsf/TestSerializableConverter.xml]
Apr 24, 2014 6:55:38 PM org.springframework.context.support.AbstractApplicationContext prepareRefresh
INFO: Refreshing org.springframework.context.support.GenericApplicationContext@b1684: display
name [org.springframework.context.support.GenericApplicationContext@b1684]; startup date [Thu
Apr 24 18:55:38 GMT+00:00 2014]; root of context hierarchy
Apr 24, 2014 6:55:38 PM org.springframework.context.support.AbstractApplicationContext obtainFreshBeanFactory
INFO: Bean factory for application context [org.springframework.context.support.GenericApplicationContext@b1684]:
org.springframework.beans.factory.support.DefaultListableBeanFactory@484c6b
Apr 24, 2014 6:55:38 PM org.springframework.beans.factory.support.DefaultListableBeanFactory
preInstantiateSingletons
INFO: Pre-instantiating singletons in org.springframework.beans.factory.support.DefaultListableBeanFactory@484c6b:
defining beans [org.springframework.beans.factory.config.CustomScopeConfigurer,statelessConverter,statefulConverter];
root of factory hierarchy
Tests run: 2, Failures: 0, Errors: 0, Skipped: 0, Time elapsed: 0.178 sec
Running org.apache.myfaces.orchestra.viewController.TestDefaultViewControllerNameMapper
Tests run: 1, Failures: 0, Errors: 0, Skipped: 0, Time elapsed: 0 sec
Running org.apache.myfaces.orchestra.viewController.TestReflectiveViewControllerExecutor
Tests run: 1, Failures: 0, Errors: 0, Skipped: 0, Time elapsed: 0 sec
Running org.apache.myfaces.orchestra.viewController.TestInterfaceViewControllerExecutor
Tests run: 1, Failures: 0, Errors: 0, Skipped: 0, Time elapsed: 0 sec
Apr 24, 2014 6:55:38 PM org.springframework.context.support.AbstractApplicationContext doClose
INFO: Closing org.springframework.context.support.GenericApplicationContext@716cb7: display
name [org.springframework.context.support.GenericApplicationContext@716cb7]; startup date
[Thu Apr 24 18:55:31 GMT+00:00 2014]; root of context hierarchy
Apr 24, 2014 6:55:38 PM org.springframework.context.support.AbstractApplicationContext doClose
INFO: Closing org.springframework.context.support.GenericApplicationContext@179953c: display
name [org.springframework.context.support.GenericApplicationContext@179953c]; startup date
[Thu Apr 24 18:55:31 GMT+00:00 2014]; root of context hierarchy
Apr 24, 2014 6:55:38 PM org.springframework.context.support.AbstractApplicationContext doClose
INFO: Closing org.springframework.context.support.GenericApplicationContext@b1684: display
name [org.springframework.context.support.GenericApplicationContext@b1684]; startup date [Thu
Apr 24 18:55:38 GMT+00:00 2014]; root of context hierarchy
Apr 24, 2014 6:55:38 PM org.springframework.context.support.AbstractApplicationContext doClose
INFO: Closing org.springframework.context.support.GenericApplicationContext@482923: display
name [org.springframework.context.support.GenericApplicationContext@482923]; startup date
[Thu Apr 24 18:55:30 GMT+00:00 2014]; root of context hierarchy
[TopLink Config]: 2014.04.24 06:55:38.498--ServerSession(31344098)--Connection(8306728)--Thread(Thread[Thread-4,5,main])--disconnect
[TopLink Info]: 2014.04.24 06:55:38.501--ServerSession(31344098)--Thread(Thread[Thread-4,5,main])--<https://builds.apache.org/job/Myfaces-Orchestra/ws/trunk/core/target/test-classes-default>
logout successful
[TopLink Config]: 2014.04.24 06:55:38.501--ServerSession(31344098)--Connection(20630610)--Thread(Thread[Thread-4,5,main])--disconnect
[TopLink Config]: 2014.04.24 06:55:38.502--ServerSession(31344098)--Connection(4812898)--Thread(Thread[Thread-4,5,main])--disconnect
[TopLink Config]: 2014.04.24 06:55:38.503--ServerSession(31344098)--Connection(9775365)--Thread(Thread[Thread-4,5,main])--disconnect
[TopLink Config]: 2014.04.24 06:55:38.503--ServerSession(31344098)--Connection(8901746)--Thread(Thread[Thread-4,5,main])--disconnect
[TopLink Config]: 2014.04.24 06:55:38.504--ServerSession(31344098)--Connection(23946437)--Thread(Thread[Thread-4,5,main])--disconnect
[TopLink Config]: 2014.04.24 06:55:38.504--ServerSession(31344098)--Connection(12890052)--Thread(Thread[Thread-4,5,main])--disconnect
[TopLink Config]: 2014.04.24 06:55:38.505--ServerSession(31344098)--Connection(31639617)--Thread(Thread[Thread-4,5,main])--disconnect

Results :

Tests run: 15, Failures: 0, Errors: 0, Skipped: 0

[JENKINS] Recording test results
[INFO] [jar:jar {execution: default-jar}]
[INFO] Building jar: <https://builds.apache.org/job/Myfaces-Orchestra/ws/trunk/core/target/myfaces-orchestra-core-1.6-SNAPSHOT.jar>
[INFO] Preparing source:jar
[WARNING] Removing: jar from forked lifecycle, to prevent recursive invocation.
[WARNING] DEPRECATED [tasks]: Use target instead
[INFO] [antrun:run {execution: javadoc.resources}]
[WARNING] Parameter tasks is deprecated, use target instead
[INFO] Executing tasks

main:
[INFO] Executed tasks
[INFO] [build-helper:add-source {execution: add-source}]
[INFO] Source directory: <https://builds.apache.org/job/Myfaces-Orchestra/ws/trunk/core/target/shared_sources>
added.
ERROR: Could not find local repository for 2.2.1
[INFO] [source:jar {execution: attach-source}]
[INFO] META-INF already added, skipping
[INFO] org already added, skipping
[INFO] org/apache already added, skipping
[INFO] org/apache/myfaces already added, skipping
[INFO] META-INF already added, skipping
[INFO] org already added, skipping
[INFO] org/apache already added, skipping
[INFO] org/apache/myfaces already added, skipping
[INFO] org/apache/myfaces/orchestra already added, skipping
[INFO] META-INF already added, skipping
[INFO] META-INF/NOTICE already added, skipping
[INFO] META-INF/DEPENDENCIES already added, skipping
[INFO] META-INF/LICENSE already added, skipping
[INFO] Building jar: <https://builds.apache.org/job/Myfaces-Orchestra/ws/trunk/core/target/myfaces-orchestra-core-1.6-SNAPSHOT-sources.jar>
[INFO] META-INF already added, skipping
[INFO] org already added, skipping
[INFO] org/apache already added, skipping
[INFO] org/apache/myfaces already added, skipping
[INFO] META-INF already added, skipping
[INFO] org already added, skipping
[INFO] org/apache already added, skipping
[INFO] org/apache/myfaces already added, skipping
[INFO] org/apache/myfaces/orchestra already added, skipping
[INFO] META-INF already added, skipping
[INFO] META-INF/NOTICE already added, skipping
[INFO] META-INF/DEPENDENCIES already added, skipping
[INFO] META-INF/LICENSE already added, skipping
[INFO] [checkstyle:check {execution: verify-style}]
[INFO] 
[INFO] [install:install {execution: default-install}]
[INFO] Installing <https://builds.apache.org/job/Myfaces-Orchestra/ws/trunk/core/target/myfaces-orchestra-core-1.6-SNAPSHOT.jar>
to /export/home/hudson/hudson-slave/maven-repositories/1/org/apache/myfaces/orchestra/myfaces-orchestra-core/1.6-SNAPSHOT/myfaces-orchestra-core-1.6-SNAPSHOT.jar
[INFO] Installing <https://builds.apache.org/job/Myfaces-Orchestra/ws/trunk/core/target/myfaces-orchestra-core-1.6-SNAPSHOT-sources.jar>
to /export/home/hudson/hudson-slave/maven-repositories/1/org/apache/myfaces/orchestra/myfaces-orchestra-core/1.6-SNAPSHOT/myfaces-orchestra-core-1.6-SNAPSHOT-sources.jar
[WARNING] DEPRECATED [tasks]: Use target instead
[INFO] [antrun:run {execution: javadoc.resources}]
[WARNING] Parameter tasks is deprecated, use target instead
[INFO] Executing tasks

main:
[INFO] Executed tasks
[INFO] [build-helper:add-source {execution: add-source}]
[INFO] Source directory: <https://builds.apache.org/job/Myfaces-Orchestra/ws/trunk/core/target/shared_sources>
added.
[INFO] [dependency:unpack {execution: unpack-shared-impl-sources}]
[INFO] Configured Artifact: org.apache.myfaces.shared:myfaces-shared-orchestra:sources:2.0.13:jar
[INFO] Unpacking /export/home/hudson/hudson-slave/maven-repositories/1/org/apache/myfaces/shared/myfaces-shared-orchestra/2.0.13/myfaces-shared-orchestra-2.0.13-sources.jar
to <https://builds.apache.org/job/Myfaces-Orchestra/ws/trunk/core/target/shared_sources>
with includes "" and excludes "META-INF/*"
[INFO] [xslt:transform {execution: default}]
[INFO] # of XML files: 1
[INFO] file up-to-date: <https://builds.apache.org/job/Myfaces-Orchestra/ws/trunk/core/target/classes/META-INF/myfaces_orchestra.tld>
[INFO] [remote-resources:process {execution: default}]
[debug] execute contextualize
[INFO] [resources:resources {execution: default-resources}]
[INFO] Using 'UTF-8' encoding to copy filtered resources.
[INFO] Copying 2 resources to META-INF
[INFO] Copying 6 resources
[INFO] Copying 3 resources
[INFO] Copying 3 resources
[INFO] [compiler:compile {execution: default-compile}]
[INFO] Nothing to compile - all classes are up to date
[debug] execute contextualize
[INFO] [resources:testResources {execution: default-testResources}]
[INFO] Using 'UTF-8' encoding to copy filtered resources.
[INFO] Copying 6 resources
[INFO] Copying 3 resources
[INFO] Copying 3 resources
[INFO] [compiler:testCompile {execution: default-testCompile}]
[INFO] Nothing to compile - all classes are up to date
[INFO] [surefire:test {execution: default-test}]
[INFO] Skipping execution of surefire because it has already been run for this configuration
[JENKINS] Recording test results
[INFO] [jar:jar {execution: default-jar}]
[INFO] Building jar: <https://builds.apache.org/job/Myfaces-Orchestra/ws/trunk/core/target/myfaces-orchestra-core-1.6-SNAPSHOT.jar>
[INFO] Preparing source:jar
[WARNING] Removing: jar from forked lifecycle, to prevent recursive invocation.
[WARNING] DEPRECATED [tasks]: Use target instead
[INFO] [antrun:run {execution: javadoc.resources}]
[WARNING] Parameter tasks is deprecated, use target instead
[INFO] Executing tasks

main:
[INFO] Executed tasks
[INFO] [build-helper:add-source {execution: add-source}]
[INFO] Source directory: <https://builds.apache.org/job/Myfaces-Orchestra/ws/trunk/core/target/shared_sources>
added.
ERROR: Could not find local repository for 2.2.1
[INFO] [source:jar {execution: attach-source}]
[INFO] META-INF already added, skipping
[INFO] META-INF/NOTICE already added, skipping
[INFO] META-INF/DEPENDENCIES already added, skipping
[INFO] META-INF/LICENSE already added, skipping
[INFO] META-INF already added, skipping
[INFO] org already added, skipping
[INFO] org/apache already added, skipping
[INFO] org/apache/myfaces already added, skipping
[INFO] META-INF already added, skipping
[INFO] org already added, skipping
[INFO] org/apache already added, skipping
[INFO] org/apache/myfaces already added, skipping
[INFO] org/apache/myfaces/orchestra already added, skipping
[INFO] META-INF already added, skipping
[INFO] META-INF/NOTICE already added, skipping
[INFO] META-INF/DEPENDENCIES already added, skipping
[INFO] META-INF/LICENSE already added, skipping
[INFO] META-INF already added, skipping
[INFO] META-INF/NOTICE already added, skipping
[INFO] META-INF/DEPENDENCIES already added, skipping
[INFO] META-INF/LICENSE already added, skipping
[INFO] Building jar: <https://builds.apache.org/job/Myfaces-Orchestra/ws/trunk/core/target/myfaces-orchestra-core-1.6-SNAPSHOT-sources.jar>
[INFO] META-INF already added, skipping
[INFO] META-INF/NOTICE already added, skipping
[INFO] META-INF/DEPENDENCIES already added, skipping
[INFO] META-INF/LICENSE already added, skipping
[INFO] META-INF already added, skipping
[INFO] org already added, skipping
[INFO] org/apache already added, skipping
[INFO] org/apache/myfaces already added, skipping
[INFO] META-INF already added, skipping
[INFO] org already added, skipping
[INFO] org/apache already added, skipping
[INFO] org/apache/myfaces already added, skipping
[INFO] org/apache/myfaces/orchestra already added, skipping
[INFO] META-INF already added, skipping
[INFO] META-INF/NOTICE already added, skipping
[INFO] META-INF/DEPENDENCIES already added, skipping
[INFO] META-INF/LICENSE already added, skipping
[INFO] META-INF already added, skipping
[INFO] META-INF/NOTICE already added, skipping
[INFO] META-INF/DEPENDENCIES already added, skipping
[INFO] META-INF/LICENSE already added, skipping
[INFO] [checkstyle:check {execution: verify-style}]
[INFO] 
[INFO] [install:install {execution: default-install}]
[INFO] Installing <https://builds.apache.org/job/Myfaces-Orchestra/ws/trunk/core/target/myfaces-orchestra-core-1.6-SNAPSHOT.jar>
to /export/home/hudson/hudson-slave/maven-repositories/1/org/apache/myfaces/orchestra/myfaces-orchestra-core/1.6-SNAPSHOT/myfaces-orchestra-core-1.6-SNAPSHOT.jar
[INFO] Installing <https://builds.apache.org/job/Myfaces-Orchestra/ws/trunk/core/target/myfaces-orchestra-core-1.6-SNAPSHOT-sources.jar>
to /export/home/hudson/hudson-slave/maven-repositories/1/org/apache/myfaces/orchestra/myfaces-orchestra-core/1.6-SNAPSHOT/myfaces-orchestra-core-1.6-SNAPSHOT-sources.jar
[INFO] Installing <https://builds.apache.org/job/Myfaces-Orchestra/ws/trunk/core/target/myfaces-orchestra-core-1.6-SNAPSHOT-sources.jar>
to /export/home/hudson/hudson-slave/maven-repositories/1/org/apache/myfaces/orchestra/myfaces-orchestra-core/1.6-SNAPSHOT/myfaces-orchestra-core-1.6-SNAPSHOT-sources.jar
[INFO] [deploy:deploy {execution: default-deploy}]
[INFO] Retrieving previous build number from apache.snapshots.https
[WARNING] *** CHECKSUM FAILED - Checksum failed on download: local = '3ddc895ccf8d2fe23f74e9a79330a0b03b8db9a2';
remote = '0bb3a4f0a4650ce53adc10e488454651f40ec3a8' - RETRYING
[WARNING] *** CHECKSUM FAILED - Checksum failed on download: local = '3ddc895ccf8d2fe23f74e9a79330a0b03b8db9a2';
remote = '0bb3a4f0a4650ce53adc10e488454651f40ec3a8' - IGNORING
Uploading: https://repository.apache.org/content/repositories/snapshots/org/apache/myfaces/orchestra/myfaces-orchestra-core/1.6-SNAPSHOT/myfaces-orchestra-core-1.6-20140424.184918-2263.jar
406K uploaded  (myfaces-orchestra-core-1.6-20140424.184918-2263.jar)
[INFO] Retrieving previous metadata from apache.snapshots.https
[INFO] Uploading repository metadata for: 'artifact org.apache.myfaces.orchestra:myfaces-orchestra-core'
[INFO] Uploading project information for myfaces-orchestra-core 1.6-20140424.184918-2263
[INFO] Retrieving previous metadata from apache.snapshots.https
[WARNING] *** CHECKSUM FAILED - Checksum failed on download: local = '3ddc895ccf8d2fe23f74e9a79330a0b03b8db9a2';
remote = '0bb3a4f0a4650ce53adc10e488454651f40ec3a8' - RETRYING
[WARNING] *** CHECKSUM FAILED - Checksum failed on download: local = '3ddc895ccf8d2fe23f74e9a79330a0b03b8db9a2';
remote = '0bb3a4f0a4650ce53adc10e488454651f40ec3a8' - IGNORING
[INFO] Uploading repository metadata for: 'snapshot org.apache.myfaces.orchestra:myfaces-orchestra-core:1.6-SNAPSHOT'
[INFO] Retrieving previous build number from apache.snapshots.https
Uploading: https://repository.apache.org/content/repositories/snapshots/org/apache/myfaces/orchestra/myfaces-orchestra-core/1.6-SNAPSHOT/myfaces-orchestra-core-1.6-20140424.184918-2263-sources.jar
466K uploaded  (myfaces-orchestra-core-1.6-20140424.184918-2263-sources.jar)
[INFO] Retrieving previous build number from apache.snapshots.https
Uploading: https://repository.apache.org/content/repositories/snapshots/org/apache/myfaces/orchestra/myfaces-orchestra-core/1.6-SNAPSHOT/myfaces-orchestra-core-1.6-20140424.184918-2263-sources.jar
466K uploaded  (myfaces-orchestra-core-1.6-20140424.184918-2263-sources.jar)
Build timed out (after 60 minutes). Marking the build as failed.
[INFO] ------------------------------------------------------------------------
[ERROR] FATAL ERROR
[INFO] ------------------------------------------------------------------------
[INFO] Unable to call setResult. Invalid object ID 9
[INFO] ------------------------------------------------------------------------
[INFO] Trace
java.lang.IllegalStateException: Unable to call setResult. Invalid object ID 9
	at hudson.remoting.RemoteInvocationHandler$RPCRequest.perform(RemoteInvocationHandler.java:293)
	at hudson.remoting.RemoteInvocationHandler$RPCRequest.call(RemoteInvocationHandler.java:280)
	at hudson.remoting.RemoteInvocationHandler$RPCRequest.call(RemoteInvocationHandler.java:239)
	at hudson.remoting.UserRequest.perform(UserRequest.java:118)
	at hudson.remoting.UserRequest.perform(UserRequest.java:48)
	at hudson.remoting.Request$2.run(Request.java:328)
	at hudson.remoting.InterceptingExecutorService$1.call(InterceptingExecutorService.java:72)
	at jenkins.util.ContextResettingExecutorService$2.call(ContextResettingExecutorService.java:46)
	at java.util.concurrent.FutureTask.run(FutureTask.java:266)
	at java.util.concurrent.ThreadPoolExecutor.runWorker(ThreadPoolExecutor.java:1142)
	at java.util.concurrent.ThreadPoolExecutor$Worker.run(ThreadPoolExecutor.java:617)
	at java.lang.Thread.run(Thread.java:745)
[INFO] ------------------------------------------------------------------------
[INFO] Total time: 49 minutes 56 seconds
[INFO] Finished at: Thu Apr 24 19:20:37 GMT+00:00 2014
[INFO] Final Memory: 75M/421M
[INFO] ------------------------------------------------------------------------
channel stopped

Mime
View raw message