myfaces-commits mailing list archives

Site index · List index
Message view « Date » · « Thread »
Top « Date » · « Thread »
From Apache Jenkins Server <jenk...@builds.apache.org>
Subject Build failed in Jenkins: myfaces-current-2.0 #2340
Date Tue, 22 Apr 2014 09:54:23 GMT
See <https://builds.apache.org/job/myfaces-current-2.0/2340/>

------------------------------------------
[...truncated 1219 lines...]
[INFO] [compiler:testCompile {execution: default-testCompile}]
[INFO] Compiling 20 source files to <https://builds.apache.org/job/myfaces-current-2.0/ws/current20/shared/core/target/test-classes>
[INFO] [surefire:test {execution: default-test}]
[INFO] Surefire report directory: <https://builds.apache.org/job/myfaces-current-2.0/ws/current20/shared/core/target/surefire-reports>

-------------------------------------------------------
 T E S T S
-------------------------------------------------------
Running org.apache.myfaces.shared.webapp.webxml.ServletMappingTest
Tests run: 2, Failures: 0, Errors: 0, Skipped: 0, Time elapsed: 0.083 sec
Running org.apache.myfaces.shared.renderkit.html.util.HTMLEncoderTest
Tests run: 26, Failures: 0, Errors: 0, Skipped: 0, Time elapsed: 0.872 sec
Running org.apache.myfaces.shared.renderkit.html.HtmlRendererUtilsTest
No Renderer found for component {Component-Path : [Class: javax.faces.component.html.HtmlInputText,Id:
j_id0]} (component-family=javax.faces.Input, renderer-type=javax.faces.Text)
Apr 22, 2014 8:56:13 AM javax.faces.component.UIComponentBase getRenderer
WARNING: No Renderer found for component {Component-Path : [Class: javax.faces.component.html.HtmlInputText,Id:
j_id0]} (component-family=javax.faces.Input, renderer-type=javax.faces.Text)
Tests run: 2, Failures: 0, Errors: 0, Skipped: 0, Time elapsed: 0.243 sec
Running org.apache.myfaces.shared.renderkit.html.HtmlResponseWriterImplTest
Tests run: 13, Failures: 0, Errors: 0, Skipped: 0, Time elapsed: 0.027 sec
Running org.apache.myfaces.shared.renderkit.RendererUtilsTest
No Renderer found for component {Component-Path : [Class: javax.faces.component.html.HtmlGraphicImage,Id:
graphicImageId]} (component-family=javax.faces.Graphic, renderer-type=javax.faces.Image)
Apr 22, 2014 8:56:14 AM javax.faces.component.UIComponentBase getRenderer
WARNING: No Renderer found for component {Component-Path : [Class: javax.faces.component.html.HtmlGraphicImage,Id:
graphicImageId]} (component-family=javax.faces.Graphic, renderer-type=javax.faces.Image)
Tests run: 7, Failures: 0, Errors: 0, Skipped: 0, Time elapsed: 1.057 sec
Running org.apache.myfaces.shared.application.DefaultViewHandlerSupportTest
Tests run: 8, Failures: 0, Errors: 0, Skipped: 0, Time elapsed: 0.122 sec
Running org.apache.myfaces.shared.util.CachedStateUtilsDefaultTest
Tests run: 11, Failures: 0, Errors: 0, Skipped: 0, Time elapsed: 0.738 sec
Running org.apache.myfaces.shared.util.InitVector_CBCTestCase
Tests run: 2, Failures: 0, Errors: 0, Skipped: 0, Time elapsed: 0 sec
Running org.apache.myfaces.shared.util.MessageUtilsTest
currency ?100.00
Tests run: 11, Failures: 0, Errors: 0, Skipped: 0, Time elapsed: 0.795 sec
Running org.apache.myfaces.shared.util.StateUtilsDefaultTest
Tests run: 11, Failures: 0, Errors: 0, Skipped: 0, Time elapsed: 0.009 sec
Running org.apache.myfaces.shared.util.StateUtilsTripleDES_ECBTest
Tests run: 11, Failures: 0, Errors: 0, Skipped: 0, Time elapsed: 0.008 sec
Running org.apache.myfaces.shared.util.StateUtilsBlowfish_ECBTest
Tests run: 11, Failures: 0, Errors: 0, Skipped: 0, Time elapsed: 0.267 sec
Running org.apache.myfaces.shared.util.CachedStateUtilsTripleDES_ECBTest
Tests run: 11, Failures: 0, Errors: 0, Skipped: 0, Time elapsed: 0.009 sec
Running org.apache.myfaces.shared.util.SecretKeyConfigurationTest
Tests run: 4, Failures: 0, Errors: 0, Skipped: 0, Time elapsed: 0.001 sec
Running org.apache.myfaces.shared.util.SecretKeyCacheTest
Tests run: 3, Failures: 0, Errors: 0, Skipped: 0, Time elapsed: 0 sec
Running org.apache.myfaces.shared.util.CommentUtilsTest
Tests run: 5, Failures: 0, Errors: 0, Skipped: 0, Time elapsed: 0.003 sec
Running org.apache.myfaces.shared.util.CachedStateUtilsBlowfish_ECBTest
Tests run: 11, Failures: 0, Errors: 0, Skipped: 0, Time elapsed: 0.013 sec
Running org.apache.myfaces.shared.util.CachedStateUtilsAES_CBCTest
Tests run: 11, Failures: 0, Errors: 0, Skipped: 0, Time elapsed: 0.008 sec
Running org.apache.myfaces.shared.util.StateUtilsAES_CBCTest
Tests run: 11, Failures: 0, Errors: 0, Skipped: 0, Time elapsed: 0.008 sec

Results :

Tests run: 171, Failures: 0, Errors: 0, Skipped: 0
[JENKINS] Recording test results

[INFO] [jar:jar {execution: default-jar}]
[INFO] Building jar: <https://builds.apache.org/job/myfaces-current-2.0/ws/current20/shared/core/target/myfaces-shared-core-4.0.21-SNAPSHOT.jar>
[INFO] Preparing source:jar
[WARNING] Removing: jar from forked lifecycle, to prevent recursive invocation.
[INFO] No goals needed for project - skipping
[INFO] [source:jar {execution: attach-source}]
[INFO] META-INF already added, skipping
[INFO] META-INF already added, skipping
[INFO] META-INF/NOTICE already added, skipping
[INFO] META-INF/LICENSE already added, skipping
[INFO] META-INF/DEPENDENCIES already added, skipping
[INFO] META-INF already added, skipping
[INFO] Building jar: <https://builds.apache.org/job/myfaces-current-2.0/ws/current20/shared/core/target/myfaces-shared-core-4.0.21-SNAPSHOT-sources.jar>
[INFO] META-INF already added, skipping
[INFO] META-INF already added, skipping
[INFO] META-INF/NOTICE already added, skipping
[INFO] META-INF/LICENSE already added, skipping
[INFO] META-INF/DEPENDENCIES already added, skipping
[INFO] META-INF already added, skipping
[INFO] [checkstyle:check {execution: verify-style}]
[INFO] Starting audit...
Audit done.

[INFO] [install:install {execution: default-install}]
[INFO] Installing <https://builds.apache.org/job/myfaces-current-2.0/ws/current20/shared/core/target/myfaces-shared-core-4.0.21-SNAPSHOT.jar>
to /export/home/hudson/hudson-slave/maven-repositories/1/org/apache/myfaces/shared/myfaces-shared-core/4.0.21-SNAPSHOT/myfaces-shared-core-4.0.21-SNAPSHOT.jar
[INFO] Installing <https://builds.apache.org/job/myfaces-current-2.0/ws/current20/shared/core/target/myfaces-shared-core-4.0.21-SNAPSHOT-sources.jar>
to /export/home/hudson/hudson-slave/maven-repositories/1/org/apache/myfaces/shared/myfaces-shared-core/4.0.21-SNAPSHOT/myfaces-shared-core-4.0.21-SNAPSHOT-sources.jar
[INFO] [deploy:deploy {execution: default-deploy}]
[INFO] Retrieving previous build number from apache.snapshots.https
[WARNING] *** CHECKSUM FAILED - Checksum failed on download: local = 'b695bcdc6299296575e7f3e5340c46b1eb91ab47';
remote = 'c15ecccc5a0170727d0c65adbaa7f3c994f78420' - RETRYING
[WARNING] *** CHECKSUM FAILED - Checksum failed on download: local = 'b695bcdc6299296575e7f3e5340c46b1eb91ab47';
remote = 'c15ecccc5a0170727d0c65adbaa7f3c994f78420' - IGNORING
Uploading: https://repository.apache.org/content/repositories/snapshots/org/apache/myfaces/shared/myfaces-shared-core/4.0.21-SNAPSHOT/myfaces-shared-core-4.0.21-20140422.082239-24.jar
451K uploaded  (myfaces-shared-core-4.0.21-20140422.082239-24.jar)
[INFO] Retrieving previous metadata from apache.snapshots.https
[WARNING] *** CHECKSUM FAILED - Checksum failed on download: local = 'b695bcdc6299296575e7f3e5340c46b1eb91ab47';
remote = 'c15ecccc5a0170727d0c65adbaa7f3c994f78420' - RETRYING
[WARNING] *** CHECKSUM FAILED - Checksum failed on download: local = 'b695bcdc6299296575e7f3e5340c46b1eb91ab47';
remote = 'c15ecccc5a0170727d0c65adbaa7f3c994f78420' - IGNORING
[INFO] Uploading repository metadata for: 'snapshot org.apache.myfaces.shared:myfaces-shared-core:4.0.21-SNAPSHOT'
[INFO] Uploading project information for myfaces-shared-core 4.0.21-20140422.082239-24
[INFO] Retrieving previous metadata from apache.snapshots.https
[INFO] Uploading repository metadata for: 'artifact org.apache.myfaces.shared:myfaces-shared-core'
[INFO] Retrieving previous build number from apache.snapshots.https
Uploading: https://repository.apache.org/content/repositories/snapshots/org/apache/myfaces/shared/myfaces-shared-core/4.0.21-SNAPSHOT/myfaces-shared-core-4.0.21-20140422.082239-24-sources.jar
411K uploaded  (myfaces-shared-core-4.0.21-20140422.082239-24-sources.jar)
[INFO] ------------------------------------------------------------------------
[INFO] Building MyFaces Shared Tomahawk
[INFO]    task-segment: [clean, deploy]
[INFO] ------------------------------------------------------------------------
[INFO] [clean:clean {execution: default-clean}]
[INFO] Deleting <https://builds.apache.org/job/myfaces-current-2.0/ws/current20/shared/shared-tomahawk/target>
[INFO] [dependency:unpack {execution: unpack-sources}]
[INFO] Configured Artifact: org.apache.myfaces.shared:myfaces-shared-core:sources:4.0.21-SNAPSHOT:jar
[INFO] snapshot org.apache.myfaces.shared:myfaces-shared-core:4.0.21-SNAPSHOT: checking for
updates from apache-maven-snapshots
[INFO] snapshot org.apache.myfaces.shared:myfaces-shared-core:4.0.21-SNAPSHOT: checking for
updates from apache.snapshots
[INFO] Unpacking /export/home/hudson/hudson-slave/maven-repositories/1/org/apache/myfaces/shared/myfaces-shared-core/4.0.21-SNAPSHOT/myfaces-shared-core-4.0.21-SNAPSHOT-sources.jarto
 <https://builds.apache.org/job/myfaces-current-2.0/ws/current20/shared/shared-tomahawk/target/unpacked-shared-sources>
with Includes null and excludes:null
[INFO] [dependency:unpack {execution: unpack-resources-sources}]
[INFO] Configured Artifact: org.apache.myfaces.shared:myfaces-shared-core:4.0.21-SNAPSHOT:jar
[INFO] Unpacking /export/home/hudson/hudson-slave/maven-repositories/1/org/apache/myfaces/shared/myfaces-shared-core/4.0.21-SNAPSHOT/myfaces-shared-core-4.0.21-SNAPSHOT.jarto
 <https://builds.apache.org/job/myfaces-current-2.0/ws/current20/shared/shared-tomahawk/target/refactored-shared-sources/main/resources>
with Includes META-INF/internal-resources/**,META-INF/resources/** and excludes:null
[INFO] [build-helper:add-source {execution: add-source-shared}]
[INFO] Source directory: <https://builds.apache.org/job/myfaces-current-2.0/ws/current20/shared/shared-tomahawk/target/refactored-shared-sources/main/java>
added.
[WARNING] DEPRECATED [sourceRoot]: Use the build-helper-maven-plugin to bind source directories
[WARNING] DEPRECATED [tasks]: Use target instead
[INFO] [antrun:run {execution: refactor-shared-sources}]
[WARNING] Parameter tasks is deprecated, use target instead
[INFO] Executing tasks

main:

refactor-java-sources:
    [mkdir] Created dir: <https://builds.apache.org/job/myfaces-current-2.0/ws/current20/shared/shared-tomahawk/target/refactored-shared-sources/main/java>
     [move] Moving 140 files to <https://builds.apache.org/job/myfaces-current-2.0/ws/current20/shared/shared-tomahawk/target/refactored-shared-sources/main/java/org/apache/myfaces/shared_tomahawk>
[INFO] Executed tasks
[INFO] Registering compile source root <https://builds.apache.org/job/myfaces-current-2.0/ws/current20/shared/shared-tomahawk/target/refactored-shared-sources/main/java>
[INFO] [remote-resources:process {execution: default}]
[WARNING] DEPRECATED [tasks]: Use target instead
[INFO] [antrun:run {execution: refactor-resources}]
[WARNING] Parameter tasks is deprecated, use target instead
[INFO] Executing tasks

main:

refactor-resources:
[INFO] Executed tasks
[debug] execute contextualize
[INFO] [resources:resources {execution: default-resources}]
[INFO] Using 'UTF-8' encoding to copy filtered resources.
[INFO] Copying 2 resources
[INFO] Copying 3 resources
[INFO] [dependency:unpack {execution: unpack-resources}]
[INFO] Configured Artifact: org.apache.myfaces.shared:myfaces-shared-core:4.0.21-SNAPSHOT:jar
[INFO] Unpacking /export/home/hudson/hudson-slave/maven-repositories/1/org/apache/myfaces/shared/myfaces-shared-core/4.0.21-SNAPSHOT/myfaces-shared-core-4.0.21-SNAPSHOT.jarto
 <https://builds.apache.org/job/myfaces-current-2.0/ws/current20/shared/shared-tomahawk/target/classes>
with Includes META-INF/internal-resources/**,META-INF/resources/** and excludes:null
[INFO] [compiler:compile {execution: default-compile}]
[INFO] Compiling 140 source files to <https://builds.apache.org/job/myfaces-current-2.0/ws/current20/shared/shared-tomahawk/target/classes>
[debug] execute contextualize
[INFO] [resources:testResources {execution: default-testResources}]
[INFO] Using 'UTF-8' encoding to copy filtered resources.
[INFO] skip non existing resourceDirectory <https://builds.apache.org/job/myfaces-current-2.0/ws/current20/shared/shared-tomahawk/src/test/resources>
[INFO] Copying 3 resources
[INFO] [compiler:testCompile {execution: default-testCompile}]
[INFO] No sources to compile
[INFO] [surefire:test {execution: default-test}]
[INFO] Surefire report directory: <https://builds.apache.org/job/myfaces-current-2.0/ws/current20/shared/shared-tomahawk/target/surefire-reports>

-------------------------------------------------------
 T E S T S
-------------------------------------------------------

Results :

Tests run: 0, Failures: 0, Errors: 0, Skipped: 0

[JENKINS] Recording test results
[INFO] [jar:jar {execution: default-jar}]
[INFO] Building jar: <https://builds.apache.org/job/myfaces-current-2.0/ws/current20/shared/shared-tomahawk/target/myfaces-shared-tomahawk-4.0.21-SNAPSHOT.jar>
[INFO] Preparing source:jar
[WARNING] Removing: jar from forked lifecycle, to prevent recursive invocation.
[INFO] [dependency:unpack {execution: unpack-sources}]
[INFO] Configured Artifact: org.apache.myfaces.shared:myfaces-shared-core:sources:4.0.21-SNAPSHOT:jar
[INFO] myfaces-shared-core-4.0.21-SNAPSHOT-sources.jar already unpacked.
[INFO] [dependency:unpack {execution: unpack-resources-sources}]
[INFO] Configured Artifact: org.apache.myfaces.shared:myfaces-shared-core:4.0.21-SNAPSHOT:jar
[INFO] Unpacking /export/home/hudson/hudson-slave/maven-repositories/1/org/apache/myfaces/shared/myfaces-shared-core/4.0.21-SNAPSHOT/myfaces-shared-core-4.0.21-SNAPSHOT.jarto
 <https://builds.apache.org/job/myfaces-current-2.0/ws/current20/shared/shared-tomahawk/target/refactored-shared-sources/main/resources>
with Includes META-INF/internal-resources/**,META-INF/resources/** and excludes:null
ERROR: Could not find local repository for 2.2.1
[INFO] [source:jar {execution: attach-source}]
[INFO] META-INF already added, skipping
[INFO] META-INF already added, skipping
[INFO] META-INF/LICENSE already added, skipping
[INFO] META-INF/NOTICE already added, skipping
[INFO] META-INF/DEPENDENCIES already added, skipping
[INFO] Building jar: <https://builds.apache.org/job/myfaces-current-2.0/ws/current20/shared/shared-tomahawk/target/myfaces-shared-tomahawk-4.0.21-SNAPSHOT-sources.jar>
[INFO] META-INF already added, skipping
[INFO] META-INF already added, skipping
[INFO] META-INF/LICENSE already added, skipping
[INFO] META-INF/NOTICE already added, skipping
[INFO] META-INF/DEPENDENCIES already added, skipping
[INFO] [checkstyle:check {execution: verify-style}]
[INFO] Starting audit...
Audit done.

[INFO] [install:install {execution: default-install}]
[INFO] Installing <https://builds.apache.org/job/myfaces-current-2.0/ws/current20/shared/shared-tomahawk/target/myfaces-shared-tomahawk-4.0.21-SNAPSHOT.jar>
to /export/home/hudson/hudson-slave/maven-repositories/1/org/apache/myfaces/shared/myfaces-shared-tomahawk/4.0.21-SNAPSHOT/myfaces-shared-tomahawk-4.0.21-SNAPSHOT.jar
[INFO] Installing <https://builds.apache.org/job/myfaces-current-2.0/ws/current20/shared/shared-tomahawk/target/myfaces-shared-tomahawk-4.0.21-SNAPSHOT-sources.jar>
to /export/home/hudson/hudson-slave/maven-repositories/1/org/apache/myfaces/shared/myfaces-shared-tomahawk/4.0.21-SNAPSHOT/myfaces-shared-tomahawk-4.0.21-SNAPSHOT-sources.jar
[INFO] [deploy:deploy {execution: default-deploy}]
[INFO] Retrieving previous build number from apache.snapshots.https
[WARNING] *** CHECKSUM FAILED - Checksum failed on download: local = '63b3f83bacff380a7feae5177feb92631a3b6860';
remote = '76ece615abbd62a8b27e078af78b411aeb273c6f' - RETRYING
[WARNING] *** CHECKSUM FAILED - Checksum failed on download: local = '63b3f83bacff380a7feae5177feb92631a3b6860';
remote = '76ece615abbd62a8b27e078af78b411aeb273c6f' - IGNORING
Uploading: https://repository.apache.org/content/repositories/snapshots/org/apache/myfaces/shared/myfaces-shared-tomahawk/4.0.21-SNAPSHOT/myfaces-shared-tomahawk-4.0.21-20140422.082239-22.jar
421K uploaded  (myfaces-shared-tomahawk-4.0.21-20140422.082239-22.jar)
[INFO] Uploading project information for myfaces-shared-tomahawk 4.0.21-20140422.082239-22
[INFO] Retrieving previous metadata from apache.snapshots.https
[WARNING] *** CHECKSUM FAILED - Checksum failed on download: local = '63b3f83bacff380a7feae5177feb92631a3b6860';
remote = '76ece615abbd62a8b27e078af78b411aeb273c6f' - RETRYING
[WARNING] *** CHECKSUM FAILED - Checksum failed on download: local = '63b3f83bacff380a7feae5177feb92631a3b6860';
remote = '76ece615abbd62a8b27e078af78b411aeb273c6f' - IGNORING
[INFO] Uploading repository metadata for: 'snapshot org.apache.myfaces.shared:myfaces-shared-tomahawk:4.0.21-SNAPSHOT'
[INFO] Retrieving previous metadata from apache.snapshots.https
[INFO] Uploading repository metadata for: 'artifact org.apache.myfaces.shared:myfaces-shared-tomahawk'
[INFO] Retrieving previous build number from apache.snapshots.https
Uploading: https://repository.apache.org/content/repositories/snapshots/org/apache/myfaces/shared/myfaces-shared-tomahawk/4.0.21-SNAPSHOT/myfaces-shared-tomahawk-4.0.21-20140422.082239-22-sources.jar
379K uploaded  (myfaces-shared-tomahawk-4.0.21-20140422.082239-22-sources.jar)
Build timed out (after 60 minutes). Marking the build as failed.
[INFO] ------------------------------------------------------------------------
[ERROR] FATAL ERROR
[INFO] ------------------------------------------------------------------------
[INFO] Unable to call setResult. Invalid object ID 10
[INFO] ------------------------------------------------------------------------
[INFO] Trace
java.lang.IllegalStateException: Unable to call setResult. Invalid object ID 10
	at hudson.remoting.RemoteInvocationHandler$RPCRequest.perform(RemoteInvocationHandler.java:293)
	at hudson.remoting.RemoteInvocationHandler$RPCRequest.call(RemoteInvocationHandler.java:280)
	at hudson.remoting.RemoteInvocationHandler$RPCRequest.call(RemoteInvocationHandler.java:239)
	at hudson.remoting.UserRequest.perform(UserRequest.java:118)
	at hudson.remoting.UserRequest.perform(UserRequest.java:48)
	at hudson.remoting.Request$2.run(Request.java:328)
	at hudson.remoting.InterceptingExecutorService$1.call(InterceptingExecutorService.java:72)
	at jenkins.util.ContextResettingExecutorService$2.call(ContextResettingExecutorService.java:46)
	at java.util.concurrent.FutureTask.run(FutureTask.java:266)
	at java.util.concurrent.ThreadPoolExecutor.runWorker(ThreadPoolExecutor.java:1142)
	at java.util.concurrent.ThreadPoolExecutor$Worker.run(ThreadPoolExecutor.java:617)
	at java.lang.Thread.run(Thread.java:745)
[INFO] ------------------------------------------------------------------------
[INFO] Total time: 57 minutes 17 seconds
[INFO] Finished at: Tue Apr 22 09:19:02 GMT+00:00 2014
[INFO] Final Memory: 115M/448M
[INFO] ------------------------------------------------------------------------
channel stopped

Mime
View raw message