myfaces-commits mailing list archives

Site index · List index
Message view « Date » · « Thread »
Top « Date » · « Thread »
From Apache Jenkins Server <jenk...@builds.apache.org>
Subject Build failed in Jenkins: myfaces-current-2.0 #2341
Date Thu, 24 Apr 2014 21:06:36 GMT
See <https://builds.apache.org/job/myfaces-current-2.0/2341/>

------------------------------------------
[...truncated 1259 lines...]
Apr 24, 2014 8:10:38 PM javax.faces.component.UIComponentBase getRenderer
WARNING: No Renderer found for component {Component-Path : [Class: javax.faces.component.html.HtmlInputText,Id:
j_id0]} (component-family=javax.faces.Input, renderer-type=javax.faces.Text)
Tests run: 2, Failures: 0, Errors: 0, Skipped: 0, Time elapsed: 0.033 sec
Running org.apache.myfaces.shared.renderkit.html.HtmlResponseWriterImplTest
Tests run: 13, Failures: 0, Errors: 0, Skipped: 0, Time elapsed: 0.018 sec
Running org.apache.myfaces.shared.renderkit.html.util.HTMLEncoderTest
Tests run: 26, Failures: 0, Errors: 0, Skipped: 0, Time elapsed: 0.013 sec
Running org.apache.myfaces.shared.webapp.webxml.ServletMappingTest
Tests run: 2, Failures: 0, Errors: 0, Skipped: 0, Time elapsed: 0 sec
Running org.apache.myfaces.shared.application.DefaultViewHandlerSupportTest
Tests run: 8, Failures: 0, Errors: 0, Skipped: 0, Time elapsed: 0.015 sec

Results :

Tests run: 171, Failures: 0, Errors: 0, Skipped: 0

[JENKINS] Recording test results
[INFO] [jar:jar {execution: default-jar}]
[INFO] Building jar: <https://builds.apache.org/job/myfaces-current-2.0/ws/current20/shared/core/target/myfaces-shared-core-4.0.21-SNAPSHOT.jar>
[INFO] Preparing source:jar
[WARNING] Removing: jar from forked lifecycle, to prevent recursive invocation.
[INFO] No goals needed for project - skipping
[INFO] [source:jar {execution: attach-source}]
[INFO] META-INF already added, skipping
[INFO] META-INF already added, skipping
[INFO] META-INF/DEPENDENCIES already added, skipping
[INFO] META-INF/LICENSE already added, skipping
[INFO] META-INF/NOTICE already added, skipping
[INFO] META-INF already added, skipping
[INFO] Building jar: <https://builds.apache.org/job/myfaces-current-2.0/ws/current20/shared/core/target/myfaces-shared-core-4.0.21-SNAPSHOT-sources.jar>
[INFO] META-INF already added, skipping
[INFO] META-INF already added, skipping
[INFO] META-INF/DEPENDENCIES already added, skipping
[INFO] META-INF/LICENSE already added, skipping
[INFO] META-INF/NOTICE already added, skipping
[INFO] META-INF already added, skipping
[INFO] [checkstyle:check {execution: verify-style}]
[INFO] Starting audit...
Audit done.

[INFO] [install:install {execution: default-install}]
[INFO] Installing <https://builds.apache.org/job/myfaces-current-2.0/ws/current20/shared/core/target/myfaces-shared-core-4.0.21-SNAPSHOT.jar>
to /export/home/hudson/hudson-slave/maven-repositories/1/org/apache/myfaces/shared/myfaces-shared-core/4.0.21-SNAPSHOT/myfaces-shared-core-4.0.21-SNAPSHOT.jar
[INFO] Installing <https://builds.apache.org/job/myfaces-current-2.0/ws/current20/shared/core/target/myfaces-shared-core-4.0.21-SNAPSHOT-sources.jar>
to /export/home/hudson/hudson-slave/maven-repositories/1/org/apache/myfaces/shared/myfaces-shared-core/4.0.21-SNAPSHOT/myfaces-shared-core-4.0.21-SNAPSHOT-sources.jar
[INFO] [deploy:deploy {execution: default-deploy}]
[INFO] Retrieving previous build number from apache.snapshots.https
[WARNING] *** CHECKSUM FAILED - Checksum failed on download: local = '79bdcb7589dfde0f08c3551155ef62b6c433c4a3';
remote = '22327e291404a449aa7cbde160774d93045bc0a8' - RETRYING
[WARNING] *** CHECKSUM FAILED - Checksum failed on download: local = '79bdcb7589dfde0f08c3551155ef62b6c433c4a3';
remote = '22327e291404a449aa7cbde160774d93045bc0a8' - IGNORING
Uploading: https://repository.apache.org/content/repositories/snapshots/org/apache/myfaces/shared/myfaces-shared-core/4.0.21-SNAPSHOT/myfaces-shared-core-4.0.21-20140424.194108-25.jar
451K uploaded  (myfaces-shared-core-4.0.21-20140424.194108-25.jar)
[INFO] Retrieving previous metadata from apache.snapshots.https
[WARNING] *** CHECKSUM FAILED - Checksum failed on download: local = '79bdcb7589dfde0f08c3551155ef62b6c433c4a3';
remote = '22327e291404a449aa7cbde160774d93045bc0a8' - RETRYING
[WARNING] *** CHECKSUM FAILED - Checksum failed on download: local = '79bdcb7589dfde0f08c3551155ef62b6c433c4a3';
remote = '22327e291404a449aa7cbde160774d93045bc0a8' - IGNORING
[INFO] Uploading repository metadata for: 'snapshot org.apache.myfaces.shared:myfaces-shared-core:4.0.21-SNAPSHOT'
[INFO] Uploading project information for myfaces-shared-core 4.0.21-20140424.194108-25
[INFO] Retrieving previous metadata from apache.snapshots.https
[INFO] Uploading repository metadata for: 'artifact org.apache.myfaces.shared:myfaces-shared-core'
[INFO] Retrieving previous build number from apache.snapshots.https
Uploading: https://repository.apache.org/content/repositories/snapshots/org/apache/myfaces/shared/myfaces-shared-core/4.0.21-SNAPSHOT/myfaces-shared-core-4.0.21-20140424.194108-25-sources.jar
411K uploaded  (myfaces-shared-core-4.0.21-20140424.194108-25-sources.jar)
[INFO] ------------------------------------------------------------------------
[INFO] Building MyFaces Shared Tomahawk
[INFO]    task-segment: [clean, deploy]
[INFO] ------------------------------------------------------------------------
[INFO] [clean:clean {execution: default-clean}]
[INFO] Deleting <https://builds.apache.org/job/myfaces-current-2.0/ws/current20/shared/shared-tomahawk/target>
[INFO] [dependency:unpack {execution: unpack-sources}]
[INFO] Configured Artifact: org.apache.myfaces.shared:myfaces-shared-core:sources:4.0.21-SNAPSHOT:jar
[INFO] snapshot org.apache.myfaces.shared:myfaces-shared-core:4.0.21-SNAPSHOT: checking for
updates from apache-maven-snapshots
[INFO] snapshot org.apache.myfaces.shared:myfaces-shared-core:4.0.21-SNAPSHOT: checking for
updates from apache.snapshots
[INFO] Unpacking /export/home/hudson/hudson-slave/maven-repositories/1/org/apache/myfaces/shared/myfaces-shared-core/4.0.21-SNAPSHOT/myfaces-shared-core-4.0.21-SNAPSHOT-sources.jarto
 <https://builds.apache.org/job/myfaces-current-2.0/ws/current20/shared/shared-tomahawk/target/unpacked-shared-sources>
with Includes null and excludes:null
[INFO] [dependency:unpack {execution: unpack-resources-sources}]
[INFO] Configured Artifact: org.apache.myfaces.shared:myfaces-shared-core:4.0.21-SNAPSHOT:jar
[INFO] Unpacking /export/home/hudson/hudson-slave/maven-repositories/1/org/apache/myfaces/shared/myfaces-shared-core/4.0.21-SNAPSHOT/myfaces-shared-core-4.0.21-SNAPSHOT.jarto
 <https://builds.apache.org/job/myfaces-current-2.0/ws/current20/shared/shared-tomahawk/target/refactored-shared-sources/main/resources>
with Includes META-INF/internal-resources/**,META-INF/resources/** and excludes:null
[INFO] [build-helper:add-source {execution: add-source-shared}]
[INFO] Source directory: <https://builds.apache.org/job/myfaces-current-2.0/ws/current20/shared/shared-tomahawk/target/refactored-shared-sources/main/java>
added.
[WARNING] DEPRECATED [sourceRoot]: Use the build-helper-maven-plugin to bind source directories
[WARNING] DEPRECATED [tasks]: Use target instead
[INFO] [antrun:run {execution: refactor-shared-sources}]
[WARNING] Parameter tasks is deprecated, use target instead
[INFO] Executing tasks

main:

refactor-java-sources:
    [mkdir] Created dir: <https://builds.apache.org/job/myfaces-current-2.0/ws/current20/shared/shared-tomahawk/target/refactored-shared-sources/main/java>
     [move] Moving 140 files to <https://builds.apache.org/job/myfaces-current-2.0/ws/current20/shared/shared-tomahawk/target/refactored-shared-sources/main/java/org/apache/myfaces/shared_tomahawk>
[INFO] Executed tasks
[INFO] Registering compile source root <https://builds.apache.org/job/myfaces-current-2.0/ws/current20/shared/shared-tomahawk/target/refactored-shared-sources/main/java>
[INFO] [remote-resources:process {execution: default}]
[WARNING] DEPRECATED [tasks]: Use target instead
[INFO] [antrun:run {execution: refactor-resources}]
[WARNING] Parameter tasks is deprecated, use target instead
[INFO] Executing tasks

main:

refactor-resources:
[INFO] Executed tasks
[debug] execute contextualize
[INFO] [resources:resources {execution: default-resources}]
[INFO] Using 'UTF-8' encoding to copy filtered resources.
[INFO] Copying 2 resources
[INFO] Copying 3 resources
[INFO] [dependency:unpack {execution: unpack-resources}]
[INFO] Configured Artifact: org.apache.myfaces.shared:myfaces-shared-core:4.0.21-SNAPSHOT:jar
[INFO] Unpacking /export/home/hudson/hudson-slave/maven-repositories/1/org/apache/myfaces/shared/myfaces-shared-core/4.0.21-SNAPSHOT/myfaces-shared-core-4.0.21-SNAPSHOT.jarto
 <https://builds.apache.org/job/myfaces-current-2.0/ws/current20/shared/shared-tomahawk/target/classes>
with Includes META-INF/internal-resources/**,META-INF/resources/** and excludes:null
[INFO] [compiler:compile {execution: default-compile}]
[INFO] Compiling 140 source files to <https://builds.apache.org/job/myfaces-current-2.0/ws/current20/shared/shared-tomahawk/target/classes>
[debug] execute contextualize
[INFO] [resources:testResources {execution: default-testResources}]
[INFO] Using 'UTF-8' encoding to copy filtered resources.
[INFO] skip non existing resourceDirectory <https://builds.apache.org/job/myfaces-current-2.0/ws/current20/shared/shared-tomahawk/src/test/resources>
[INFO] Copying 3 resources
[INFO] [compiler:testCompile {execution: default-testCompile}]
[INFO] No sources to compile
[INFO] [surefire:test {execution: default-test}]
[INFO] Surefire report directory: <https://builds.apache.org/job/myfaces-current-2.0/ws/current20/shared/shared-tomahawk/target/surefire-reports>

-------------------------------------------------------
 T E S T S
-------------------------------------------------------

Results :

Tests run: 0, Failures: 0, Errors: 0, Skipped: 0

[JENKINS] Recording test results
[INFO] [jar:jar {execution: default-jar}]
[INFO] Building jar: <https://builds.apache.org/job/myfaces-current-2.0/ws/current20/shared/shared-tomahawk/target/myfaces-shared-tomahawk-4.0.21-SNAPSHOT.jar>
[INFO] Preparing source:jar
[WARNING] Removing: jar from forked lifecycle, to prevent recursive invocation.
[INFO] [dependency:unpack {execution: unpack-sources}]
[INFO] Configured Artifact: org.apache.myfaces.shared:myfaces-shared-core:sources:4.0.21-SNAPSHOT:jar
[INFO] myfaces-shared-core-4.0.21-SNAPSHOT-sources.jar already unpacked.
[INFO] [dependency:unpack {execution: unpack-resources-sources}]
[INFO] Configured Artifact: org.apache.myfaces.shared:myfaces-shared-core:4.0.21-SNAPSHOT:jar
[INFO] Unpacking /export/home/hudson/hudson-slave/maven-repositories/1/org/apache/myfaces/shared/myfaces-shared-core/4.0.21-SNAPSHOT/myfaces-shared-core-4.0.21-SNAPSHOT.jarto
 <https://builds.apache.org/job/myfaces-current-2.0/ws/current20/shared/shared-tomahawk/target/refactored-shared-sources/main/resources>
with Includes META-INF/internal-resources/**,META-INF/resources/** and excludes:null
ERROR: Could not find local repository for 2.2.1
[INFO] [source:jar {execution: attach-source}]
[INFO] META-INF already added, skipping
[INFO] META-INF already added, skipping
[INFO] META-INF/DEPENDENCIES already added, skipping
[INFO] META-INF/NOTICE already added, skipping
[INFO] META-INF/LICENSE already added, skipping
[INFO] Building jar: <https://builds.apache.org/job/myfaces-current-2.0/ws/current20/shared/shared-tomahawk/target/myfaces-shared-tomahawk-4.0.21-SNAPSHOT-sources.jar>
[INFO] META-INF already added, skipping
[INFO] META-INF already added, skipping
[INFO] META-INF/DEPENDENCIES already added, skipping
[INFO] META-INF/NOTICE already added, skipping
[INFO] META-INF/LICENSE already added, skipping
[INFO] [checkstyle:check {execution: verify-style}]
[INFO] Starting audit...
Audit done.

[INFO] [install:install {execution: default-install}]
[INFO] Installing <https://builds.apache.org/job/myfaces-current-2.0/ws/current20/shared/shared-tomahawk/target/myfaces-shared-tomahawk-4.0.21-SNAPSHOT.jar>
to /export/home/hudson/hudson-slave/maven-repositories/1/org/apache/myfaces/shared/myfaces-shared-tomahawk/4.0.21-SNAPSHOT/myfaces-shared-tomahawk-4.0.21-SNAPSHOT.jar
[INFO] Installing <https://builds.apache.org/job/myfaces-current-2.0/ws/current20/shared/shared-tomahawk/target/myfaces-shared-tomahawk-4.0.21-SNAPSHOT-sources.jar>
to /export/home/hudson/hudson-slave/maven-repositories/1/org/apache/myfaces/shared/myfaces-shared-tomahawk/4.0.21-SNAPSHOT/myfaces-shared-tomahawk-4.0.21-SNAPSHOT-sources.jar
[INFO] [deploy:deploy {execution: default-deploy}]
[INFO] Retrieving previous build number from apache.snapshots.https
[WARNING] *** CHECKSUM FAILED - Checksum failed on download: local = 'ffe0c4a7c7e74449745a13e8a08e70fda224f0b2';
remote = 'c8f506b63146dd72081698f193ef9972686a8a0c' - RETRYING
[WARNING] *** CHECKSUM FAILED - Checksum failed on download: local = 'ffe0c4a7c7e74449745a13e8a08e70fda224f0b2';
remote = 'c8f506b63146dd72081698f193ef9972686a8a0c' - IGNORING
Uploading: https://repository.apache.org/content/repositories/snapshots/org/apache/myfaces/shared/myfaces-shared-tomahawk/4.0.21-SNAPSHOT/myfaces-shared-tomahawk-4.0.21-20140424.194108-23.jar
421K uploaded  (myfaces-shared-tomahawk-4.0.21-20140424.194108-23.jar)
[INFO] Uploading project information for myfaces-shared-tomahawk 4.0.21-20140424.194108-23
[INFO] Retrieving previous metadata from apache.snapshots.https
[WARNING] *** CHECKSUM FAILED - Checksum failed on download: local = 'ffe0c4a7c7e74449745a13e8a08e70fda224f0b2';
remote = 'c8f506b63146dd72081698f193ef9972686a8a0c' - RETRYING
[WARNING] *** CHECKSUM FAILED - Checksum failed on download: local = 'ffe0c4a7c7e74449745a13e8a08e70fda224f0b2';
remote = 'c8f506b63146dd72081698f193ef9972686a8a0c' - IGNORING
[INFO] Uploading repository metadata for: 'snapshot org.apache.myfaces.shared:myfaces-shared-tomahawk:4.0.21-SNAPSHOT'
[INFO] Retrieving previous metadata from apache.snapshots.https
[INFO] Uploading repository metadata for: 'artifact org.apache.myfaces.shared:myfaces-shared-tomahawk'
[INFO] Retrieving previous build number from apache.snapshots.https
Uploading: https://repository.apache.org/content/repositories/snapshots/org/apache/myfaces/shared/myfaces-shared-tomahawk/4.0.21-SNAPSHOT/myfaces-shared-tomahawk-4.0.21-20140424.194108-23-sources.jar
379K uploaded  (myfaces-shared-tomahawk-4.0.21-20140424.194108-23-sources.jar)
[INFO] ------------------------------------------------------------------------
[INFO] Building Apache MyFaces Shared Public API For JSF 2.0 - Core
[INFO]    task-segment: [clean, deploy]
[INFO] ------------------------------------------------------------------------
[INFO] [clean:clean {execution: default-clean}]
[INFO] [myfaces-builder:build-metadata {execution: makemyfacesmetadata}]
Artifact: myfaces-api-2.0.22-SNAPSHOT.jar have META-INF/myfaces-metadata.xml
[INFO] [remote-resources:process {execution: default}]
[debug] execute contextualize
[INFO] [resources:resources {execution: default-resources}]
[INFO] Using 'UTF-8' encoding to copy filtered resources.
[INFO] Copying 2 resources
[INFO] Copying 1 resource
[INFO] Copying 3 resources
[INFO] [compiler:compile {execution: default-compile}]
[INFO] Compiling 21 source files to <https://builds.apache.org/job/myfaces-current-2.0/ws/current20/core/shared-public/target/classes>
[debug] execute contextualize
[INFO] [resources:testResources {execution: default-testResources}]
[INFO] Using 'UTF-8' encoding to copy filtered resources.
[INFO] Copying 15 resources
[INFO] Copying 3 resources
[INFO] [compiler:testCompile {execution: default-testCompile}]
[INFO] Compiling 1 source file to <https://builds.apache.org/job/myfaces-current-2.0/ws/current20/core/shared-public/target/test-classes>
[INFO] [surefire:test {execution: default-test}]
[INFO] Surefire report directory: <https://builds.apache.org/job/myfaces-current-2.0/ws/current20/core/shared-public/target/surefire-reports>

-------------------------------------------------------
 T E S T S
-------------------------------------------------------
Running org.apache.myfaces.shared.util.MessageUtilsTest
currency ?100.00
Tests run: 11, Failures: 0, Errors: 0, Skipped: 0, Time elapsed: 0.814 sec

Results :

Tests run: 11, Failures: 0, Errors: 0, Skipped: 0

[JENKINS] Recording test results
[INFO] [jar:jar {execution: default-jar}]
[INFO] Building jar: <https://builds.apache.org/job/myfaces-current-2.0/ws/current20/core/shared-public/target/myfaces-impl-shared-public-2.0.22-SNAPSHOT.jar>
[INFO] Preparing source:jar
[WARNING] Removing: jar from forked lifecycle, to prevent recursive invocation.
Build timed out (after 60 minutes). Marking the build as failed.
[INFO] ------------------------------------------------------------------------
[ERROR] FATAL ERROR
[INFO] ------------------------------------------------------------------------
[INFO] Unable to call setResult. Invalid object ID 16
[INFO] ------------------------------------------------------------------------
[INFO] Trace
java.lang.IllegalStateException: Unable to call setResult. Invalid object ID 16
	at hudson.remoting.RemoteInvocationHandler$RPCRequest.perform(RemoteInvocationHandler.java:293)
	at hudson.remoting.RemoteInvocationHandler$RPCRequest.call(RemoteInvocationHandler.java:280)
	at hudson.remoting.RemoteInvocationHandler$RPCRequest.call(RemoteInvocationHandler.java:239)
	at hudson.remoting.UserRequest.perform(UserRequest.java:118)
	at hudson.remoting.UserRequest.perform(UserRequest.java:48)
	at hudson.remoting.Request$2.run(Request.java:328)
	at hudson.remoting.InterceptingExecutorService$1.call(InterceptingExecutorService.java:72)
	at jenkins.util.ContextResettingExecutorService$2.call(ContextResettingExecutorService.java:46)
	at java.util.concurrent.FutureTask.run(FutureTask.java:266)
	at java.util.concurrent.ThreadPoolExecutor.runWorker(ThreadPoolExecutor.java:1142)
	at java.util.concurrent.ThreadPoolExecutor$Worker.run(ThreadPoolExecutor.java:617)
	at java.lang.Thread.run(Thread.java:745)
[INFO] ------------------------------------------------------------------------
[INFO] Total time: 56 minutes 33 seconds
[INFO] Finished at: Thu Apr 24 20:36:39 GMT+00:00 2014
[INFO] Final Memory: 119M/455M
[INFO] ------------------------------------------------------------------------
channel stopped

Mime
View raw message