myfaces-commits mailing list archives

Site index · List index
Message view « Date » · « Thread »
Top « Date » · « Thread »
From Apache Jenkins Server <jenk...@builds.apache.org>
Subject Build failed in Jenkins: myfaces-current-2.0 #2361
Date Sun, 08 Jun 2014 11:13:10 GMT
See <https://builds.apache.org/job/myfaces-current-2.0/2361/>

------------------------------------------
Started by upstream project "maven-plugins" build number 1929
originally caused by:
 Started by an SCM change
 Started by an SCM change
Building remotely on windows2 (Windows) in workspace <https://builds.apache.org/job/myfaces-current-2.0/ws/>
Updating http://svn.apache.org/repos/asf/myfaces/current20 at revision '2014-06-08T04:11:58.067
-0700'
Fetching 'https://svn.apache.org/repos/asf/myfaces/core/branches/2.0.x' at -1 into 'F:\jenkins\jenkins-slave\workspace\myfaces-current-2.0\current20\core'
At revision 1601210
Fetching 'https://svn.apache.org/repos/asf/myfaces/shared/trunk_4.0.x' at -1 into 'F:\jenkins\jenkins-slave\workspace\myfaces-current-2.0\current20\shared'
At revision 1601210
At revision 1601210
no change for http://svn.apache.org/repos/asf/myfaces/current20 since the previous build
no change for https://svn.apache.org/repos/asf/myfaces/core/branches/2.0.x since the previous
build
no change for https://svn.apache.org/repos/asf/myfaces/shared/trunk_4.0.x since the previous
build
Parsing POMs
maven31-agent.jar already up to date
maven31-interceptor.jar already up to date
maven3-interceptor-commons.jar already up to date
[current20] $ f:\jenkins\tools\java\latest-1.6-64/bin/java -cp f:\jenkins\jenkins-slave\maven31-agent.jar;f:\jenkins\tools\maven\latest\boot\plexus-classworlds-2.5.1.jar;f:\jenkins\tools\maven\latest/conf/logging
jenkins.maven3.agent.Maven31Main f:\jenkins\tools\maven\latest F:\jenkins\jenkins-slave\slave.jar
f:\jenkins\jenkins-slave\maven31-interceptor.jar f:\jenkins\jenkins-slave\maven3-interceptor-commons.jar
49514
<===[JENKINS REMOTING CAPACITY]===>   channel started
log4j:WARN No appenders could be found for logger (org.apache.commons.beanutils.converters.BooleanConverter).
log4j:WARN Please initialize the log4j system properly.
Executing Maven:  -B -f <https://builds.apache.org/job/myfaces-current-2.0/ws/current20\pom.xml>
-Dmaven.repo.local=f:\jenkins\jenkins-slave\maven-repositories\0 clean deploy
[INFO] Scanning for projects...
[WARNING] 
[WARNING] Some problems were encountered while building the effective model for org.apache.myfaces.shared:myfaces-shared-core:jar:4.0.21-SNAPSHOT
[WARNING] 'parent.relativePath' of POM org.apache.myfaces.shared:myfaces-shared-project:4.0.21-SNAPSHOT
(F:\jenkins\jenkins-slave\workspace\myfaces-current-2.0\current20\shared\pom.xml) points at
org.apache.myfaces:myfaces-base instead of org.apache.myfaces:myfaces, please verify your
project structure @ org.apache.myfaces.shared:myfaces-shared-project:4.0.21-SNAPSHOT, F:\jenkins\jenkins-slave\workspace\myfaces-current-2.0\current20\shared\pom.xml,
line 39, column 11
[WARNING] 
[WARNING] Some problems were encountered while building the effective model for org.apache.myfaces.shared:myfaces-shared-tomahawk:jar:4.0.21-SNAPSHOT
[WARNING] 'parent.relativePath' of POM org.apache.myfaces.shared:myfaces-shared-project:4.0.21-SNAPSHOT
(F:\jenkins\jenkins-slave\workspace\myfaces-current-2.0\current20\shared\pom.xml) points at
org.apache.myfaces:myfaces-base instead of org.apache.myfaces:myfaces, please verify your
project structure @ org.apache.myfaces.shared:myfaces-shared-project:4.0.21-SNAPSHOT, F:\jenkins\jenkins-slave\workspace\myfaces-current-2.0\current20\shared\pom.xml,
line 39, column 11
[WARNING] 
[WARNING] Some problems were encountered while building the effective model for org.apache.myfaces.shared:myfaces-shared-project:pom:4.0.21-SNAPSHOT
[WARNING] 'parent.relativePath' points at org.apache.myfaces:myfaces-base instead of org.apache.myfaces:myfaces,
please verify your project structure @ line 39, column 11
[WARNING] 
[WARNING] Some problems were encountered while building the effective model for org.apache.myfaces.core:myfaces-core-project:pom:2.0.22-SNAPSHOT
[WARNING] 'parent.relativePath' points at org.apache.myfaces.core:myfaces-core-module instead
of org.apache.myfaces:myfaces, please verify your project structure @ line 20, column 13
[WARNING] 
[WARNING] Some problems were encountered while building the effective model for org.apache.myfaces.core:myfaces-api:jar:2.0.22-SNAPSHOT
[WARNING] 'parent.relativePath' of POM org.apache.myfaces.core:myfaces-core-project:2.0.22-SNAPSHOT
(F:\jenkins\jenkins-slave\workspace\myfaces-current-2.0\current20\core\parent\pom.xml) points
at org.apache.myfaces.core:myfaces-core-module instead of org.apache.myfaces:myfaces, please
verify your project structure @ org.apache.myfaces.core:myfaces-core-project:2.0.22-SNAPSHOT,
F:\jenkins\jenkins-slave\workspace\myfaces-current-2.0\current20\core\parent\pom.xml, line
20, column 13
[WARNING] 'build.plugins.plugin.version' for de.berlios.jsunit:jsunit-maven2-plugin is missing.
@ line 292, column 21
[WARNING] 
[WARNING] Some problems were encountered while building the effective model for org.apache.myfaces.core.internal:myfaces-impl-ee6:jar:2.0.22-SNAPSHOT
[WARNING] 'parent.relativePath' of POM org.apache.myfaces.core:myfaces-core-project:2.0.22-SNAPSHOT
(F:\jenkins\jenkins-slave\workspace\myfaces-current-2.0\current20\core\parent\pom.xml) points
at org.apache.myfaces.core:myfaces-core-module instead of org.apache.myfaces:myfaces, please
verify your project structure @ org.apache.myfaces.core:myfaces-core-project:2.0.22-SNAPSHOT,
F:\jenkins\jenkins-slave\workspace\myfaces-current-2.0\current20\core\parent\pom.xml, line
20, column 13
[WARNING] 
[WARNING] Some problems were encountered while building the effective model for org.apache.myfaces.core.internal:myfaces-impl-shared-public:jar:2.0.22-SNAPSHOT
[WARNING] 'parent.relativePath' of POM org.apache.myfaces.core:myfaces-core-project:2.0.22-SNAPSHOT
(F:\jenkins\jenkins-slave\workspace\myfaces-current-2.0\current20\core\parent\pom.xml) points
at org.apache.myfaces.core:myfaces-core-module instead of org.apache.myfaces:myfaces, please
verify your project structure @ org.apache.myfaces.core:myfaces-core-project:2.0.22-SNAPSHOT,
F:\jenkins\jenkins-slave\workspace\myfaces-current-2.0\current20\core\parent\pom.xml, line
20, column 13
[WARNING] 
[WARNING] Some problems were encountered while building the effective model for org.apache.myfaces.core.internal:myfaces-impl-shared:jar:2.0.22-SNAPSHOT
[WARNING] 'parent.relativePath' of POM org.apache.myfaces.core:myfaces-core-project:2.0.22-SNAPSHOT
(F:\jenkins\jenkins-slave\workspace\myfaces-current-2.0\current20\core\parent\pom.xml) points
at org.apache.myfaces.core:myfaces-core-module instead of org.apache.myfaces:myfaces, please
verify your project structure @ org.apache.myfaces.core:myfaces-core-project:2.0.22-SNAPSHOT,
F:\jenkins\jenkins-slave\workspace\myfaces-current-2.0\current20\core\parent\pom.xml, line
20, column 13
[WARNING] 
[WARNING] Some problems were encountered while building the effective model for org.apache.myfaces.core:myfaces-impl:jar:2.0.22-SNAPSHOT
[WARNING] 'build.plugins.plugin.(groupId:artifactId)' must be unique but found duplicate declaration
of plugin org.apache.maven.plugins:maven-jar-plugin @ line 378, column 21
[WARNING] 'parent.relativePath' of POM org.apache.myfaces.core:myfaces-core-project:2.0.22-SNAPSHOT
(F:\jenkins\jenkins-slave\workspace\myfaces-current-2.0\current20\core\parent\pom.xml) points
at org.apache.myfaces.core:myfaces-core-module instead of org.apache.myfaces:myfaces, please
verify your project structure @ org.apache.myfaces.core:myfaces-core-project:2.0.22-SNAPSHOT,
F:\jenkins\jenkins-slave\workspace\myfaces-current-2.0\current20\core\parent\pom.xml, line
20, column 13
[WARNING] 
[WARNING] Some problems were encountered while building the effective model for org.apache.myfaces.core:myfaces-bundle:bundle:2.0.22-SNAPSHOT
[WARNING] 'parent.relativePath' of POM org.apache.myfaces.core:myfaces-core-project:2.0.22-SNAPSHOT
(F:\jenkins\jenkins-slave\workspace\myfaces-current-2.0\current20\core\parent\pom.xml) points
at org.apache.myfaces.core:myfaces-core-module instead of org.apache.myfaces:myfaces, please
verify your project structure @ org.apache.myfaces.core:myfaces-core-project:2.0.22-SNAPSHOT,
F:\jenkins\jenkins-slave\workspace\myfaces-current-2.0\current20\core\parent\pom.xml, line
20, column 13
[WARNING] 
[WARNING] Some problems were encountered while building the effective model for org.apache.myfaces.core:myfaces-core-module:pom:2.0.22-SNAPSHOT
[WARNING] 'parent.relativePath' points at org.apache.myfaces:myfaces-base instead of org.apache.myfaces:myfaces,
please verify your project structure @ line 20, column 13
[WARNING] 
[WARNING] It is highly recommended to fix these problems because they threaten the stability
of your build.
[WARNING] 
[WARNING] For this reason, future Maven versions might no longer support building such malformed
projects.
[WARNING] 
[INFO] ------------------------------------------------------------------------
[INFO] Reactor Build Order:
[INFO] 
[INFO] Apache MyFaces Shared For JSF 2.0 - Project
[INFO] Apache MyFaces Shared For JSF 2.0 - Core Mirror
[INFO] MyFaces Shared Tomahawk
[INFO] Apache MyFaces JSF-2.0 Core Project
[INFO] Apache MyFaces JSF-2.0 Core API
[INFO] Apache MyFaces Shared Public API For JSF 2.0 - Core
[INFO] Apache MyFaces Shared For JSF 2.0 - Core
[INFO] Apache MyFaces JSF-2.0 Core Impl for Java EE 6
[INFO] Apache MyFaces JSF-2.0 Core Impl
[INFO] Apache MyFaces JSF-2.0 Core OSGi Bundle
[INFO] Apache MyFaces JSF-2.0 Core Module
[INFO] Apache MyFaces Composite Build
[INFO]                                                                         
[INFO] ------------------------------------------------------------------------
[INFO] Building Apache MyFaces Shared For JSF 2.0 - Project 4.0.21-SNAPSHOT
[INFO] ------------------------------------------------------------------------
[INFO] 
[INFO] --- maven-clean-plugin:2.5:clean (default-clean) @ myfaces-shared-project ---
[INFO] Deleting F:\jenkins\jenkins-slave\workspace\myfaces-current-2.0\current20\shared\target
[INFO] 
[INFO] --- maven-remote-resources-plugin:1.4:process (default) @ myfaces-shared-project ---
[INFO] 
[INFO] --- maven-site-plugin:3.2:attach-descriptor (attach-descriptor) @ myfaces-shared-project
---
[INFO] 
[INFO] --- maven-checkstyle-plugin:2.6:check (verify-style) @ myfaces-shared-project ---
[INFO] Starting audit...
Audit done.

[INFO] 
[INFO] --- maven-install-plugin:2.3.1:install (default-install) @ myfaces-shared-project ---
[INFO] Installing F:\jenkins\jenkins-slave\workspace\myfaces-current-2.0\current20\shared\pom.xml
to f:\jenkins\jenkins-slave\maven-repositories\0\org\apache\myfaces\shared\myfaces-shared-project\4.0.21-SNAPSHOT\myfaces-shared-project-4.0.21-SNAPSHOT.pom
[INFO] Installing F:\jenkins\jenkins-slave\workspace\myfaces-current-2.0\current20\shared\target\myfaces-shared-project-4.0.21-SNAPSHOT-site.xml
to f:\jenkins\jenkins-slave\maven-repositories\0\org\apache\myfaces\shared\myfaces-shared-project\4.0.21-SNAPSHOT\myfaces-shared-project-4.0.21-SNAPSHOT-site.xml
[INFO] 
[INFO] --- maven-deploy-plugin:2.7:deploy (default-deploy) @ myfaces-shared-project ---
[INFO] Downloading: https://repository.apache.org/content/repositories/snapshots/org/apache/myfaces/shared/myfaces-shared-project/4.0.21-SNAPSHOT/maven-metadata.xml
[INFO] Downloaded: https://repository.apache.org/content/repositories/snapshots/org/apache/myfaces/shared/myfaces-shared-project/4.0.21-SNAPSHOT/maven-metadata.xml
(385 B at 0.4 KB/sec)
[INFO] Uploading: https://repository.apache.org/content/repositories/snapshots/org/apache/myfaces/shared/myfaces-shared-project/4.0.21-SNAPSHOT/myfaces-shared-project-4.0.21-20140608.111257-36.pom
[INFO] ------------------------------------------------------------------------
[INFO] Reactor Summary:
[INFO] 
[INFO] Apache MyFaces Shared For JSF 2.0 - Project ....... FAILURE [23.942s]
[INFO] Apache MyFaces Shared For JSF 2.0 - Core Mirror ... SKIPPED
[INFO] MyFaces Shared Tomahawk ........................... SKIPPED
[INFO] Apache MyFaces JSF-2.0 Core Project ............... SKIPPED
[INFO] Apache MyFaces JSF-2.0 Core API ................... SKIPPED
[INFO] Apache MyFaces Shared Public API For JSF 2.0 - Core  SKIPPED
[INFO] Apache MyFaces Shared For JSF 2.0 - Core .......... SKIPPED
[INFO] Apache MyFaces JSF-2.0 Core Impl for Java EE 6 .... SKIPPED
[INFO] Apache MyFaces JSF-2.0 Core Impl .................. SKIPPED
[INFO] Apache MyFaces JSF-2.0 Core OSGi Bundle ........... SKIPPED
[INFO] Apache MyFaces JSF-2.0 Core Module ................ SKIPPED
[INFO] Apache MyFaces Composite Build .................... SKIPPED
[INFO] ------------------------------------------------------------------------
[INFO] BUILD FAILURE
[INFO] ------------------------------------------------------------------------
[INFO] Total time: 31.928s
[INFO] Finished at: Sun Jun 08 04:12:57 PDT 2014
[INFO] Final Memory: 20M/61M
[INFO] ------------------------------------------------------------------------
[ERROR] Failed to execute goal org.apache.maven.plugins:maven-deploy-plugin:2.7:deploy (default-deploy)
on project myfaces-shared-project: Failed to deploy artifacts: Could not transfer artifact
org.apache.myfaces.shared:myfaces-shared-project:pom:4.0.21-20140608.111257-36 from/to apache.snapshots.https
(https://repository.apache.org/content/repositories/snapshots): Failed to transfer file: https://repository.apache.org/content/repositories/snapshots/org/apache/myfaces/shared/myfaces-shared-project/4.0.21-SNAPSHOT/myfaces-shared-project-4.0.21-20140608.111257-36.pom.
Return code is: 401, ReasonPhrase: Unauthorized. -> [Help 1]
[ERROR] 
[ERROR] To see the full stack trace of the errors, re-run Maven with the -e switch.
[ERROR] Re-run Maven using the -X switch to enable full debug logging.
[ERROR] 
[ERROR] For more information about the errors and possible solutions, please read the following
articles:
[ERROR] [Help 1] http://cwiki.apache.org/confluence/display/MAVEN/MojoExecutionException
[JENKINS] Archiving F:\jenkins\jenkins-slave\workspace\myfaces-current-2.0\current20\shared\shared-tomahawk\pom.xml
to org.apache.myfaces.shared/myfaces-shared-tomahawk/4.0.21-SNAPSHOT/myfaces-shared-tomahawk-4.0.21-SNAPSHOT.pom
Sending artifact delta relative to myfaces-current-2.0 » MyFaces Shared Tomahawk #2358
Archived 1 artifacts
Archive block size is 32768
Received 0 blocks and 8191 bytes
Compression is 0.0%
Took 0.11 sec
[JENKINS] Archiving F:\jenkins\jenkins-slave\workspace\myfaces-current-2.0\current20\core\shared-public\pom.xml
to org.apache.myfaces.core.internal/myfaces-impl-shared-public/2.0.22-SNAPSHOT/myfaces-impl-shared-public-2.0.22-SNAPSHOT.pom
Sending artifact delta relative to myfaces-current-2.0 » Apache MyFaces Shared Public API
For JSF 2.0 - Core #2358
Archived 1 artifacts
Archive block size is 32768
Received 0 blocks and 7224 bytes
Compression is 0.0%
Took 0.1 sec
[JENKINS] Archiving F:\jenkins\jenkins-slave\workspace\myfaces-current-2.0\current20\core\impl\pom.xml
to org.apache.myfaces.core/myfaces-impl/2.0.22-SNAPSHOT/myfaces-impl-2.0.22-SNAPSHOT.pom
Sending artifact delta relative to myfaces-current-2.0 » Apache MyFaces JSF-2.0 Core Impl
#2358
Archived 1 artifacts
Archive block size is 32768
Received 0 blocks and 60186 bytes
Compression is 0.0%
Took 0.24 sec
[JENKINS] Archiving F:\jenkins\jenkins-slave\workspace\myfaces-current-2.0\current20\shared\core\pom.xml
to org.apache.myfaces.shared/myfaces-shared-core/4.0.21-SNAPSHOT/myfaces-shared-core-4.0.21-SNAPSHOT.pom
Sending artifact delta relative to myfaces-current-2.0 » Apache MyFaces Shared For JSF 2.0
- Core Mirror #2358
Archived 1 artifacts
Archive block size is 32768
Received 0 blocks and 12829 bytes
Compression is 0.0%
Took 2 sec
[JENKINS] Archiving F:\jenkins\jenkins-slave\workspace\myfaces-current-2.0\current20\core\bundle\pom.xml
to org.apache.myfaces.core/myfaces-bundle/2.0.22-SNAPSHOT/myfaces-bundle-2.0.22-SNAPSHOT.pom
Sending artifact delta relative to myfaces-current-2.0 » Apache MyFaces JSF-2.0 Core OSGi
Bundle #2358
Archived 1 artifacts
Archive block size is 32768
Received 0 blocks and 6867 bytes
Compression is 0.0%
Took 0.19 sec
[JENKINS] Archiving F:\jenkins\jenkins-slave\workspace\myfaces-current-2.0\current20\core\api\pom.xml
to org.apache.myfaces.core/myfaces-api/2.0.22-SNAPSHOT/myfaces-api-2.0.22-SNAPSHOT.pom
Sending artifact delta relative to myfaces-current-2.0 » Apache MyFaces JSF-2.0 Core API
#2358
Archived 1 artifacts
Archive block size is 32768
Received 0 blocks and 34717 bytes
Compression is 0.0%
Took 0.13 sec
[JENKINS] Archiving F:\jenkins\jenkins-slave\workspace\myfaces-current-2.0\current20\shared\pom.xml
to org.apache.myfaces.shared/myfaces-shared-project/4.0.21-SNAPSHOT/myfaces-shared-project-4.0.21-SNAPSHOT.pom
[JENKINS] Archiving F:\jenkins\jenkins-slave\workspace\myfaces-current-2.0\current20\shared\target\myfaces-shared-project-4.0.21-SNAPSHOT-site.xml
to org.apache.myfaces.shared/myfaces-shared-project/4.0.21-SNAPSHOT/myfaces-shared-project-4.0.21-SNAPSHOT-site.xml
Sending artifact delta relative to myfaces-current-2.0 » Apache MyFaces Shared For JSF 2.0
- Project #2358
Archived 2 artifacts
Archive block size is 32768
Received 0 blocks and 10838 bytes
Compression is 0.0%
Took 90 ms
[JENKINS] Archiving F:\jenkins\jenkins-slave\workspace\myfaces-current-2.0\current20\core\parent\pom.xml
to org.apache.myfaces.core/myfaces-core-project/2.0.22-SNAPSHOT/myfaces-core-project-2.0.22-SNAPSHOT.pom
Sending artifact delta relative to myfaces-current-2.0 » Apache MyFaces JSF-2.0 Core Project
#2358
Archived 1 artifacts
Archive block size is 32768
Received 0 blocks and 24762 bytes
Compression is 0.0%
Took 71 ms
[JENKINS] Archiving F:\jenkins\jenkins-slave\workspace\myfaces-current-2.0\current20\core\pom.xml
to org.apache.myfaces.core/myfaces-core-module/2.0.22-SNAPSHOT/myfaces-core-module-2.0.22-SNAPSHOT.pom
Sending artifact delta relative to myfaces-current-2.0 » Apache MyFaces JSF-2.0 Core Module
#2358
Archived 1 artifacts
Archive block size is 32768
Received 0 blocks and 8744 bytes
Compression is 0.0%
Took 67 ms
[JENKINS] Archiving F:\jenkins\jenkins-slave\workspace\myfaces-current-2.0\current20\core\implee6\pom.xml
to org.apache.myfaces.core.internal/myfaces-impl-ee6/2.0.22-SNAPSHOT/myfaces-impl-ee6-2.0.22-SNAPSHOT.pom
Sending artifact delta relative to myfaces-current-2.0 » Apache MyFaces JSF-2.0 Core Impl
for Java EE 6 #2358
Archived 1 artifacts
Archive block size is 32768
Received 0 blocks and 3669 bytes
Compression is 0.0%
Took 0.18 sec
[JENKINS] Archiving <https://builds.apache.org/job/myfaces-current-2.0/ws/current20\pom.xml>
to org.apache.myfaces/myfaces-base/2.0.5-SNAPSHOT/myfaces-base-2.0.5-SNAPSHOT.pom
Sending artifact delta relative to myfaces-current-2.0 » Apache MyFaces Composite Build #2358
Archived 1 artifacts
Archive block size is 32768
Received 0 blocks and 2287 bytes
Compression is 0.0%
Took 0.16 sec
[JENKINS] Archiving F:\jenkins\jenkins-slave\workspace\myfaces-current-2.0\current20\core\shared\pom.xml
to org.apache.myfaces.core.internal/myfaces-impl-shared/2.0.22-SNAPSHOT/myfaces-impl-shared-2.0.22-SNAPSHOT.pom
Sending artifact delta relative to myfaces-current-2.0 » Apache MyFaces Shared For JSF 2.0
- Core #2358
Archived 1 artifacts
Archive block size is 32768
Received 0 blocks and 12215 bytes
Compression is 0.0%
Took 1.7 sec
channel stopped

Mime
View raw message