myfaces-commits mailing list archives

Site index · List index
Message view « Date » · « Thread »
Top « Date » · « Thread »
From Apache Jenkins Server <jenk...@builds.apache.org>
Subject Build failed in Jenkins: myfaces-current12 #1170
Date Sun, 08 Jun 2014 10:35:49 GMT
See <https://builds.apache.org/job/myfaces-current12/1170/>

------------------------------------------
[...truncated 1571 lines...]
Artifact: myfaces-api-1.2.13-SNAPSHOT.jar have META-INF/myfaces-metadata.xml
[INFO] 
[INFO] --- myfaces-builder-plugin:1.0.8:make-config (makefacesconfig) @ myfaces-impl ---
[WARNING] *******************************************************************
[WARNING] RuntimeInstance initializing.
[WARNING] Default ResourceManager initializing. (class org.apache.velocity.runtime.resource.ResourceManagerImpl)
[WARNING] FileResourceLoader : initialization starting.
[WARNING] FileResourceLoader : initialization complete.
[WARNING] RelativeClasspathResourceLoader : initialization complete.
[INFO] RelativeClasspathResourceLoader : adding path 'META-INF'
[WARNING] RelativeClasspathResourceLoader : initialization complete.
[WARNING] Default ResourceManager initialization complete.
[WARNING] Velocimacro : initialization starting.
[WARNING] Velocimacro : VM library registration complete.
[WARNING] Velocimacro : Velocimacro : initialization complete.
[WARNING] RuntimeInstance successfully initialized.
[INFO] using base content file: F:\jenkins\jenkins-slave\workspace\myfaces-current12\current12\core\impl\src\main\conf\META-INF\standard-faces-config-base.xml
[INFO] 
[INFO] --- myfaces-builder-plugin:1.0.8:make-tags (make_tags) @ myfaces-impl ---
[INFO] Using template from file loader: F:\jenkins\jenkins-slave\workspace\myfaces-current12\current12\core\impl\src\main\resources\META-INF\tagClass12.vm
[WARNING] *******************************************************************
[WARNING] RuntimeInstance initializing.
[WARNING] Default ResourceManager initializing. (class org.apache.velocity.runtime.resource.ResourceManagerImpl)
[WARNING] FileResourceLoader : initialization starting.
[WARNING] FileResourceLoader : initialization complete.
[WARNING] RelativeClasspathResourceLoader : initialization complete.
[INFO] RelativeClasspathResourceLoader : adding path 'META-INF'
[WARNING] RelativeClasspathResourceLoader : initialization complete.
[WARNING] Default ResourceManager initialization complete.
[WARNING] Velocimacro : initialization starting.
[WARNING] Velocimacro : VM library registration complete.
[WARNING] Velocimacro : Velocimacro : initialization complete.
[WARNING] RuntimeInstance successfully initialized.
[INFO] Generating tag class:org.apache.myfaces.taglib.html.HtmlInputHiddenTag
[INFO] Generating tag class:org.apache.myfaces.taglib.html.HtmlColumnTag
[INFO] Generating tag class:org.apache.myfaces.taglib.html.HtmlCommandButtonTag
[INFO] Generating tag class:org.apache.myfaces.taglib.html.HtmlCommandLinkTag
[INFO] Generating tag class:org.apache.myfaces.taglib.html.HtmlDataTableTag
[INFO] Generating tag class:org.apache.myfaces.taglib.html.HtmlFormTag
[INFO] Generating tag class:org.apache.myfaces.taglib.html.HtmlGraphicImageTag
[INFO] Generating tag class:org.apache.myfaces.taglib.html.HtmlInputSecretTag
[INFO] Generating tag class:org.apache.myfaces.taglib.html.HtmlInputTextTag
[INFO] Generating tag class:org.apache.myfaces.taglib.html.HtmlInputTextareaTag
[INFO] Generating tag class:org.apache.myfaces.taglib.html.HtmlMessageTag
[INFO] Generating tag class:org.apache.myfaces.taglib.html.HtmlMessagesTag
[INFO] Generating tag class:org.apache.myfaces.taglib.html.HtmlOutputFormatTag
[INFO] Generating tag class:org.apache.myfaces.taglib.html.HtmlOutputLabelTag
[INFO] Generating tag class:org.apache.myfaces.taglib.html.HtmlOutputLinkTag
[INFO] Generating tag class:org.apache.myfaces.taglib.html.HtmlOutputTextTag
[INFO] Generating tag class:org.apache.myfaces.taglib.html.HtmlPanelGridTag
[INFO] Generating tag class:org.apache.myfaces.taglib.html.HtmlPanelGroupTag
[INFO] Generating tag class:org.apache.myfaces.taglib.html.HtmlSelectBooleanCheckboxTag
[INFO] Generating tag class:org.apache.myfaces.taglib.html.HtmlSelectManyCheckboxTag
[INFO] Generating tag class:org.apache.myfaces.taglib.html.HtmlSelectManyListboxTag
[INFO] Generating tag class:org.apache.myfaces.taglib.html.HtmlSelectManyMenuTag
[INFO] Generating tag class:org.apache.myfaces.taglib.html.HtmlSelectOneListboxTag
[INFO] Generating tag class:org.apache.myfaces.taglib.html.HtmlSelectOneMenuTag
[INFO] Generating tag class:org.apache.myfaces.taglib.html.HtmlSelectOneRadioTag
[INFO] 
[INFO] --- myfaces-builder-plugin:1.0.8:make-config (makecoretld) @ myfaces-impl ---
[WARNING] *******************************************************************
[WARNING] RuntimeInstance initializing.
[WARNING] Default ResourceManager initializing. (class org.apache.velocity.runtime.resource.ResourceManagerImpl)
[WARNING] FileResourceLoader : initialization starting.
[WARNING] FileResourceLoader : initialization complete.
[WARNING] RelativeClasspathResourceLoader : initialization complete.
[INFO] RelativeClasspathResourceLoader : adding path 'META-INF'
[WARNING] RelativeClasspathResourceLoader : initialization complete.
[WARNING] Default ResourceManager initialization complete.
[WARNING] Velocimacro : initialization starting.
[WARNING] Velocimacro : VM library registration complete.
[WARNING] Velocimacro : Velocimacro : initialization complete.
[WARNING] RuntimeInstance successfully initialized.
[INFO] using base content file: F:\jenkins\jenkins-slave\workspace\myfaces-current12\current12\core\impl\src\main\conf\META-INF\myfaces_core-base.tld
[INFO] 
[INFO] --- myfaces-builder-plugin:1.0.8:make-config (makehtmltld) @ myfaces-impl ---
[WARNING] *******************************************************************
[WARNING] RuntimeInstance initializing.
[WARNING] Default ResourceManager initializing. (class org.apache.velocity.runtime.resource.ResourceManagerImpl)
[WARNING] FileResourceLoader : initialization starting.
[WARNING] FileResourceLoader : initialization complete.
[WARNING] RelativeClasspathResourceLoader : initialization complete.
[INFO] RelativeClasspathResourceLoader : adding path 'META-INF'
[WARNING] RelativeClasspathResourceLoader : initialization complete.
[WARNING] Default ResourceManager initialization complete.
[WARNING] Velocimacro : initialization starting.
[WARNING] Velocimacro : VM library registration complete.
[WARNING] Velocimacro : Velocimacro : initialization complete.
[WARNING] RuntimeInstance successfully initialized.
[INFO] using base content file: F:\jenkins\jenkins-slave\workspace\myfaces-current12\current12\core\impl\src\main\conf\META-INF\myfaces_html-base.tld
[WARNING] Failed to getClass for org.apache.maven.plugin.source.SourceJarMojo
[INFO] 
[INFO] <<< maven-source-plugin:2.0.4:jar (attach-source) @ myfaces-impl <<<
[INFO] 
[INFO] --- maven-source-plugin:2.0.4:jar (attach-source) @ myfaces-impl ---
[INFO] Building jar: F:\jenkins\jenkins-slave\workspace\myfaces-current12\current12\core\impl\target\myfaces-impl-1.2.13-SNAPSHOT-sources.jar
[INFO] 
[INFO] --- maven-checkstyle-plugin:2.6:check (verify-style) @ myfaces-impl ---
[INFO] 
[INFO] 
[INFO] --- maven-install-plugin:2.3.1:install (default-install) @ myfaces-impl ---
[INFO] Installing F:\jenkins\jenkins-slave\workspace\myfaces-current12\current12\core\impl\target\myfaces-impl-1.2.13-SNAPSHOT.jar
to f:\jenkins\jenkins-slave\maven-repositories\0\org\apache\myfaces\core\myfaces-impl\1.2.13-SNAPSHOT\myfaces-impl-1.2.13-SNAPSHOT.jar
[INFO] Installing F:\jenkins\jenkins-slave\workspace\myfaces-current12\current12\core\impl\pom.xml
to f:\jenkins\jenkins-slave\maven-repositories\0\org\apache\myfaces\core\myfaces-impl\1.2.13-SNAPSHOT\myfaces-impl-1.2.13-SNAPSHOT.pom
[INFO] Installing F:\jenkins\jenkins-slave\workspace\myfaces-current12\current12\core\impl\target\myfaces-impl-1.2.13-SNAPSHOT-sources.jar
to f:\jenkins\jenkins-slave\maven-repositories\0\org\apache\myfaces\core\myfaces-impl\1.2.13-SNAPSHOT\myfaces-impl-1.2.13-SNAPSHOT-sources.jar
[INFO]                                                                         
[INFO] ------------------------------------------------------------------------
[INFO] Building Build Project 1.2.10-SNAPSHOT
[INFO] ------------------------------------------------------------------------
[INFO] 
[INFO] --- maven-remote-resources-plugin:1.1:process (default) @ myfaces-base ---
[INFO] Setting property: classpath.resource.loader.class => 'org.codehaus.plexus.velocity.ContextClassLoaderResourceLoader'.
[INFO] Setting property: velocimacro.messages.on => 'false'.
[INFO] Setting property: resource.loader => 'classpath'.
[INFO] Setting property: resource.manager.logwhenfound => 'false'.
[INFO] 
[INFO] --- maven-install-plugin:2.3:install (default-install) @ myfaces-base ---
[INFO] Installing <https://builds.apache.org/job/myfaces-current12/ws/current12\pom.xml>
to f:\jenkins\jenkins-slave\maven-repositories\0\org\apache\myfaces\myfaces-base\1.2.10-SNAPSHOT\myfaces-base-1.2.10-SNAPSHOT.pom
[INFO] ------------------------------------------------------------------------
[INFO] Reactor Summary:
[INFO] 
[INFO] Apache MyFaces Shared For JSF 1.2 - Project ....... SUCCESS [18.667s]
[INFO] Apache MyFaces Shared For JSF 1.2 - Core .......... SUCCESS [28.725s]
[INFO] MyFaces Shared Impl ............................... SUCCESS [15.707s]
[INFO] MyFaces Shared Tomahawk ........................... SUCCESS [11.953s]
[INFO] Apache MyFaces JSF-1.2 Core Project ............... SUCCESS [5.146s]
[INFO] Apache Myfaces JSF Core-1.2 API ................... SUCCESS [44.834s]
[INFO] Apache MyFaces JSF-1.2 Core Impl .................. SUCCESS [48.687s]
[INFO] Build Project ..................................... SUCCESS [2.255s]
[INFO] ------------------------------------------------------------------------
[INFO] BUILD SUCCESS
[INFO] ------------------------------------------------------------------------
[INFO] Total time: 3:05.909s
[INFO] Finished at: Sun Jun 08 03:35:36 PDT 2014
[INFO] Final Memory: 57M/136M
[INFO] ------------------------------------------------------------------------
Waiting for Jenkins to finish collecting data
[JENKINS] Archiving F:\jenkins\jenkins-slave\workspace\myfaces-current12\current12\shared\shared-tomahawk\pom.xml
to org.apache.myfaces.shared/myfaces-shared-tomahawk/3.0.13-SNAPSHOT/myfaces-shared-tomahawk-3.0.13-SNAPSHOT.pom
[JENKINS] Archiving F:\jenkins\jenkins-slave\workspace\myfaces-current12\current12\shared\shared-tomahawk\target\myfaces-shared-tomahawk-3.0.13-SNAPSHOT.jar
to org.apache.myfaces.shared/myfaces-shared-tomahawk/3.0.13-SNAPSHOT/myfaces-shared-tomahawk-3.0.13-SNAPSHOT.jar
[JENKINS] Archiving F:\jenkins\jenkins-slave\workspace\myfaces-current12\current12\shared\shared-tomahawk\target\myfaces-shared-tomahawk-3.0.13-SNAPSHOT-sources.jar
to org.apache.myfaces.shared/myfaces-shared-tomahawk/3.0.13-SNAPSHOT/myfaces-shared-tomahawk-3.0.13-SNAPSHOT-sources.jar
Sending artifact delta relative to myfaces-current12 » MyFaces Shared Tomahawk #1169
Archived 3 artifacts
Archive block size is 32768
Received 0 blocks and 564372 bytes
Compression is 0.0%
Took 0.37 sec
[JENKINS] Archiving F:\jenkins\jenkins-slave\workspace\myfaces-current12\current12\core\impl\pom.xml
to org.apache.myfaces.core/myfaces-impl/1.2.13-SNAPSHOT/myfaces-impl-1.2.13-SNAPSHOT.pom
[JENKINS] Archiving F:\jenkins\jenkins-slave\workspace\myfaces-current12\current12\core\impl\target\myfaces-impl-1.2.13-SNAPSHOT.jar
to org.apache.myfaces.core/myfaces-impl/1.2.13-SNAPSHOT/myfaces-impl-1.2.13-SNAPSHOT.jar
[JENKINS] Archiving F:\jenkins\jenkins-slave\workspace\myfaces-current12\current12\core\impl\target\myfaces-impl-1.2.13-SNAPSHOT-sources.jar
to org.apache.myfaces.core/myfaces-impl/1.2.13-SNAPSHOT/myfaces-impl-1.2.13-SNAPSHOT-sources.jar
Sending artifact delta relative to myfaces-current12 » Apache MyFaces JSF-1.2 Core Impl #1169
Archived 3 artifacts
Archive block size is 32768
Received 33 blocks and 530467 bytes
Compression is 67.1%
Took 2 sec
[JENKINS] Archiving F:\jenkins\jenkins-slave\workspace\myfaces-current12\current12\shared\shared-impl\pom.xml
to org.apache.myfaces.shared/myfaces-shared-impl/3.0.13-SNAPSHOT/myfaces-shared-impl-3.0.13-SNAPSHOT.pom
[JENKINS] Archiving F:\jenkins\jenkins-slave\workspace\myfaces-current12\current12\shared\shared-impl\target\myfaces-shared-impl-3.0.13-SNAPSHOT.jar
to org.apache.myfaces.shared/myfaces-shared-impl/3.0.13-SNAPSHOT/myfaces-shared-impl-3.0.13-SNAPSHOT.jar
[JENKINS] Archiving F:\jenkins\jenkins-slave\workspace\myfaces-current12\current12\shared\shared-impl\target\myfaces-shared-impl-3.0.13-SNAPSHOT-sources.jar
to org.apache.myfaces.shared/myfaces-shared-impl/3.0.13-SNAPSHOT/myfaces-shared-impl-3.0.13-SNAPSHOT-sources.jar
Sending artifact delta relative to myfaces-current12 » MyFaces Shared Impl #1169
Archived 3 artifacts
Archive block size is 32768
Received 0 blocks and 560561 bytes
Compression is 0.0%
Took 0.38 sec
[JENKINS] Archiving F:\jenkins\jenkins-slave\workspace\myfaces-current12\current12\shared\core\pom.xml
to org.apache.myfaces.shared/myfaces-shared-core/3.0.13-SNAPSHOT/myfaces-shared-core-3.0.13-SNAPSHOT.pom
[JENKINS] Archiving F:\jenkins\jenkins-slave\workspace\myfaces-current12\current12\shared\core\target\myfaces-shared-core-3.0.13-SNAPSHOT.jar
to org.apache.myfaces.shared/myfaces-shared-core/3.0.13-SNAPSHOT/myfaces-shared-core-3.0.13-SNAPSHOT.jar
[JENKINS] Archiving F:\jenkins\jenkins-slave\workspace\myfaces-current12\current12\shared\core\target\myfaces-shared-core-3.0.13-SNAPSHOT-sources.jar
to org.apache.myfaces.shared/myfaces-shared-core/3.0.13-SNAPSHOT/myfaces-shared-core-3.0.13-SNAPSHOT-sources.jar
Sending artifact delta relative to myfaces-current12 » Apache MyFaces Shared For JSF 1.2
- Core #1169
Archived 3 artifacts
Archive block size is 32768
Received 14 blocks and 104977 bytes
Compression is 81.4%
Took 0.21 sec
[JENKINS] Archiving F:\jenkins\jenkins-slave\workspace\myfaces-current12\current12\core\api\pom.xml
to org.apache.myfaces.core/myfaces-api/1.2.13-SNAPSHOT/myfaces-api-1.2.13-SNAPSHOT.pom
[JENKINS] Archiving F:\jenkins\jenkins-slave\workspace\myfaces-current12\current12\core\api\target\myfaces-api-1.2.13-SNAPSHOT.jar
to org.apache.myfaces.core/myfaces-api/1.2.13-SNAPSHOT/myfaces-api-1.2.13-SNAPSHOT.jar
[JENKINS] Archiving F:\jenkins\jenkins-slave\workspace\myfaces-current12\current12\core\api\target\myfaces-api-1.2.13-SNAPSHOT-sources.jar
to org.apache.myfaces.core/myfaces-api/1.2.13-SNAPSHOT/myfaces-api-1.2.13-SNAPSHOT-sources.jar
[JENKINS] Archiving F:\jenkins\jenkins-slave\workspace\myfaces-current12\current12\core\api\target\myfaces-api-1.2.13-SNAPSHOT-tests.jar
to org.apache.myfaces.core/myfaces-api/1.2.13-SNAPSHOT/myfaces-api-1.2.13-SNAPSHOT-tests.jar
Sending artifact delta relative to myfaces-current12 » Apache Myfaces JSF Core-1.2 API #1169
Archived 4 artifacts
Archive block size is 32768
Received 15 blocks and 525397 bytes
Compression is 48.3%
Took 0.34 sec
[JENKINS] Archiving F:\jenkins\jenkins-slave\workspace\myfaces-current12\current12\shared\pom.xml
to org.apache.myfaces.shared/myfaces-shared-project/3.0.13-SNAPSHOT/myfaces-shared-project-3.0.13-SNAPSHOT.pom
[JENKINS] Archiving F:\jenkins\jenkins-slave\workspace\myfaces-current12\current12\shared\target\myfaces-shared-project-3.0.13-SNAPSHOT-site.xml
to org.apache.myfaces.shared/myfaces-shared-project/3.0.13-SNAPSHOT/myfaces-shared-project-3.0.13-SNAPSHOT-site.xml
Sending artifact delta relative to myfaces-current12 » Apache MyFaces Shared For JSF 1.2
- Project #1169
Archived 2 artifacts
Archive block size is 32768
Received 0 blocks and 10524 bytes
Compression is 0.0%
Took 1.6 sec
[JENKINS] Archiving F:\jenkins\jenkins-slave\workspace\myfaces-current12\current12\core\pom.xml
to org.apache.myfaces.core/myfaces-core-project/1.2.13-SNAPSHOT/myfaces-core-project-1.2.13-SNAPSHOT.pom
[JENKINS] Archiving F:\jenkins\jenkins-slave\workspace\myfaces-current12\current12\core\target\myfaces-core-project-1.2.13-SNAPSHOT-site.xml
to org.apache.myfaces.core/myfaces-core-project/1.2.13-SNAPSHOT/myfaces-core-project-1.2.13-SNAPSHOT-site.xml
Sending artifact delta relative to myfaces-current12 » Apache MyFaces JSF-1.2 Core Project
#1169
Archived 2 artifacts
Archive block size is 32768
Received 0 blocks and 24305 bytes
Compression is 0.0%
Took 53 ms
[JENKINS] Archiving <https://builds.apache.org/job/myfaces-current12/ws/current12\pom.xml>
to org.apache.myfaces/myfaces-base/1.2.10-SNAPSHOT/myfaces-base-1.2.10-SNAPSHOT.pom
Sending artifact delta relative to myfaces-current12 » Build Project #1169
Archived 1 artifacts
Archive block size is 32768
Received 0 blocks and 1228 bytes
Compression is 0.0%
Took 26 ms
channel stopped
Maven RedeployPublisher use remote windows2 maven settings from : f:\jenkins\tools\maven\latest/conf/settings.xml
[ERROR] uniqueVersion == false is not anymore supported in maven 3
[INFO] Deployment in https://repository.apache.org/content/repositories/snapshots (id=apache.snapshots.https,uniqueVersion=false)
Deploying the main artifact myfaces-base-1.2.10-SNAPSHOT.pom
Downloading: https://repository.apache.org/content/repositories/snapshots/org/apache/myfaces/myfaces-base/1.2.10-SNAPSHOT/maven-metadata.xml
Downloaded: https://repository.apache.org/content/repositories/snapshots/org/apache/myfaces/myfaces-base/1.2.10-SNAPSHOT/maven-metadata.xml
(568 B at 0.2 KB/sec)
Uploading: https://repository.apache.org/content/repositories/snapshots/org/apache/myfaces/myfaces-base/1.2.10-SNAPSHOT/myfaces-base-1.2.10-20140608.103546-557.pom
ERROR: Failed to deploy artifacts: Could not transfer artifact org.apache.myfaces:myfaces-base:pom:1.2.10-20140608.103546-557
from/to apache.snapshots.https (https://repository.apache.org/content/repositories/snapshots):
Failed to transfer file: https://repository.apache.org/content/repositories/snapshots/org/apache/myfaces/myfaces-base/1.2.10-SNAPSHOT/myfaces-base-1.2.10-20140608.103546-557.pom.
Return code is: 401, ReasonPhrase: Unauthorized.
org.apache.maven.artifact.deployer.ArtifactDeploymentException: Failed to deploy artifacts:
Could not transfer artifact org.apache.myfaces:myfaces-base:pom:1.2.10-20140608.103546-557
from/to apache.snapshots.https (https://repository.apache.org/content/repositories/snapshots):
Failed to transfer file: https://repository.apache.org/content/repositories/snapshots/org/apache/myfaces/myfaces-base/1.2.10-SNAPSHOT/myfaces-base-1.2.10-20140608.103546-557.pom.
Return code is: 401, ReasonPhrase: Unauthorized.
	at org.apache.maven.artifact.deployer.DefaultArtifactDeployer.deploy(DefaultArtifactDeployer.java:143)
	at hudson.maven.reporters.MavenArtifactRecord.deploy(MavenArtifactRecord.java:193)
	at hudson.maven.RedeployPublisher.perform(RedeployPublisher.java:176)
	at hudson.tasks.BuildStepMonitor$1.perform(BuildStepMonitor.java:20)
	at hudson.model.AbstractBuild$AbstractBuildExecution.perform(AbstractBuild.java:804)
	at hudson.model.AbstractBuild$AbstractBuildExecution.performAllBuildSteps(AbstractBuild.java:776)
	at hudson.maven.MavenModuleSetBuild$MavenModuleSetBuildExecution.post2(MavenModuleSetBuild.java:1040)
	at hudson.model.AbstractBuild$AbstractBuildExecution.post(AbstractBuild.java:725)
	at hudson.model.Run.execute(Run.java:1701)
	at hudson.maven.MavenModuleSetBuild.run(MavenModuleSetBuild.java:529)
	at hudson.model.ResourceController.execute(ResourceController.java:88)
	at hudson.model.Executor.run(Executor.java:231)
Caused by: org.eclipse.aether.deployment.DeploymentException: Failed to deploy artifacts:
Could not transfer artifact org.apache.myfaces:myfaces-base:pom:1.2.10-20140608.103546-557
from/to apache.snapshots.https (https://repository.apache.org/content/repositories/snapshots):
Failed to transfer file: https://repository.apache.org/content/repositories/snapshots/org/apache/myfaces/myfaces-base/1.2.10-SNAPSHOT/myfaces-base-1.2.10-20140608.103546-557.pom.
Return code is: 401, ReasonPhrase: Unauthorized.
	at org.eclipse.aether.internal.impl.DefaultDeployer.deploy(DefaultDeployer.java:341)
	at org.eclipse.aether.internal.impl.DefaultDeployer.deploy(DefaultDeployer.java:269)
	at org.eclipse.aether.internal.impl.DefaultRepositorySystem.deploy(DefaultRepositorySystem.java:413)
	at org.apache.maven.artifact.deployer.DefaultArtifactDeployer.deploy(DefaultArtifactDeployer.java:139)
	... 11 more
Caused by: org.eclipse.aether.transfer.ArtifactTransferException: Could not transfer artifact
org.apache.myfaces:myfaces-base:pom:1.2.10-20140608.103546-557 from/to apache.snapshots.https
(https://repository.apache.org/content/repositories/snapshots): Failed to transfer file: https://repository.apache.org/content/repositories/snapshots/org/apache/myfaces/myfaces-base/1.2.10-SNAPSHOT/myfaces-base-1.2.10-20140608.103546-557.pom.
Return code is: 401, ReasonPhrase: Unauthorized.
	at org.eclipse.aether.connector.wagon.WagonRepositoryConnector$6.wrap(WagonRepositoryConnector.java:1016)
	at org.eclipse.aether.connector.wagon.WagonRepositoryConnector$6.wrap(WagonRepositoryConnector.java:1004)
	at org.eclipse.aether.connector.wagon.WagonRepositoryConnector$PutTask.run(WagonRepositoryConnector.java:895)
	at org.eclipse.aether.connector.wagon.WagonRepositoryConnector.put(WagonRepositoryConnector.java:522)
	at org.eclipse.aether.internal.impl.DefaultDeployer.deploy(DefaultDeployer.java:335)
	... 14 more
Caused by: org.apache.maven.wagon.TransferFailedException: Failed to transfer file: https://repository.apache.org/content/repositories/snapshots/org/apache/myfaces/myfaces-base/1.2.10-SNAPSHOT/myfaces-base-1.2.10-20140608.103546-557.pom.
Return code is: 401, ReasonPhrase: Unauthorized.
	at org.apache.maven.wagon.shared.http4.AbstractHttpClientWagon.put(AbstractHttpClientWagon.java:626)
	at org.apache.maven.wagon.shared.http4.AbstractHttpClientWagon.put(AbstractHttpClientWagon.java:524)
	at org.apache.maven.wagon.shared.http4.AbstractHttpClientWagon.put(AbstractHttpClientWagon.java:505)
	at org.apache.maven.wagon.shared.http4.AbstractHttpClientWagon.put(AbstractHttpClientWagon.java:485)
	at org.eclipse.aether.connector.wagon.WagonRepositoryConnector$PutTask.run(WagonRepositoryConnector.java:871)
	... 16 more
[INFO] Deployment failed after 2.9 sec
Build step 'Deploy artifacts to Maven repository' changed build result to FAILURE

Mime
View raw message