myfaces-commits mailing list archives

Site index · List index
Message view « Date » · « Thread »
Top « Date » · « Thread »
From Apache Jenkins Server <jenk...@builds.apache.org>
Subject Build failed in Jenkins: myfaces-current-2.0-integration-tests #1679
Date Sun, 01 Jun 2014 09:24:58 GMT
See <https://builds.apache.org/job/myfaces-current-2.0-integration-tests/1679/>

------------------------------------------
Started by upstream project "myfaces-current-2.0" build number 2352
originally caused by:
 Started by upstream project "maven-plugins" build number 1920
 originally caused by:
  Started by an SCM change
Building remotely on windows2 (Windows) in workspace <https://builds.apache.org/job/myfaces-current-2.0-integration-tests/ws/>
Checking out a fresh workspace because there's no workspace at F:\jenkins\jenkins-slave\workspace\myfaces-current-2.0-integration-tests
Cleaning local Directory .
Checking out https://svn.apache.org/repos/asf/myfaces/core/branches/2.0.x/integration-tests
at revision '2014-06-01T02:24:53.098 -0700'
A         servlet30-el22-basic-tests
A         servlet30-el22-basic-tests\src
A         servlet30-el22-basic-tests\src\main
A         servlet30-el22-basic-tests\src\main\resources
A         servlet30-el22-basic-tests\src\main\webapp
A         servlet30-el22-basic-tests\src\main\webapp\WEB-INF
AU        servlet30-el22-basic-tests\src\main\webapp\WEB-INF\web.xml
A         servlet30-el22-basic-tests\src\main\webapp\pages
A         servlet30-el22-basic-tests\src\main\webapp\pages\formInput
A         servlet30-el22-basic-tests\src\main\webapp\pages\formInput\result.xhtml
A         servlet30-el22-basic-tests\src\main\webapp\pages\formInput\index.xhtml
A         servlet30-el22-basic-tests\src\main\java
A         servlet30-el22-basic-tests\src\main\java\org
A         servlet30-el22-basic-tests\src\main\java\org\apache
A         servlet30-el22-basic-tests\src\main\java\org\apache\myfaces
A         servlet30-el22-basic-tests\src\main\java\org\apache\myfaces\integrationtest
AU        servlet30-el22-basic-tests\src\main\java\org\apache\myfaces\integrationtest\FormInputBean.java
A         servlet30-el22-basic-tests\src\test
A         servlet30-el22-basic-tests\src\test\java
A         servlet30-el22-basic-tests\src\test\java\org
A         servlet30-el22-basic-tests\src\test\java\org\apache
A         servlet30-el22-basic-tests\src\test\java\org\apache\myfaces
A         servlet30-el22-basic-tests\src\test\java\org\apache\myfaces\integrationtest
AU        servlet30-el22-basic-tests\src\test\java\org\apache\myfaces\integrationtest\FormInputTest.java
AU        servlet30-el22-basic-tests\pom.xml
A         servlet25-el10-basic-tests
A         servlet25-el10-basic-tests\src
A         servlet25-el10-basic-tests\src\test
A         servlet25-el10-basic-tests\src\test\java
A         servlet25-el10-basic-tests\src\test\java\org
A         servlet25-el10-basic-tests\src\test\java\org\apache
A         servlet25-el10-basic-tests\src\test\java\org\apache\myfaces
A         servlet25-el10-basic-tests\src\test\java\org\apache\myfaces\integrationtest
AU        servlet25-el10-basic-tests\src\test\java\org\apache\myfaces\integrationtest\FormInputTest.java
A         servlet25-el10-basic-tests\src\main
A         servlet25-el10-basic-tests\src\main\resources
A         servlet25-el10-basic-tests\src\main\webapp
A         servlet25-el10-basic-tests\src\main\webapp\pages
A         servlet25-el10-basic-tests\src\main\webapp\pages\formInput
A         servlet25-el10-basic-tests\src\main\webapp\pages\formInput\index.xhtml
A         servlet25-el10-basic-tests\src\main\webapp\pages\formInput\result.xhtml
A         servlet25-el10-basic-tests\src\main\webapp\WEB-INF
AU        servlet25-el10-basic-tests\src\main\webapp\WEB-INF\web.xml
A         servlet25-el10-basic-tests\src\main\java
A         servlet25-el10-basic-tests\src\main\java\org
A         servlet25-el10-basic-tests\src\main\java\org\apache
A         servlet25-el10-basic-tests\src\main\java\org\apache\myfaces
A         servlet25-el10-basic-tests\src\main\java\org\apache\myfaces\integrationtest
AU        servlet25-el10-basic-tests\src\main\java\org\apache\myfaces\integrationtest\FormInputBean.java
AU        servlet25-el10-basic-tests\pom.xml
A         integration-test-support
A         integration-test-support\src
A         integration-test-support\src\main
A         integration-test-support\src\main\java
A         integration-test-support\src\main\java\org
A         integration-test-support\src\main\java\org\apache
A         integration-test-support\src\main\java\org\apache\myfaces
A         integration-test-support\src\main\java\org\apache\myfaces\integrationtest
A         integration-test-support\src\main\java\org\apache\myfaces\integrationtest\support
AU        integration-test-support\src\main\java\org\apache\myfaces\integrationtest\support\MyFacesIntegrationTest.java
AU        integration-test-support\pom.xml
AU        pom.xml
A         servlet25-el22-basic-tests
A         servlet25-el22-basic-tests\src
A         servlet25-el22-basic-tests\src\teno change for https://svn.apache.org/repos/asf/myfaces/core/branches/2.0.x/integration-tests
since the previous build
st
A         servlet25-el22-basic-tests\src\test\java
A         servlet25-el22-basic-tests\src\test\java\org
A         servlet25-el22-basic-tests\src\test\java\org\apache
A         servlet25-el22-basic-tests\src\test\java\org\apache\myfaces
A         servlet25-el22-basic-tests\src\test\java\org\apache\myfaces\integrationtest
AU        servlet25-el22-basic-tests\src\test\java\org\apache\myfaces\integrationtest\FormInputTest.java
A         servlet25-el22-basic-tests\src\main
A         servlet25-el22-basic-tests\src\main\java
A         servlet25-el22-basic-tests\src\main\java\org
A         servlet25-el22-basic-tests\src\main\java\org\apache
A         servlet25-el22-basic-tests\src\main\java\org\apache\myfaces
A         servlet25-el22-basic-tests\src\main\java\org\apache\myfaces\integrationtest
AU        servlet25-el22-basic-tests\src\main\java\org\apache\myfaces\integrationtest\FormInputBean.java
A         servlet25-el22-basic-tests\src\main\resources
A         servlet25-el22-basic-tests\src\main\Parsing POMs
webapp
A         servlet25-el22-basic-tests\src\main\webapp\pages
A         servlet25-el22-basic-tests\src\main\webapp\pages\formInput
A         servlet25-el22-basic-tests\src\main\webapp\pages\formInput\index.xhtml
A         servlet25-el22-basic-tests\src\main\webapp\pages\formInput\result.xhtml
A         servlet25-el22-basic-tests\src\main\webapp\WEB-INF
AU        servlet25-el22-basic-tests\src\main\webapp\WEB-INF\web.xml
AU        servlet25-el22-basic-tests\pom.xml
 U        .
At revision 1598957
ERROR: Failed to parse POMs
java.io.IOException: remote file operation failed: <https://builds.apache.org/job/myfaces-current-2.0-integration-tests/ws/>
at hudson.remoting.Channel@c88aa1d:windows2
	at hudson.FilePath.act(FilePath.java:910)
	at hudson.FilePath.act(FilePath.java:887)
	at hudson.maven.MavenModuleSetBuild$MavenModuleSetBuildExecution.parsePoms(MavenModuleSetBuild.java:943)
	at hudson.maven.MavenModuleSetBuild$MavenModuleSetBuildExecution.doRun(MavenModuleSetBuild.java:671)
	at hudson.model.AbstractBuild$AbstractBuildExecution.run(AbstractBuild.java:585)
	at hudson.model.Run.execute(Run.java:1676)
	at hudson.maven.MavenModuleSetBuild.run(MavenModuleSetBuild.java:519)
	at hudson.model.ResourceController.execute(ResourceController.java:88)
	at hudson.model.Executor.run(Executor.java:231)
Caused by: hudson.remoting.ProxyException: hudson.maven.MavenModuleSetBuild$MavenExecutionException:
org.apache.maven.project.ProjectBuildingException: Some problems were encountered while processing
the POMs:
[FATAL] Non-resolvable parent POM: Could not find artifact org.apache.myfaces.core:myfaces-core-project:pom:2.0.15-SNAPSHOT
and 'parent.relativePath' points at wrong local POM @ line 20, column 13

	at hudson.maven.MavenModuleSetBuild$PomParser.invoke(MavenModuleSetBuild.java:1347)
	at hudson.maven.MavenModuleSetBuild$PomParser.invoke(MavenModuleSetBuild.java:1081)
	at hudson.FilePath$FileCallableWrapper.call(FilePath.java:2462)
	at hudson.remoting.UserRequest.perform(UserRequest.java:118)
	at hudson.remoting.UserRequest.perform(UserRequest.java:48)
	at hudson.remoting.Request$2.run(Request.java:328)
	at hudson.remoting.InterceptingExecutorService$1.call(InterceptingExecutorService.java:72)
	at java.util.concurrent.FutureTask.run(Unknown Source)
	at java.util.concurrent.ThreadPoolExecutor.runWorker(Unknown Source)
	at java.util.concurrent.ThreadPoolExecutor$Worker.run(Unknown Source)
	at hudson.remoting.Engine$1$1.run(Engine.java:63)
	at java.lang.Thread.run(Unknown Source)
Caused by: hudson.remoting.ProxyException: org.apache.maven.project.ProjectBuildingException:
Some problems were encountered while processing the POMs:
[FATAL] Non-resolvable parent POM: Could not find artifact org.apache.myfaces.core:myfaces-core-project:pom:2.0.15-SNAPSHOT
and 'parent.relativePath' points at wrong local POM @ line 20, column 13

	at org.apache.maven.project.DefaultProjectBuilder.build(DefaultProjectBuilder.java:364)
	at hudson.maven.MavenEmbedder.buildProjects(MavenEmbedder.java:361)
	at hudson.maven.MavenEmbedder.readProjects(MavenEmbedder.java:331)
	at hudson.maven.MavenModuleSetBuild$PomParser.invoke(MavenModuleSetBuild.java:1284)
	... 11 more

Mime
View raw message