myfaces-commits mailing list archives

Site index · List index
Message view « Date » · « Thread »
Top « Date » · « Thread »
From Apache Jenkins Server <jenk...@builds.apache.org>
Subject Build failed in Jenkins: myfaces-current12 » Apache Myfaces JSF Core-1.2 API #1172
Date Sun, 08 Jun 2014 12:53:10 GMT
See <https://builds.apache.org/job/myfaces-current12/org.apache.myfaces.core$myfaces-api/1172/>

------------------------------------------
[INFO] ------------------------------------------------------------------------
[INFO] Building Apache Myfaces JSF Core-1.2 API
[INFO]    task-segment: [install]
[INFO] ------------------------------------------------------------------------
Downloading: http://repo1.maven.org/maven2/org/apache/myfaces/buildtools/myfaces-builder-plugin/1.0.8/myfaces-builder-plugin-1.0.8.pom
6K downloaded  (myfaces-builder-plugin-1.0.8.pom)
Downloading: http://repo1.maven.org/maven2/org/apache/myfaces/buildtools/myfaces-plugin-parent/1.0.4/myfaces-plugin-parent-1.0.4.pom
5K downloaded  (myfaces-plugin-parent-1.0.4.pom)
Downloading: http://repo1.maven.org/maven2/org/apache/myfaces/buildtools/myfaces-builder-plugin/1.0.8/myfaces-builder-plugin-1.0.8.jar
230K downloaded  (myfaces-builder-plugin-1.0.8.jar)
Downloading: http://download.java.net/maven/2/org/apache/myfaces/buildtools/myfaces-builder-annotations/1.0.7/myfaces-builder-annotations-1.0.7.pom
[INFO] Unable to find resource 'org.apache.myfaces.buildtools:myfaces-builder-annotations:pom:1.0.7'
in repository java.net (http://download.java.net/maven/2)
Downloading: http://tomcat.apache.org/dev/dist/m2-repository/org/apache/myfaces/buildtools/myfaces-builder-annotations/1.0.7/myfaces-builder-annotations-1.0.7.pom
[INFO] Unable to find resource 'org.apache.myfaces.buildtools:myfaces-builder-annotations:pom:1.0.7'
in repository tomcat (http://tomcat.apache.org/dev/dist/m2-repository)
Downloading: http://repo1.maven.org/maven2/org/apache/myfaces/buildtools/myfaces-builder-annotations/1.0.7/myfaces-builder-annotations-1.0.7.pom
2K downloaded  (myfaces-builder-annotations-1.0.7.pom)
[WARNING] POM for 'org.testng:testng:pom:5.1:test' is invalid.

Its dependencies (if any) will NOT be available to the current build.
[WARNING] POM for 'org.easymock:easymock:pom:2.3:test' is invalid.

Its dependencies (if any) will NOT be available to the current build.
[WARNING] POM for 'org.easymock:easymockclassextension:pom:2.3:test' is invalid.

Its dependencies (if any) will NOT be available to the current build.
Downloading: http://download.java.net/maven/2/org/apache/myfaces/buildtools/myfaces-builder-annotations/1.0.7/myfaces-builder-annotations-1.0.7.jar
[INFO] Unable to find resource 'org.apache.myfaces.buildtools:myfaces-builder-annotations:jar:1.0.7'
in repository java.net (http://download.java.net/maven/2)
Downloading: http://tomcat.apache.org/dev/dist/m2-repository/org/apache/myfaces/buildtools/myfaces-builder-annotations/1.0.7/myfaces-builder-annotations-1.0.7.jar
[INFO] Unable to find resource 'org.apache.myfaces.buildtools:myfaces-builder-annotations:jar:1.0.7'
in repository tomcat (http://tomcat.apache.org/dev/dist/m2-repository)
Downloading: http://repo1.maven.org/maven2/org/apache/myfaces/buildtools/myfaces-builder-annotations/1.0.7/myfaces-builder-annotations-1.0.7.jar
20K downloaded  (myfaces-builder-annotations-1.0.7.jar)
[INFO] [myfaces-builder:build-metadata {execution: default}]
log4j:WARN No appenders could be found for logger (org.apache.myfaces.buildtools.maven2.plugin.builder.qdox.QdoxModelBuilder).
log4j:WARN Please initialize the log4j system properly.
[INFO] [myfaces-builder:make-components {execution: makecomp}]
[INFO] Using template from file loader: <https://builds.apache.org/job/myfaces-current12/org.apache.myfaces.core$myfaces-api/ws/src/main/resources/META-INF/componentClass12.vm>
[WARNING] *******************************************************************
[WARNING] RuntimeInstance initializing.
[WARNING] Default ResourceManager initializing. (class org.apache.velocity.runtime.resource.ResourceManagerImpl)
[WARNING] FileResourceLoader : initialization starting.
[WARNING] FileResourceLoader : initialization complete.
[WARNING] RelativeClasspathResourceLoader : initialization complete.
[INFO] RelativeClasspathResourceLoader : adding path 'META-INF'
[WARNING] RelativeClasspathResourceLoader : initialization complete.
[WARNING] Default ResourceManager initialization complete.
[WARNING] Velocimacro : initialization starting.
[WARNING] Velocimacro : VM library registration complete.
[WARNING] Velocimacro : Velocimacro : initialization complete.
[WARNING] RuntimeInstance successfully initialized.
[INFO] Generating component class:javax.faces.component.UIMessage
[INFO] Generating component class:javax.faces.component.UIMessages
[INFO] Generating component class:javax.faces.component.UIParameter
[INFO] Generating component class:javax.faces.component.UISelectItem
[INFO] Generating component class:javax.faces.component.UISelectItems
[INFO] Generating component class:javax.faces.component.html.HtmlColumn
[INFO] Generating component class:javax.faces.component.html.HtmlCommandButton
[INFO] Generating component class:javax.faces.component.html.HtmlCommandLink
[INFO] Generating component class:javax.faces.component.html.HtmlDataTable
[INFO] Generating component class:javax.faces.component.html.HtmlForm
[INFO] Generating component class:javax.faces.component.html.HtmlGraphicImage
[INFO] Generating component class:javax.faces.component.html.HtmlInputSecret
[INFO] Generating component class:javax.faces.component.html.HtmlInputText
[INFO] Generating component class:javax.faces.component.html.HtmlInputTextarea
[INFO] Generating component class:javax.faces.component.html.HtmlMessage
[INFO] Generating component class:javax.faces.component.html.HtmlMessages
[INFO] Generating component class:javax.faces.component.html.HtmlOutputFormat
[INFO] Generating component class:javax.faces.component.html.HtmlOutputLabel
[INFO] Generating component class:javax.faces.component.html.HtmlOutputLink
[INFO] Generating component class:javax.faces.component.html.HtmlOutputText
[INFO] Generating component class:javax.faces.component.html.HtmlPanelGrid
[INFO] Generating component class:javax.faces.component.html.HtmlPanelGroup
[INFO] Generating component class:javax.faces.component.html.HtmlSelectBooleanCheckbox
[INFO] Generating component class:javax.faces.component.html.HtmlSelectManyCheckbox
[INFO] Generating component class:javax.faces.component.html.HtmlSelectManyListbox
[INFO] Generating component class:javax.faces.component.html.HtmlSelectManyMenu
[INFO] Generating component class:javax.faces.component.html.HtmlSelectOneListbox
[INFO] Generating component class:javax.faces.component.html.HtmlSelectOneMenu
[INFO] Generating component class:javax.faces.component.html.HtmlSelectOneRadio
[INFO] [remote-resources:process {execution: default}]
[WARNING] POM for 'org.testng:testng:pom:5.1:test' is invalid.

Its dependencies (if any) will NOT be available to the current build.
[WARNING] POM for 'org.easymock:easymock:pom:2.3:test' is invalid.

Its dependencies (if any) will NOT be available to the current build.
[WARNING] POM for 'org.easymock:easymockclassextension:pom:2.3:test' is invalid.

Its dependencies (if any) will NOT be available to the current build.
[debug] execute contextualize
[INFO] [resources:resources {execution: default-resources}]
[INFO] Using 'UTF-8' encoding to copy filtered resources.
[INFO] Copying 20 resources
[INFO] Copying 1 resource
[INFO] Copying 3 resources
[INFO] [compiler:compile {execution: default-compile}]
[INFO] Compiling 213 source files to <https://builds.apache.org/job/myfaces-current12/org.apache.myfaces.core$myfaces-api/ws/target/classes>
[INFO] [bundle:manifest {execution: bundle-manifest}]
[debug] execute contextualize
[INFO] [resources:testResources {execution: default-testResources}]
[INFO] Using 'UTF-8' encoding to copy filtered resources.
[INFO] Copying 0 resource
[INFO] Copying 3 resources
[INFO] [compiler:testCompile {execution: default-testCompile}]
[INFO] Compiling 47 source files to <https://builds.apache.org/job/myfaces-current12/org.apache.myfaces.core$myfaces-api/ws/target/test-classes>
[INFO] ------------------------------------------------------------------------
[ERROR] BUILD FAILURE
[INFO] ------------------------------------------------------------------------
[INFO] Compilation failure

error: error reading /home/jenkins/jenkins-slave/maven-repositories/0/org/testng/testng/5.1/testng-5.1-jdk15.jar;
error in opening zip file
error: error reading /home/jenkins/jenkins-slave/maven-repositories/0/org/easymock/easymock/2.3/easymock-2.3.jar;
error in opening zip file
error: error reading /home/jenkins/jenkins-slave/maven-repositories/0/org/easymock/easymockclassextension/2.3/easymockclassextension-2.3.jar;
error in opening zip file

[INFO] ------------------------------------------------------------------------
[INFO] For more information, run Maven with the -e switch
[INFO] ------------------------------------------------------------------------
[INFO] Total time: 30 seconds
[INFO] Finished at: Sun Jun 08 12:53:05 UTC 2014
[INFO] Final Memory: 63M/399M
[INFO] ------------------------------------------------------------------------

Mime
View raw message