myfaces-commits mailing list archives

Site index · List index
Message view « Date » · « Thread »
Top « Date » · « Thread »
From Apache Jenkins Server <jenk...@builds.apache.org>
Subject Build failed in Jenkins: myfaces-current12 #1172
Date Sun, 08 Jun 2014 12:53:15 GMT
See <https://builds.apache.org/job/myfaces-current12/1172/>

------------------------------------------
[...truncated 1223 lines...]
AU        shared/core/src/main/java/org/apache/myfaces/shared/renderkit/html/HtmlGroupRendererBase.java
AU        shared/core/src/main/java/org/apache/myfaces/shared/renderkit/html/HTML.java
AU        shared/core/src/main/java/org/apache/myfaces/shared/renderkit/html/HtmlLinkRendererBase.java
AU        shared/core/src/main/java/org/apache/myfaces/shared/renderkit/html/HtmlRadioRendererBase.java
AU        shared/core/src/main/java/org/apache/myfaces/shared/renderkit/html/HtmlFormRendererBase.java
AU        shared/core/src/main/java/org/apache/myfaces/shared/renderkit/html/HtmlMenuRendererBase.java
AU        shared/core/src/main/java/org/apache/myfaces/shared/renderkit/html/HtmlRendererUtils.java
AU        shared/core/src/main/java/org/apache/myfaces/shared/renderkit/html/HtmlMessagesRendererBase.java
AU        shared/core/src/main/java/org/apache/myfaces/shared/renderkit/RendererUtils.java
AU        shared/core/src/main/java/org/apache/myfaces/shared/readme.txt
A         shared/core/src/main/java/org/apache/myfaces/shared/util
A         shared/core/src/main/java/org/apache/myfaces/shared/util/servlet
AU        shared/core/src/main/java/org/apache/myfaces/shared/util/servlet/SourceCodeServlet.java
AU        shared/core/src/main/java/org/apache/myfaces/shared/util/BiLevelCacheMap.java
AU        shared/core/src/main/java/org/apache/myfaces/shared/util/MessageUtils.java
AU        shared/core/src/main/java/org/apache/myfaces/shared/util/RestoreStateUtils.java
A         shared/core/src/main/java/org/apache/myfaces/shared/util/ParametrizableFacesMessage.java
AU        shared/core/src/main/java/org/apache/myfaces/shared/util/MyFacesObjectInputStream.java
AU        shared/core/src/main/java/org/apache/myfaces/shared/util/ExceptionUtils.java
A         shared/core/src/main/java/org/apache/myfaces/shared/util/xml
AU        shared/core/src/main/java/org/apache/myfaces/shared/util/xml/MyFacesErrorHandler.java
AU        shared/core/src/main/java/org/apache/myfaces/shared/util/xml/XmlUtils.java
A         shared/core/src/main/java/org/apache/myfaces/shared/util/el
AU        shared/core/src/main/java/org/apache/myfaces/shared/util/el/ActionsMap.java
AU        shared/core/src/main/java/org/apache/myfaces/shared/util/el/TestsMap.java
AU        shared/core/src/main/java/org/apache/myfaces/shared/util/el/StringMap.java
AU        shared/core/src/main/java/org/apache/myfaces/shared/util/el/GenericMap.java
AU        shared/core/src/main/java/org/apache/myfaces/shared/util/LocaleUtils.java
AU        shared/core/src/main/java/org/apache/myfaces/shared/util/NullEnumeration.java
AU        shared/core/src/main/java/org/apache/myfaces/shared/util/_ComponentUtils.java
AU        shared/core/src/main/java/org/apache/myfaces/shared/util/NullIterator.java
AU        shared/core/src/main/java/org/apache/myfaces/shared/util/ClassUtils.java
AU        shared/core/src/main/java/org/apache/myfaces/shared/util/StringUtils.java
AU        shared/core/src/main/java/org/apache/myfaces/shared/util/ClassLoaderExtension.java
AU        shared/core/src/main/java/org/apache/myfaces/shared/util/SelectItemsIterator.java
AU        shared/core/src/main/java/org/apache/myfaces/shared/util/ArrayUtils.java
A         shared/core/src/main/java/org/apache/myfaces/shared/util/serial
AU        shared/core/src/main/java/org/apache/myfaces/shared/util/serial/SerialFactory.java
AU        shared/core/src/main/java/org/apache/myfaces/shared/util/serial/DefaultSerialFactory.java
AU        shared/core/src/main/java/org/apache/myfaces/shared/util/StateUtils.java
AU        shared/core/src/main/java/org/apache/myfaces/shared/util/Assert.java
AU        shared/core/src/main/java/org/apache/myfaces/shared/util/HashMapUtils.java
A         shared/core/src/main/java/org/apache/myfaces/shared/trace
AU        shared/core/src/main/java/org/apache/myfaces/shared/trace/TracingIterator.java
AU        shared/core/src/main/java/org/apache/myfaces/shared/trace/TracingSupport.java
AU        shared/core/src/main/java/org/apache/myfaces/shared/trace/Closure.java
A         shared/core/src/main/java/org/apache/myfaces/shared/webapp
A         shared/core/src/main/java/org/apache/myfaces/shared/webapp/webxml
AU        shared/core/src/main/java/org/apache/myfaces/shared/webapp/webxml/WebXmlParser.java
AU        shared/core/src/main/java/org/apache/myfaces/shared/webapp/webxml/WebXml.java
AU        shared/core/src/main/java/org/apache/myfaces/shared/webapp/webxml/ServletMapping.java
AU        shared/core/src/main/java/org/apache/myfaces/shared/webapp/webxml/FilterMapping.java
AU        shared/core/src/main/java/org/apache/myfaces/shared/webapp/webxml/DelegatedFacesServlet.java
A         shared/core/src/main/java/org/apache/myfaces/shared/test
AU        shared/core/src/main/java/org/apache/myfaces/shared/test/ClassElementHandler.java
A         shared/core/src/main/resources
A         shared/core/src/main/resources/META-INF
A         shared/core/src/main/resources/META-INF/NOTICE.txt
A         shared/core/src/main/resources/META-INF/LICENSE.txt
AU        shared/core/pom.xml
AU        shared/pom.xml
A         shared/shared-tomahawk
AU        shared/shared-tomahawk/pom.xml
AU        shared/shared-tomahawk/build.xml
 U        shared
At revision 1601216
At revision 1601216
no change for http://svn.apache.org/repos/asf/myfaces/current12 since the previous build
no change for https://svn.apache.org/repos/asf/myfaces/core/branches/1.2.x since the previous
build
no change for https://svn.apache.org/repos/asf/myfaces/shared/trunk_3.0.x since the previous
build
Parsing POMs
maven-agent.jar already up to date
classworlds.jar already up to date
maven-interceptor.jar already up to date
maven2.1-interceptor.jar already up to date
[current12] $ /home/hudson/tools/java/latest1.6/bin/java -cp /home/jenkins/jenkins-slave/maven-agent.jar:/home/jenkins/jenkins-slave/classworlds.jar
hudson.maven.agent.Main /home/hudson/tools/maven/apache-maven-2.2.1 /home/jenkins/jenkins-slave/slave.jar
/home/jenkins/jenkins-slave/maven-interceptor.jar 47001 /home/jenkins/jenkins-slave/maven2.1-interceptor.jar
<===[JENKINS REMOTING CAPACITY]===>   channel started
log4j:WARN No appenders could be found for logger (org.apache.commons.beanutils.converters.BooleanConverter).
log4j:WARN Please initialize the log4j system properly.
Executing Maven:  -B -f <https://builds.apache.org/job/myfaces-current12/ws/current12/pom.xml>
-Dmaven.repo.local=/home/jenkins/jenkins-slave/maven-repositories/0 install
[INFO] Scanning for projects...
[INFO] Reactor build order: 
[INFO]   Apache MyFaces JSF-1.2 Core Project
[INFO]   Apache Myfaces JSF Core-1.2 API
[INFO]   Apache MyFaces Shared For JSF 1.2 - Project
[INFO]   Apache MyFaces Shared For JSF 1.2 - Core
[INFO]   MyFaces Shared Impl
[INFO]   MyFaces Shared Tomahawk
[INFO]   Apache MyFaces JSF-1.2 Core Impl
[INFO]   Build Project
[INFO] ------------------------------------------------------------------------
[INFO] Building Apache MyFaces JSF-1.2 Core Project
[INFO]    task-segment: [install]
[INFO] ------------------------------------------------------------------------
[INFO] [remote-resources:process {execution: default}]
[INFO] [site:attach-descriptor {execution: default-attach-descriptor}]
[INFO] Preparing source:jar
[WARNING] Removing: jar from forked lifecycle, to prevent recursive invocation.
[INFO] No goals needed for project - skipping
[INFO] [source:jar {execution: attach-source}]
[INFO] [checkstyle:check {execution: verify-style}]
[INFO] 
[INFO] [install:install {execution: default-install}]
[INFO] Installing <https://builds.apache.org/job/myfaces-current12/ws/current12/core/pom.xml>
to /home/jenkins/jenkins-slave/maven-repositories/0/org/apache/myfaces/core/myfaces-core-project/1.2.13-SNAPSHOT/myfaces-core-project-1.2.13-SNAPSHOT.pom
[INFO] Installing <https://builds.apache.org/job/myfaces-current12/ws/current12/core/target/myfaces-core-project-1.2.13-SNAPSHOT-site.xml>
to /home/jenkins/jenkins-slave/maven-repositories/0/org/apache/myfaces/core/myfaces-core-project/1.2.13-SNAPSHOT/myfaces-core-project-1.2.13-SNAPSHOT-site.xml
[INFO] ------------------------------------------------------------------------
[INFO] Building Apache Myfaces JSF Core-1.2 API
[INFO]    task-segment: [install]
[INFO] ------------------------------------------------------------------------
Downloading: http://repo1.maven.org/maven2/org/apache/myfaces/buildtools/myfaces-builder-plugin/1.0.8/myfaces-builder-plugin-1.0.8.pom
6K downloaded  (myfaces-builder-plugin-1.0.8.pom)
Downloading: http://repo1.maven.org/maven2/org/apache/myfaces/buildtools/myfaces-plugin-parent/1.0.4/myfaces-plugin-parent-1.0.4.pom
5K downloaded  (myfaces-plugin-parent-1.0.4.pom)
Downloading: http://repo1.maven.org/maven2/org/apache/myfaces/buildtools/myfaces-builder-plugin/1.0.8/myfaces-builder-plugin-1.0.8.jar
230K downloaded  (myfaces-builder-plugin-1.0.8.jar)
Downloading: http://download.java.net/maven/2/org/apache/myfaces/buildtools/myfaces-builder-annotations/1.0.7/myfaces-builder-annotations-1.0.7.pom
[INFO] Unable to find resource 'org.apache.myfaces.buildtools:myfaces-builder-annotations:pom:1.0.7'
in repository java.net (http://download.java.net/maven/2)
Downloading: http://tomcat.apache.org/dev/dist/m2-repository/org/apache/myfaces/buildtools/myfaces-builder-annotations/1.0.7/myfaces-builder-annotations-1.0.7.pom
[INFO] Unable to find resource 'org.apache.myfaces.buildtools:myfaces-builder-annotations:pom:1.0.7'
in repository tomcat (http://tomcat.apache.org/dev/dist/m2-repository)
Downloading: http://repo1.maven.org/maven2/org/apache/myfaces/buildtools/myfaces-builder-annotations/1.0.7/myfaces-builder-annotations-1.0.7.pom
2K downloaded  (myfaces-builder-annotations-1.0.7.pom)
[WARNING] POM for 'org.testng:testng:pom:5.1:test' is invalid.

Its dependencies (if any) will NOT be available to the current build.
[WARNING] POM for 'org.easymock:easymock:pom:2.3:test' is invalid.

Its dependencies (if any) will NOT be available to the current build.
[WARNING] POM for 'org.easymock:easymockclassextension:pom:2.3:test' is invalid.

Its dependencies (if any) will NOT be available to the current build.
Downloading: http://download.java.net/maven/2/org/apache/myfaces/buildtools/myfaces-builder-annotations/1.0.7/myfaces-builder-annotations-1.0.7.jar
[INFO] Unable to find resource 'org.apache.myfaces.buildtools:myfaces-builder-annotations:jar:1.0.7'
in repository java.net (http://download.java.net/maven/2)
Downloading: http://tomcat.apache.org/dev/dist/m2-repository/org/apache/myfaces/buildtools/myfaces-builder-annotations/1.0.7/myfaces-builder-annotations-1.0.7.jar
[INFO] Unable to find resource 'org.apache.myfaces.buildtools:myfaces-builder-annotations:jar:1.0.7'
in repository tomcat (http://tomcat.apache.org/dev/dist/m2-repository)
Downloading: http://repo1.maven.org/maven2/org/apache/myfaces/buildtools/myfaces-builder-annotations/1.0.7/myfaces-builder-annotations-1.0.7.jar
20K downloaded  (myfaces-builder-annotations-1.0.7.jar)
[INFO] [myfaces-builder:build-metadata {execution: default}]
log4j:WARN No appenders could be found for logger (org.apache.myfaces.buildtools.maven2.plugin.builder.qdox.QdoxModelBuilder).
log4j:WARN Please initialize the log4j system properly.
[INFO] [myfaces-builder:make-components {execution: makecomp}]
[INFO] Using template from file loader: <https://builds.apache.org/job/myfaces-current12/ws/current12/core/api/src/main/resources/META-INF/componentClass12.vm>
[WARNING] *******************************************************************
[WARNING] RuntimeInstance initializing.
[WARNING] Default ResourceManager initializing. (class org.apache.velocity.runtime.resource.ResourceManagerImpl)
[WARNING] FileResourceLoader : initialization starting.
[WARNING] FileResourceLoader : initialization complete.
[WARNING] RelativeClasspathResourceLoader : initialization complete.
[INFO] RelativeClasspathResourceLoader : adding path 'META-INF'
[WARNING] RelativeClasspathResourceLoader : initialization complete.
[WARNING] Default ResourceManager initialization complete.
[WARNING] Velocimacro : initialization starting.
[WARNING] Velocimacro : VM library registration complete.
[WARNING] Velocimacro : Velocimacro : initialization complete.
[WARNING] RuntimeInstance successfully initialized.
[INFO] Generating component class:javax.faces.component.UIMessage
[INFO] Generating component class:javax.faces.component.UIMessages
[INFO] Generating component class:javax.faces.component.UIParameter
[INFO] Generating component class:javax.faces.component.UISelectItem
[INFO] Generating component class:javax.faces.component.UISelectItems
[INFO] Generating component class:javax.faces.component.html.HtmlColumn
[INFO] Generating component class:javax.faces.component.html.HtmlCommandButton
[INFO] Generating component class:javax.faces.component.html.HtmlCommandLink
[INFO] Generating component class:javax.faces.component.html.HtmlDataTable
[INFO] Generating component class:javax.faces.component.html.HtmlForm
[INFO] Generating component class:javax.faces.component.html.HtmlGraphicImage
[INFO] Generating component class:javax.faces.component.html.HtmlInputSecret
[INFO] Generating component class:javax.faces.component.html.HtmlInputText
[INFO] Generating component class:javax.faces.component.html.HtmlInputTextarea
[INFO] Generating component class:javax.faces.component.html.HtmlMessage
[INFO] Generating component class:javax.faces.component.html.HtmlMessages
[INFO] Generating component class:javax.faces.component.html.HtmlOutputFormat
[INFO] Generating component class:javax.faces.component.html.HtmlOutputLabel
[INFO] Generating component class:javax.faces.component.html.HtmlOutputLink
[INFO] Generating component class:javax.faces.component.html.HtmlOutputText
[INFO] Generating component class:javax.faces.component.html.HtmlPanelGrid
[INFO] Generating component class:javax.faces.component.html.HtmlPanelGroup
[INFO] Generating component class:javax.faces.component.html.HtmlSelectBooleanCheckbox
[INFO] Generating component class:javax.faces.component.html.HtmlSelectManyCheckbox
[INFO] Generating component class:javax.faces.component.html.HtmlSelectManyListbox
[INFO] Generating component class:javax.faces.component.html.HtmlSelectManyMenu
[INFO] Generating component class:javax.faces.component.html.HtmlSelectOneListbox
[INFO] Generating component class:javax.faces.component.html.HtmlSelectOneMenu
[INFO] Generating component class:javax.faces.component.html.HtmlSelectOneRadio
[INFO] [remote-resources:process {execution: default}]
[WARNING] POM for 'org.testng:testng:pom:5.1:test' is invalid.

Its dependencies (if any) will NOT be available to the current build.
[WARNING] POM for 'org.easymock:easymock:pom:2.3:test' is invalid.

Its dependencies (if any) will NOT be available to the current build.
[WARNING] POM for 'org.easymock:easymockclassextension:pom:2.3:test' is invalid.

Its dependencies (if any) will NOT be available to the current build.
[debug] execute contextualize
[INFO] [resources:resources {execution: default-resources}]
[INFO] Using 'UTF-8' encoding to copy filtered resources.
[INFO] Copying 20 resources
[INFO] Copying 1 resource
[INFO] Copying 3 resources
[INFO] [compiler:compile {execution: default-compile}]
[INFO] Compiling 213 source files to <https://builds.apache.org/job/myfaces-current12/ws/current12/core/api/target/classes>
[INFO] [bundle:manifest {execution: bundle-manifest}]
[debug] execute contextualize
[INFO] [resources:testResources {execution: default-testResources}]
[INFO] Using 'UTF-8' encoding to copy filtered resources.
[INFO] Copying 0 resource
[INFO] Copying 3 resources
[INFO] [compiler:testCompile {execution: default-testCompile}]
[INFO] Compiling 47 source files to <https://builds.apache.org/job/myfaces-current12/ws/current12/core/api/target/test-classes>
[INFO] ------------------------------------------------------------------------
[ERROR] BUILD FAILURE
[INFO] ------------------------------------------------------------------------
[INFO] Compilation failure

error: error reading /home/jenkins/jenkins-slave/maven-repositories/0/org/testng/testng/5.1/testng-5.1-jdk15.jar;
error in opening zip file
error: error reading /home/jenkins/jenkins-slave/maven-repositories/0/org/easymock/easymock/2.3/easymock-2.3.jar;
error in opening zip file
error: error reading /home/jenkins/jenkins-slave/maven-repositories/0/org/easymock/easymockclassextension/2.3/easymockclassextension-2.3.jar;
error in opening zip file

[INFO] ------------------------------------------------------------------------
[INFO] For more information, run Maven with the -e switch
[INFO] ------------------------------------------------------------------------
[INFO] Total time: 30 seconds
[INFO] Finished at: Sun Jun 08 12:53:05 UTC 2014
[INFO] Final Memory: 63M/399M
[INFO] ------------------------------------------------------------------------
[JENKINS] Archiving <https://builds.apache.org/job/myfaces-current12/ws/current12/core/api/pom.xml>
to org.apache.myfaces.core/myfaces-api/1.2.13-SNAPSHOT/myfaces-api-1.2.13-SNAPSHOT.pom
Sending artifact delta relative to myfaces-current12 ? Apache Myfaces JSF Core-1.2 API #1171
Archived 1 artifacts
Archive block size is 32768
Received 0 blocks and 17464 bytes
Compression is 0.0%
Took 0.44 sec
[JENKINS] Archiving /home/jenkins/jenkins-slave/maven-repositories/0/org/apache/myfaces/core/myfaces-core-project/1.2.13-SNAPSHOT/myfaces-core-project-1.2.13-SNAPSHOT.pom
to org.apache.myfaces.core/myfaces-core-project/1.2.13-SNAPSHOT/myfaces-core-project-1.2.13-SNAPSHOT.pom
[JENKINS] Archiving <https://builds.apache.org/job/myfaces-current12/ws/current12/core/target/myfaces-core-project-1.2.13-SNAPSHOT-site.xml>
to org.apache.myfaces.core/myfaces-core-project/1.2.13-SNAPSHOT/myfaces-core-project-1.2.13-SNAPSHOT-site.xml
/home/jenkins/jenkins-slave/maven-repositories/0/org/apache/myfaces/core/myfaces-core-project/1.2.13-SNAPSHOT/myfaces-core-project-1.2.13-SNAPSHOT.pom
is not inside <https://builds.apache.org/job/myfaces-current12/ws/current12/core/;>
will archive in a separate pass
Sending artifact delta relative to myfaces-current12 ? Apache MyFaces JSF-1.2 Core Project
#1171
Archived 1 artifacts
Archive block size is 32768
Received 0 blocks and 5923 bytes
Compression is 0.0%
Took 0.22 sec
Sending artifact delta relative to myfaces-current12 ? Apache MyFaces JSF-1.2 Core Project
#1171
Archived 1 artifacts
Archive block size is 32768
Received 0 blocks and 17769 bytes
Compression is 0.0%
Took 0.18 sec
Sending e-mails to: commits@myfaces.apache.org grantsmith@apache.org
channel stopped

Mime
View raw message