myfaces-commits mailing list archives

Site index · List index
Message view « Date » · « Thread »
Top « Date » · « Thread »
From Apache Jenkins Server <jenk...@builds.apache.org>
Subject Build failed in Jenkins: myfaces-maven2-plugins #1313
Date Sun, 01 Jun 2014 09:22:34 GMT
See <https://builds.apache.org/job/myfaces-maven2-plugins/1313/>

------------------------------------------
[...truncated 645 lines...]
[INFO] --- maven-resources-plugin:2.4.3:testResources (default-testResources) @ myfaces-tagdoc-plugin
---
[INFO] Using 'UTF-8' encoding to copy filtered resources.
[INFO] skip non existing resourceDirectory F:\jenkins\jenkins-slave\workspace\myfaces-maven2-plugins\maven2-plugins\myfaces-tagdoc-plugin\src\test\resources
[INFO] Copying 3 resources
[INFO] 
[INFO] --- maven-compiler-plugin:2.3.1:testCompile (default-testCompile) @ myfaces-tagdoc-plugin
---
[INFO] No sources to compile
[INFO] 
[INFO] --- maven-surefire-plugin:2.5:test (default-test) @ myfaces-tagdoc-plugin ---
[INFO] Surefire report directory: F:\jenkins\jenkins-slave\workspace\myfaces-maven2-plugins\maven2-plugins\myfaces-tagdoc-plugin\target\surefire-reports

-------------------------------------------------------
 T E S T S
-------------------------------------------------------
There are no tests to run.

Results :

Tests run: 0, Failures: 0, Errors: 0, Skipped: 0

[JENKINS] Recording test results
[INFO] 
[INFO] --- maven-jar-plugin:2.2:jar (default-jar) @ myfaces-tagdoc-plugin ---
[INFO] Building jar: F:\jenkins\jenkins-slave\workspace\myfaces-maven2-plugins\maven2-plugins\myfaces-tagdoc-plugin\target\myfaces-tagdoc-plugin-1.0.1-SNAPSHOT.jar
[INFO] 
[INFO] --- maven-plugin-plugin:2.5.1:addPluginArtifactMetadata (default-addPluginArtifactMetadata)
@ myfaces-tagdoc-plugin ---
[INFO] 
[INFO] --- maven-install-plugin:2.3:install (default-install) @ myfaces-tagdoc-plugin ---
[INFO] Installing F:\jenkins\jenkins-slave\workspace\myfaces-maven2-plugins\maven2-plugins\myfaces-tagdoc-plugin\target\myfaces-tagdoc-plugin-1.0.1-SNAPSHOT.jar
to f:\jenkins\jenkins-slave\maven-repositories\0\org\apache\myfaces\buildtools\myfaces-tagdoc-plugin\1.0.1-SNAPSHOT\myfaces-tagdoc-plugin-1.0.1-SNAPSHOT.jar
[INFO] Installing F:\jenkins\jenkins-slave\workspace\myfaces-maven2-plugins\maven2-plugins\myfaces-tagdoc-plugin\pom.xml
to f:\jenkins\jenkins-slave\maven-repositories\0\org\apache\myfaces\buildtools\myfaces-tagdoc-plugin\1.0.1-SNAPSHOT\myfaces-tagdoc-plugin-1.0.1-SNAPSHOT.pom
[INFO]                                                                         
[INFO] ------------------------------------------------------------------------
[INFO] Building Apache MyFaces Buildtools Maven2 Wagon Plugin 1.0.1-SNAPSHOT
[INFO] ------------------------------------------------------------------------
[INFO] 
[INFO] --- maven-antrun-plugin:1.3:run (javadoc.resources) @ myfaces-wagon-plugin ---
[INFO] Executing tasks
[INFO] Executed tasks
[INFO] 
[INFO] --- maven-plugin-plugin:2.5.1:descriptor (default-descriptor) @ myfaces-wagon-plugin
---
[INFO] Using 'UTF-8' encoding to read mojo metadata.
[INFO] Applying mojo extractor for language: java
[INFO] Mojo extractor for language: java found 1 mojo descriptors.
[INFO] Applying mojo extractor for language: bsh
[INFO] Mojo extractor for language: bsh found 0 mojo descriptors.
[INFO] 
[INFO] --- maven-remote-resources-plugin:1.1:process (default) @ myfaces-wagon-plugin ---
[INFO] Setting property: classpath.resource.loader.class => 'org.codehaus.plexus.velocity.ContextClassLoaderResourceLoader'.
[INFO] Setting property: velocimacro.messages.on => 'false'.
[INFO] Setting property: resource.loader => 'classpath'.
[INFO] Setting property: resource.manager.logwhenfound => 'false'.
[INFO] 
[INFO] --- maven-resources-plugin:2.4.3:resources (default-resources) @ myfaces-wagon-plugin
---
[INFO] Using 'UTF-8' encoding to copy filtered resources.
[INFO] Copying 2 resources
[INFO] Copying 3 resources
[INFO] 
[INFO] --- maven-compiler-plugin:2.3.1:compile (default-compile) @ myfaces-wagon-plugin ---
[INFO] Nothing to compile - all classes are up to date
[INFO] 
[INFO] --- maven-resources-plugin:2.4.3:testResources (default-testResources) @ myfaces-wagon-plugin
---
[INFO] Using 'UTF-8' encoding to copy filtered resources.
[INFO] skip non existing resourceDirectory F:\jenkins\jenkins-slave\workspace\myfaces-maven2-plugins\maven2-plugins\myfaces-wagon-plugin\src\test\resources
[INFO] Copying 3 resources
[INFO] 
[INFO] --- maven-compiler-plugin:2.3.1:testCompile (default-testCompile) @ myfaces-wagon-plugin
---
[INFO] No sources to compile
[INFO] 
[INFO] --- maven-surefire-plugin:2.5:test (default-test) @ myfaces-wagon-plugin ---
[INFO] Surefire report directory: F:\jenkins\jenkins-slave\workspace\myfaces-maven2-plugins\maven2-plugins\myfaces-wagon-plugin\target\surefire-reports

-------------------------------------------------------
 T E S T S
-------------------------------------------------------
There are no tests to run.

Results :

Tests run: 0, Failures: 0, Errors: 0, Skipped: 0

[JENKINS] Recording test results
[INFO] 
[INFO] --- maven-jar-plugin:2.2:jar (default-jar) @ myfaces-wagon-plugin ---
[INFO] Building jar: F:\jenkins\jenkins-slave\workspace\myfaces-maven2-plugins\maven2-plugins\myfaces-wagon-plugin\target\myfaces-wagon-plugin-1.0.1-SNAPSHOT.jar
[INFO] 
[INFO] --- maven-plugin-plugin:2.5.1:addPluginArtifactMetadata (default-addPluginArtifactMetadata)
@ myfaces-wagon-plugin ---
[INFO] 
[INFO] --- maven-install-plugin:2.3:install (default-install) @ myfaces-wagon-plugin ---
[INFO] Installing F:\jenkins\jenkins-slave\workspace\myfaces-maven2-plugins\maven2-plugins\myfaces-wagon-plugin\target\myfaces-wagon-plugin-1.0.1-SNAPSHOT.jar
to f:\jenkins\jenkins-slave\maven-repositories\0\org\apache\myfaces\buildtools\myfaces-wagon-plugin\1.0.1-SNAPSHOT\myfaces-wagon-plugin-1.0.1-SNAPSHOT.jar
[INFO] Installing F:\jenkins\jenkins-slave\workspace\myfaces-maven2-plugins\maven2-plugins\myfaces-wagon-plugin\pom.xml
to f:\jenkins\jenkins-slave\maven-repositories\0\org\apache\myfaces\buildtools\myfaces-wagon-plugin\1.0.1-SNAPSHOT\myfaces-wagon-plugin-1.0.1-SNAPSHOT.pom
[INFO]                                                                         
[INFO] ------------------------------------------------------------------------
[INFO] Building Apache MyFaces Buildtools Maven2 XRTS Plugin 1.0.1-SNAPSHOT
[INFO] ------------------------------------------------------------------------
[INFO] 
[INFO] --- maven-antrun-plugin:1.3:run (javadoc.resources) @ myfaces-xrts-plugin ---
[INFO] Executing tasks
[INFO] Executed tasks
[INFO] 
[INFO] --- maven-plugin-plugin:2.2:descriptor (default-descriptor) @ myfaces-xrts-plugin ---
[INFO] Using 2 extractors.
[INFO] Applying extractor for language: java
[INFO] Extractor for language: java found 2 mojo descriptors.
[INFO] Applying extractor for language: bsh
[INFO] Extractor for language: bsh found 0 mojo descriptors.
[INFO] 
[INFO] --- maven-remote-resources-plugin:1.1:process (default) @ myfaces-xrts-plugin ---
[INFO] 
[INFO] --- maven-resources-plugin:2.4.3:resources (default-resources) @ myfaces-xrts-plugin
---
[INFO] Using 'UTF-8' encoding to copy filtered resources.
[INFO] Copying 0 resource
[INFO] Copying 3 resources
[INFO] 
[INFO] --- maven-compiler-plugin:2.3.1:compile (default-compile) @ myfaces-xrts-plugin ---
[INFO] Nothing to compile - all classes are up to date
[INFO] 
[INFO] --- maven-resources-plugin:2.4.3:testResources (default-testResources) @ myfaces-xrts-plugin
---
[INFO] Using 'UTF-8' encoding to copy filtered resources.
[INFO] skip non existing resourceDirectory F:\jenkins\jenkins-slave\workspace\myfaces-maven2-plugins\maven2-plugins\myfaces-xrts-plugin\src\test\resources
[INFO] Copying 3 resources
[INFO] 
[INFO] --- maven-compiler-plugin:2.3.1:testCompile (default-testCompile) @ myfaces-xrts-plugin
---
[INFO] No sources to compile
[INFO] 
[INFO] --- maven-surefire-plugin:2.5:test (default-test) @ myfaces-xrts-plugin ---
[INFO] Surefire report directory: F:\jenkins\jenkins-slave\workspace\myfaces-maven2-plugins\maven2-plugins\myfaces-xrts-plugin\target\surefire-reports

-------------------------------------------------------
 T E S T S
-------------------------------------------------------
There are no tests to run.

Results :

Tests run: 0, Failures: 0, Errors: 0, Skipped: 0

[JENKINS] Recording test results
[INFO] 
[INFO] --- maven-jar-plugin:2.2:jar (default-jar) @ myfaces-xrts-plugin ---
[INFO] Building jar: F:\jenkins\jenkins-slave\workspace\myfaces-maven2-plugins\maven2-plugins\myfaces-xrts-plugin\target\myfaces-xrts-plugin-1.0.1-SNAPSHOT.jar
[INFO] 
[INFO] --- maven-plugin-plugin:2.2:addPluginArtifactMetadata (default-addPluginArtifactMetadata)
@ myfaces-xrts-plugin ---
[INFO] 
[INFO] --- maven-install-plugin:2.3:install (default-install) @ myfaces-xrts-plugin ---
[INFO] Installing F:\jenkins\jenkins-slave\workspace\myfaces-maven2-plugins\maven2-plugins\myfaces-xrts-plugin\target\myfaces-xrts-plugin-1.0.1-SNAPSHOT.jar
to f:\jenkins\jenkins-slave\maven-repositories\0\org\apache\myfaces\buildtools\myfaces-xrts-plugin\1.0.1-SNAPSHOT\myfaces-xrts-plugin-1.0.1-SNAPSHOT.jar
[INFO] Installing F:\jenkins\jenkins-slave\workspace\myfaces-maven2-plugins\maven2-plugins\myfaces-xrts-plugin\pom.xml
to f:\jenkins\jenkins-slave\maven-repositories\0\org\apache\myfaces\buildtools\myfaces-xrts-plugin\1.0.1-SNAPSHOT\myfaces-xrts-plugin-1.0.1-SNAPSHOT.pom
[INFO]                                                                         
[INFO] ------------------------------------------------------------------------
[INFO] Building Apache MyFaces Buildtools Maven2 Plugin Module 1-SNAPSHOT
[INFO] ------------------------------------------------------------------------
[INFO] 
[INFO] --- maven-remote-resources-plugin:1.1:process (default) @ myfaces-plugin-module ---
[INFO] 
[INFO] --- maven-install-plugin:2.3:install (default-install) @ myfaces-plugin-module ---
[INFO] Installing <https://builds.apache.org/job/myfaces-maven2-plugins/ws/maven2-plugins\pom.xml>
to f:\jenkins\jenkins-slave\maven-repositories\0\org\apache\myfaces\buildtools\myfaces-plugin-module\1-SNAPSHOT\myfaces-plugin-module-1-SNAPSHOT.pom
[INFO] ------------------------------------------------------------------------
[INFO] Reactor Summary:
[INFO] 
[INFO] Apache MyFaces Buildtools Maven2 Plugin Parent .... SUCCESS [18.285s]
[INFO] Apache MyFaces Buildtools Maven2 Builder Annotations  SUCCESS [8.541s]
[INFO] Apache MyFaces Buildtools Maven2 Builder Plugin ... SUCCESS [22.765s]
[INFO] Apache MyFaces Buildtools Maven2 Faces Plugin ..... SUCCESS [13.375s]
[INFO] Apache MyFaces Buildtools Maven2 i18n Plugin ...... SUCCESS [5.903s]
[INFO] Apache MyFaces Buildtools Maven2 Javacc Plugin .... SUCCESS [3.834s]
[INFO] Apache MyFaces Buildtools Maven2 Javascript Plugin  SUCCESS [23.903s]
[INFO] Apache MyFaces Buildtools Maven2 Javascript Documentation Plugin  SUCCESS [3.769s]
[INFO] Apache MyFaces Buildtools Maven2 JDev Plugin ...... SUCCESS [5.855s]
[INFO] Apache MyFaces Buildtools Maven2 Tag Documentation Report  SUCCESS [9.831s]
[INFO] Apache MyFaces Buildtools Maven2 Wagon Plugin ..... SUCCESS [11.775s]
[INFO] Apache MyFaces Buildtools Maven2 XRTS Plugin ...... SUCCESS [6.324s]
[INFO] Apache MyFaces Buildtools Maven2 Plugin Module .... SUCCESS [3.617s]
[INFO] ------------------------------------------------------------------------
[INFO] BUILD SUCCESS
[INFO] ------------------------------------------------------------------------
[INFO] Total time: 2:34.969s
[INFO] Finished at: Sun Jun 01 02:22:01 PDT 2014
[INFO] Final Memory: 44M/107M
[INFO] ------------------------------------------------------------------------
Waiting for Jenkins to finish collecting data
[JENKINS] Archiving F:\jenkins\jenkins-slave\workspace\myfaces-maven2-plugins\maven2-plugins\myfaces-i18n-plugin\pom.xml
to org.apache.myfaces.buildtools/myfaces-i18n-plugin/1.0.1-SNAPSHOT/myfaces-i18n-plugin-1.0.1-SNAPSHOT.pom
[JENKINS] Archiving F:\jenkins\jenkins-slave\workspace\myfaces-maven2-plugins\maven2-plugins\myfaces-i18n-plugin\target\myfaces-i18n-plugin-1.0.1-SNAPSHOT.jar
to org.apache.myfaces.buildtools/myfaces-i18n-plugin/1.0.1-SNAPSHOT/myfaces-i18n-plugin-1.0.1-SNAPSHOT.jar
[JENKINS] Archiving F:\jenkins\jenkins-slave\workspace\myfaces-maven2-plugins\maven2-plugins\myfaces-wagon-plugin\pom.xml
to org.apache.myfaces.buildtools/myfaces-wagon-plugin/1.0.1-SNAPSHOT/myfaces-wagon-plugin-1.0.1-SNAPSHOT.pom
[JENKINS] Archiving F:\jenkins\jenkins-slave\workspace\myfaces-maven2-plugins\maven2-plugins\myfaces-wagon-plugin\target\myfaces-wagon-plugin-1.0.1-SNAPSHOT.jar
to org.apache.myfaces.buildtools/myfaces-wagon-plugin/1.0.1-SNAPSHOT/myfaces-wagon-plugin-1.0.1-SNAPSHOT.jar
[JENKINS] Archiving F:\jenkins\jenkins-slave\workspace\myfaces-maven2-plugins\maven2-plugins\myfaces-faces-plugin\pom.xml
to org.apache.myfaces.buildtools/myfaces-faces-plugin/1.0.1-SNAPSHOT/myfaces-faces-plugin-1.0.1-SNAPSHOT.pom
[JENKINS] Archiving F:\jenkins\jenkins-slave\workspace\myfaces-maven2-plugins\maven2-plugins\myfaces-faces-plugin\target\myfaces-faces-plugin-1.0.1-SNAPSHOT.jar
to org.apache.myfaces.buildtools/myfaces-faces-plugin/1.0.1-SNAPSHOT/myfaces-faces-plugin-1.0.1-SNAPSHOT.jar
[JENKINS] Archiving F:\jenkins\jenkins-slave\workspace\myfaces-maven2-plugins\maven2-plugins\myfaces-builder-annotations\pom.xml
to org.apache.myfaces.buildtools/myfaces-builder-annotations/1.0.10-SNAPSHOT/myfaces-builder-annotations-1.0.10-SNAPSHOT.pom
[JENKINS] Archiving F:\jenkins\jenkins-slave\workspace\myfaces-maven2-plugins\maven2-plugins\myfaces-builder-annotations\target\myfaces-builder-annotations-1.0.10-SNAPSHOT.jar
to org.apache.myfaces.buildtools/myfaces-builder-annotations/1.0.10-SNAPSHOT/myfaces-builder-annotations-1.0.10-SNAPSHOT.jar
[JENKINS] Archiving F:\jenkins\jenkins-slave\workspace\myfaces-maven2-plugins\maven2-plugins\myfaces-tagdoc-plugin\pom.xml
to org.apache.myfaces.buildtools/myfaces-tagdoc-plugin/1.0.1-SNAPSHOT/myfaces-tagdoc-plugin-1.0.1-SNAPSHOT.pom
[JENKINS] Archiving F:\jenkins\jenkins-slave\workspace\myfaces-maven2-plugins\maven2-plugins\myfaces-tagdoc-plugin\target\myfaces-tagdoc-plugin-1.0.1-SNAPSHOT.jar
to org.apache.myfaces.buildtools/myfaces-tagdoc-plugin/1.0.1-SNAPSHOT/myfaces-tagdoc-plugin-1.0.1-SNAPSHOT.jar
[JENKINS] Archiving F:\jenkins\jenkins-slave\workspace\myfaces-maven2-plugins\maven2-plugins\myfaces-jsdoc-plugin\pom.xml
to org.apache.myfaces.buildtools/myfaces-jsdoc-plugin/1.0-beta-2-SNAPSHOT/myfaces-jsdoc-plugin-1.0-beta-2-SNAPSHOT.pom
[JENKINS] Archiving F:\jenkins\jenkins-slave\workspace\myfaces-maven2-plugins\maven2-plugins\myfaces-jsdoc-plugin\target\myfaces-jsdoc-plugin-1.0-beta-2-SNAPSHOT.jar
to org.apache.myfaces.buildtools/myfaces-jsdoc-plugin/1.0-beta-2-SNAPSHOT/myfaces-jsdoc-plugin-1.0-beta-2-SNAPSHOT.jar
[JENKINS] Archiving F:\jenkins\jenkins-slave\workspace\myfaces-maven2-plugins\maven2-plugins\myfaces-builder-plugin\pom.xml
to org.apache.myfaces.buildtools/myfaces-builder-plugin/1.0.11-SNAPSHOT/myfaces-builder-plugin-1.0.11-SNAPSHOT.pom
[JENKINS] Archiving F:\jenkins\jenkins-slave\workspace\myfaces-maven2-plugins\maven2-plugins\myfaces-builder-plugin\target\myfaces-builder-plugin-1.0.11-SNAPSHOT.jar
to org.apache.myfaces.buildtools/myfaces-builder-plugin/1.0.11-SNAPSHOT/myfaces-builder-plugin-1.0.11-SNAPSHOT.jar
[JENKINS] Archiving F:\jenkins\jenkins-slave\workspace\myfaces-maven2-plugins\maven2-plugins\myfaces-xrts-plugin\pom.xml
to org.apache.myfaces.buildtools/myfaces-xrts-plugin/1.0.1-SNAPSHOT/myfaces-xrts-plugin-1.0.1-SNAPSHOT.pom
[JENKINS] Archiving F:\jenkins\jenkins-slave\workspace\myfaces-maven2-plugins\maven2-plugins\myfaces-xrts-plugin\target\myfaces-xrts-plugin-1.0.1-SNAPSHOT.jar
to org.apache.myfaces.buildtools/myfaces-xrts-plugin/1.0.1-SNAPSHOT/myfaces-xrts-plugin-1.0.1-SNAPSHOT.jar
[JENKINS] Archiving F:\jenkins\jenkins-slave\workspace\myfaces-maven2-plugins\maven2-plugins\myfaces-jdev-plugin\pom.xml
to org.apache.myfaces.buildtools/myfaces-jdev-plugin/1.0.1-SNAPSHOT/myfaces-jdev-plugin-1.0.1-SNAPSHOT.pom
[JENKINS] Archiving F:\jenkins\jenkins-slave\workspace\myfaces-maven2-plugins\maven2-plugins\myfaces-jdev-plugin\target\myfaces-jdev-plugin-1.0.1-SNAPSHOT.jar
to org.apache.myfaces.buildtools/myfaces-jdev-plugin/1.0.1-SNAPSHOT/myfaces-jdev-plugin-1.0.1-SNAPSHOT.jar
[JENKINS] Archiving F:\jenkins\jenkins-slave\workspace\myfaces-maven2-plugins\maven2-plugins\myfaces-javacc-plugin\pom.xml
to org.apache.myfaces.buildtools/myfaces-javacc-plugin/1.0.2-SNAPSHOT/myfaces-javacc-plugin-1.0.2-SNAPSHOT.pom
[JENKINS] Archiving F:\jenkins\jenkins-slave\workspace\myfaces-maven2-plugins\maven2-plugins\myfaces-javacc-plugin\target\myfaces-javacc-plugin-1.0.2-SNAPSHOT.jar
to org.apache.myfaces.buildtools/myfaces-javacc-plugin/1.0.2-SNAPSHOT/myfaces-javacc-plugin-1.0.2-SNAPSHOT.jar
[JENKINS] Archiving F:\jenkins\jenkins-slave\workspace\myfaces-maven2-plugins\maven2-plugins\myfaces-plugin-parent\pom.xml
to org.apache.myfaces.buildtools/myfaces-plugin-parent/1.0.7-SNAPSHOT/myfaces-plugin-parent-1.0.7-SNAPSHOT.pom
[JENKINS] Archiving F:\jenkins\jenkins-slave\workspace\myfaces-maven2-plugins\maven2-plugins\myfaces-plugin-parent\target\myfaces-plugin-parent-1.0.7-SNAPSHOT-site.xml
to org.apache.myfaces.buildtools/myfaces-plugin-parent/1.0.7-SNAPSHOT/myfaces-plugin-parent-1.0.7-SNAPSHOT-site.xml
[JENKINS] Archiving <https://builds.apache.org/job/myfaces-maven2-plugins/ws/maven2-plugins\pom.xml>
to org.apache.myfaces.buildtools/myfaces-plugin-module/1-SNAPSHOT/myfaces-plugin-module-1-SNAPSHOT.pom
[JENKINS] Archiving F:\jenkins\jenkins-slave\workspace\myfaces-maven2-plugins\maven2-plugins\myfaces-javascript-plugin\pom.xml
to org.apache.myfaces.buildtools/myfaces-javascript-plugin/1.0.3-SNAPSHOT/myfaces-javascript-plugin-1.0.3-SNAPSHOT.pom
[JENKINS] Archiving F:\jenkins\jenkins-slave\workspace\myfaces-maven2-plugins\maven2-plugins\myfaces-javascript-plugin\target\myfaces-javascript-plugin-1.0.3-SNAPSHOT.jar
to org.apache.myfaces.buildtools/myfaces-javascript-plugin/1.0.3-SNAPSHOT/myfaces-javascript-plugin-1.0.3-SNAPSHOT.jar
channel stopped
Maven RedeployPublisher use remote windows2 maven settings from : f:\jenkins\tools\maven\latest/conf/settings.xml
[ERROR] uniqueVersion == false is not anymore supported in maven 3
[INFO] Deployment in https://repository.apache.org/content/repositories/snapshots (id=apache.snapshots.https,uniqueVersion=false)
Deploying the main artifact jenkins-8230210120876688361myfaces-builder-annotations-1.0.10-SNAPSHOT.jar
Downloading: https://repository.apache.org/content/repositories/snapshots/org/apache/myfaces/buildtools/myfaces-builder-annotations/1.0.10-SNAPSHOT/maven-metadata.xml
Downloaded: https://repository.apache.org/content/repositories/snapshots/org/apache/myfaces/buildtools/myfaces-builder-annotations/1.0.10-SNAPSHOT/maven-metadata.xml
(815 B at 0.3 KB/sec)
Uploading: https://repository.apache.org/content/repositories/snapshots/org/apache/myfaces/buildtools/myfaces-builder-annotations/1.0.10-SNAPSHOT/myfaces-builder-annotations-1.0.10-20140601.092228-651.jar
Uploading: https://repository.apache.org/content/repositories/snapshots/org/apache/myfaces/buildtools/myfaces-builder-annotations/1.0.10-SNAPSHOT/myfaces-builder-annotations-1.0.10-20140601.092228-651.pom
ERROR: Failed to deploy artifacts: Could not transfer artifact org.apache.myfaces.buildtools:myfaces-builder-annotations:jar:1.0.10-20140601.092228-651
from/to apache.snapshots.https (https://repository.apache.org/content/repositories/snapshots):
Failed to transfer file: https://repository.apache.org/content/repositories/snapshots/org/apache/myfaces/buildtools/myfaces-builder-annotations/1.0.10-SNAPSHOT/myfaces-builder-annotations-1.0.10-20140601.092228-651.jar.
Return code is: 401, ReasonPhrase: Unauthorized.
org.apache.maven.artifact.deployer.ArtifactDeploymentException: Failed to deploy artifacts:
Could not transfer artifact org.apache.myfaces.buildtools:myfaces-builder-annotations:jar:1.0.10-20140601.092228-651
from/to apache.snapshots.https (https://repository.apache.org/content/repositories/snapshots):
Failed to transfer file: https://repository.apache.org/content/repositories/snapshots/org/apache/myfaces/buildtools/myfaces-builder-annotations/1.0.10-SNAPSHOT/myfaces-builder-annotations-1.0.10-20140601.092228-651.jar.
Return code is: 401, ReasonPhrase: Unauthorized.
	at org.apache.maven.artifact.deployer.DefaultArtifactDeployer.deploy(DefaultArtifactDeployer.java:143)
	at hudson.maven.reporters.MavenArtifactRecord.deploy(MavenArtifactRecord.java:191)
	at hudson.maven.RedeployPublisher.perform(RedeployPublisher.java:176)
	at hudson.tasks.BuildStepMonitor$1.perform(BuildStepMonitor.java:20)
	at hudson.model.AbstractBuild$AbstractBuildExecution.perform(AbstractBuild.java:804)
	at hudson.model.AbstractBuild$AbstractBuildExecution.performAllBuildSteps(AbstractBuild.java:776)
	at hudson.maven.MavenModuleSetBuild$MavenModuleSetBuildExecution.post2(MavenModuleSetBuild.java:1030)
	at hudson.model.AbstractBuild$AbstractBuildExecution.post(AbstractBuild.java:725)
	at hudson.model.Run.execute(Run.java:1701)
	at hudson.maven.MavenModuleSetBuild.run(MavenModuleSetBuild.java:519)
	at hudson.model.ResourceController.execute(ResourceController.java:88)
	at hudson.model.Executor.run(Executor.java:231)
Caused by: org.eclipse.aether.deployment.DeploymentException: Failed to deploy artifacts:
Could not transfer artifact org.apache.myfaces.buildtools:myfaces-builder-annotations:jar:1.0.10-20140601.092228-651
from/to apache.snapshots.https (https://repository.apache.org/content/repositories/snapshots):
Failed to transfer file: https://repository.apache.org/content/repositories/snapshots/org/apache/myfaces/buildtools/myfaces-builder-annotations/1.0.10-SNAPSHOT/myfaces-builder-annotations-1.0.10-20140601.092228-651.jar.
Return code is: 401, ReasonPhrase: Unauthorized.
	at org.eclipse.aether.internal.impl.DefaultDeployer.deploy(DefaultDeployer.java:341)
	at org.eclipse.aether.internal.impl.DefaultDeployer.deploy(DefaultDeployer.java:269)
	at org.eclipse.aether.internal.impl.DefaultRepositorySystem.deploy(DefaultRepositorySystem.java:413)
	at org.apache.maven.artifact.deployer.DefaultArtifactDeployer.deploy(DefaultArtifactDeployer.java:139)
	... 11 more
Caused by: org.eclipse.aether.transfer.ArtifactTransferException: Could not transfer artifact
org.apache.myfaces.buildtools:myfaces-builder-annotations:jar:1.0.10-20140601.092228-651 from/to
apache.snapshots.https (https://repository.apache.org/content/repositories/snapshots): Failed
to transfer file: https://repository.apache.org/content/repositories/snapshots/org/apache/myfaces/buildtools/myfaces-builder-annotations/1.0.10-SNAPSHOT/myfaces-builder-annotations-1.0.10-20140601.092228-651.jar.
Return code is: 401, ReasonPhrase: Unauthorized.
	at org.eclipse.aether.connector.wagon.WagonRepositoryConnector$6.wrap(WagonRepositoryConnector.java:1016)
	at org.eclipse.aether.connector.wagon.WagonRepositoryConnector$6.wrap(WagonRepositoryConnector.java:1004)
	at org.eclipse.aether.connector.wagon.WagonRepositoryConnector$PutTask.run(WagonRepositoryConnector.java:895)
	at org.eclipse.aether.connector.wagon.WagonRepositoryConnector.put(WagonRepositoryConnector.java:522)
	at org.eclipse.aether.internal.impl.DefaultDeployer.deploy(DefaultDeployer.java:335)
	... 14 more
Caused by: org.apache.maven.wagon.TransferFailedException: Failed to transfer file: https://repository.apache.org/content/repositories/snapshots/org/apache/myfaces/buildtools/myfaces-builder-annotations/1.0.10-SNAPSHOT/myfaces-builder-annotations-1.0.10-20140601.092228-651.jar.
Return code is: 401, ReasonPhrase: Unauthorized.
	at org.apache.maven.wagon.shared.http4.AbstractHttpClientWagon.put(AbstractHttpClientWagon.java:626)
	at org.apache.maven.wagon.shared.http4.AbstractHttpClientWagon.put(AbstractHttpClientWagon.java:524)
	at org.apache.maven.wagon.shared.http4.AbstractHttpClientWagon.put(AbstractHttpClientWagon.java:505)
	at org.apache.maven.wagon.shared.http4.AbstractHttpClientWagon.put(AbstractHttpClientWagon.java:485)
	at org.eclipse.aether.connector.wagon.WagonRepositoryConnector$PutTask.run(WagonRepositoryConnector.java:871)
	... 16 more
[INFO] Deployment failed after 2.8 sec
Build step 'Deploy artifacts to Maven repository' changed build result to FAILURE

Mime
View raw message