myfaces-commits mailing list archives

Site index · List index
Message view « Date » · « Thread »
Top « Date » · « Thread »
From Apache Jenkins Server <jenk...@builds.apache.org>
Subject Build failed in Jenkins: myfaces-current22-1 #1315
Date Sun, 01 Jun 2014 19:04:56 GMT
See <https://builds.apache.org/job/myfaces-current22-1/1315/>

------------------------------------------
[...truncated 852 lines...]
[INFO] META-INF/LICENSE already added, skipping
[INFO] META-INF/DEPENDENCIES already added, skipping
[INFO] META-INF already added, skipping
[INFO] META-INF already added, skipping
[INFO] META-INF/NOTICE already added, skipping
[INFO] META-INF/LICENSE already added, skipping
[INFO] META-INF/DEPENDENCIES already added, skipping
[INFO] META-INF already added, skipping
[INFO] META-INF/NOTICE already added, skipping
[INFO] META-INF/LICENSE already added, skipping
[INFO] META-INF/DEPENDENCIES already added, skipping
[WARNING] Artifact org.apache.myfaces.shared:myfaces-shared-tomahawk:java-source:sources:4.2.3-SNAPSHOT
already attached to project, ignoring duplicate
[INFO] 
[INFO] --- maven-checkstyle-plugin:2.6:check (verify-style) @ myfaces-shared-tomahawk ---
[INFO] Starting audit...
Audit done.

[INFO] 
[INFO] --- maven-install-plugin:2.3.1:install (default-install) @ myfaces-shared-tomahawk
---
[INFO] Installing <https://builds.apache.org/job/myfaces-current22-1/ws/current22/shared/shared-tomahawk/target/myfaces-shared-tomahawk-4.2.3-SNAPSHOT.jar>
to /home/jenkins/jenkins-slave/maven-repositories/0/org/apache/myfaces/shared/myfaces-shared-tomahawk/4.2.3-SNAPSHOT/myfaces-shared-tomahawk-4.2.3-SNAPSHOT.jar
[INFO] Installing <https://builds.apache.org/job/myfaces-current22-1/ws/current22/shared/shared-tomahawk/pom.xml>
to /home/jenkins/jenkins-slave/maven-repositories/0/org/apache/myfaces/shared/myfaces-shared-tomahawk/4.2.3-SNAPSHOT/myfaces-shared-tomahawk-4.2.3-SNAPSHOT.pom
[INFO] Installing <https://builds.apache.org/job/myfaces-current22-1/ws/current22/shared/shared-tomahawk/target/myfaces-shared-tomahawk-4.2.3-SNAPSHOT-sources.jar>
to /home/jenkins/jenkins-slave/maven-repositories/0/org/apache/myfaces/shared/myfaces-shared-tomahawk/4.2.3-SNAPSHOT/myfaces-shared-tomahawk-4.2.3-SNAPSHOT-sources.jar
[INFO] 
[INFO] --- maven-deploy-plugin:2.7:deploy (default-deploy) @ myfaces-shared-tomahawk ---
Downloading: https://repository.apache.org/content/repositories/snapshots/org/apache/myfaces/shared/myfaces-shared-tomahawk/4.2.3-SNAPSHOT/maven-metadata.xml
Downloaded: https://repository.apache.org/content/repositories/snapshots/org/apache/myfaces/shared/myfaces-shared-tomahawk/4.2.3-SNAPSHOT/maven-metadata.xml
(1016 B at 3.6 KB/sec)
Uploading: https://repository.apache.org/content/repositories/snapshots/org/apache/myfaces/shared/myfaces-shared-tomahawk/4.2.3-SNAPSHOT/myfaces-shared-tomahawk-4.2.3-20140601.190306-23.jar
Uploaded: https://repository.apache.org/content/repositories/snapshots/org/apache/myfaces/shared/myfaces-shared-tomahawk/4.2.3-SNAPSHOT/myfaces-shared-tomahawk-4.2.3-20140601.190306-23.jar
(446 KB at 617.4 KB/sec)
Uploading: https://repository.apache.org/content/repositories/snapshots/org/apache/myfaces/shared/myfaces-shared-tomahawk/4.2.3-SNAPSHOT/myfaces-shared-tomahawk-4.2.3-20140601.190306-23.pom
Uploaded: https://repository.apache.org/content/repositories/snapshots/org/apache/myfaces/shared/myfaces-shared-tomahawk/4.2.3-SNAPSHOT/myfaces-shared-tomahawk-4.2.3-20140601.190306-23.pom
(8 KB at 20.2 KB/sec)
Downloading: https://repository.apache.org/content/repositories/snapshots/org/apache/myfaces/shared/myfaces-shared-tomahawk/maven-metadata.xml
Downloaded: https://repository.apache.org/content/repositories/snapshots/org/apache/myfaces/shared/myfaces-shared-tomahawk/maven-metadata.xml
(532 B at 2.4 KB/sec)
Uploading: https://repository.apache.org/content/repositories/snapshots/org/apache/myfaces/shared/myfaces-shared-tomahawk/4.2.3-SNAPSHOT/maven-metadata.xml
Uploaded: https://repository.apache.org/content/repositories/snapshots/org/apache/myfaces/shared/myfaces-shared-tomahawk/4.2.3-SNAPSHOT/maven-metadata.xml
(1016 B at 3.4 KB/sec)
Uploading: https://repository.apache.org/content/repositories/snapshots/org/apache/myfaces/shared/myfaces-shared-tomahawk/maven-metadata.xml
Uploaded: https://repository.apache.org/content/repositories/snapshots/org/apache/myfaces/shared/myfaces-shared-tomahawk/maven-metadata.xml
(532 B at 1.3 KB/sec)
Uploading: https://repository.apache.org/content/repositories/snapshots/org/apache/myfaces/shared/myfaces-shared-tomahawk/4.2.3-SNAPSHOT/myfaces-shared-tomahawk-4.2.3-20140601.190306-23-sources.jar
Uploaded: https://repository.apache.org/content/repositories/snapshots/org/apache/myfaces/shared/myfaces-shared-tomahawk/4.2.3-SNAPSHOT/myfaces-shared-tomahawk-4.2.3-20140601.190306-23-sources.jar
(392 KB at 540.9 KB/sec)
Uploading: https://repository.apache.org/content/repositories/snapshots/org/apache/myfaces/shared/myfaces-shared-tomahawk/4.2.3-SNAPSHOT/maven-metadata.xml
Uploaded: https://repository.apache.org/content/repositories/snapshots/org/apache/myfaces/shared/myfaces-shared-tomahawk/4.2.3-SNAPSHOT/maven-metadata.xml
(1016 B at 2.8 KB/sec)
[INFO]                                                                         
[INFO] ------------------------------------------------------------------------
[INFO] Building Apache MyFaces JSF-2.2 Core Project 2.2.4-SNAPSHOT
[INFO] ------------------------------------------------------------------------
[INFO] 
[INFO] --- maven-clean-plugin:2.5:clean (default-clean) @ myfaces-core-project ---
[INFO] 
[INFO] --- maven-remote-resources-plugin:1.4:process (default) @ myfaces-core-project ---
[WARNING] Failed to getClass for org.apache.maven.plugin.source.SourceJarMojo
[INFO] 
[INFO] --- maven-source-plugin:2.2.1:jar (attach-source) @ myfaces-core-project ---
[INFO] 
[INFO] --- maven-site-plugin:3.3:attach-descriptor (attach-descriptor) @ myfaces-core-project
---
[INFO] 
[INFO] --- maven-checkstyle-plugin:2.7:check (verify-style) @ myfaces-core-project ---
[INFO] Starting audit...
Audit done.

[INFO] 
[INFO] --- maven-install-plugin:2.3.1:install (default-install) @ myfaces-core-project ---
[INFO] Installing <https://builds.apache.org/job/myfaces-current22-1/ws/current22/core/parent/pom.xml>
to /home/jenkins/jenkins-slave/maven-repositories/0/org/apache/myfaces/core/myfaces-core-project/2.2.4-SNAPSHOT/myfaces-core-project-2.2.4-SNAPSHOT.pom
[INFO] Installing <https://builds.apache.org/job/myfaces-current22-1/ws/current22/core/parent/target/myfaces-core-project-2.2.4-SNAPSHOT-site.xml>
to /home/jenkins/jenkins-slave/maven-repositories/0/org/apache/myfaces/core/myfaces-core-project/2.2.4-SNAPSHOT/myfaces-core-project-2.2.4-SNAPSHOT-site.xml
[INFO] 
[INFO] --- maven-remote-resources-plugin:1.4:process (default) @ myfaces-core-project ---
[WARNING] Failed to getClass for org.apache.maven.plugin.source.SourceJarMojo
[INFO] 
[INFO] --- maven-source-plugin:2.2.1:jar (attach-source) @ myfaces-core-project ---
[INFO] 
[INFO] --- maven-site-plugin:3.3:attach-descriptor (attach-descriptor) @ myfaces-core-project
---
[WARNING] Artifact org.apache.myfaces.core:myfaces-core-project:xml:site:2.2.4-SNAPSHOT already
attached to project, ignoring duplicate
[INFO] 
[INFO] --- maven-checkstyle-plugin:2.7:check (verify-style) @ myfaces-core-project ---
[INFO] Starting audit...
Audit done.

[INFO] 
[INFO] --- maven-install-plugin:2.3.1:install (default-install) @ myfaces-core-project ---
[INFO] Installing <https://builds.apache.org/job/myfaces-current22-1/ws/current22/core/parent/pom.xml>
to /home/jenkins/jenkins-slave/maven-repositories/0/org/apache/myfaces/core/myfaces-core-project/2.2.4-SNAPSHOT/myfaces-core-project-2.2.4-SNAPSHOT.pom
[INFO] Installing <https://builds.apache.org/job/myfaces-current22-1/ws/current22/core/parent/target/myfaces-core-project-2.2.4-SNAPSHOT-site.xml>
to /home/jenkins/jenkins-slave/maven-repositories/0/org/apache/myfaces/core/myfaces-core-project/2.2.4-SNAPSHOT/myfaces-core-project-2.2.4-SNAPSHOT-site.xml
[INFO] 
[INFO] --- maven-deploy-plugin:2.7:deploy (default-deploy) @ myfaces-core-project ---
Downloading: https://repository.apache.org/content/repositories/snapshots/org/apache/myfaces/core/myfaces-core-project/2.2.4-SNAPSHOT/maven-metadata.xml
Downloaded: https://repository.apache.org/content/repositories/snapshots/org/apache/myfaces/core/myfaces-core-project/2.2.4-SNAPSHOT/maven-metadata.xml
(834 B at 2.2 KB/sec)
Uploading: https://repository.apache.org/content/repositories/snapshots/org/apache/myfaces/core/myfaces-core-project/2.2.4-SNAPSHOT/myfaces-core-project-2.2.4-20140601.190323-21.pom
Uploaded: https://repository.apache.org/content/repositories/snapshots/org/apache/myfaces/core/myfaces-core-project/2.2.4-SNAPSHOT/myfaces-core-project-2.2.4-20140601.190323-21.pom
(26 KB at 75.5 KB/sec)
Downloading: https://repository.apache.org/content/repositories/snapshots/org/apache/myfaces/core/myfaces-core-project/maven-metadata.xml
Downloaded: https://repository.apache.org/content/repositories/snapshots/org/apache/myfaces/core/myfaces-core-project/maven-metadata.xml
(581 B at 2.9 KB/sec)
Uploading: https://repository.apache.org/content/repositories/snapshots/org/apache/myfaces/core/myfaces-core-project/2.2.4-SNAPSHOT/maven-metadata.xml
Uploaded: https://repository.apache.org/content/repositories/snapshots/org/apache/myfaces/core/myfaces-core-project/2.2.4-SNAPSHOT/maven-metadata.xml
(834 B at 1.7 KB/sec)
Uploading: https://repository.apache.org/content/repositories/snapshots/org/apache/myfaces/core/myfaces-core-project/maven-metadata.xml
Uploaded: https://repository.apache.org/content/repositories/snapshots/org/apache/myfaces/core/myfaces-core-project/maven-metadata.xml
(581 B at 1.6 KB/sec)
Uploading: https://repository.apache.org/content/repositories/snapshots/org/apache/myfaces/core/myfaces-core-project/2.2.4-SNAPSHOT/myfaces-core-project-2.2.4-20140601.190323-21-site.xml
Uploaded: https://repository.apache.org/content/repositories/snapshots/org/apache/myfaces/core/myfaces-core-project/2.2.4-SNAPSHOT/myfaces-core-project-2.2.4-20140601.190323-21-site.xml
(6 KB at 15.9 KB/sec)
Uploading: https://repository.apache.org/content/repositories/snapshots/org/apache/myfaces/core/myfaces-core-project/2.2.4-SNAPSHOT/maven-metadata.xml
Uploaded: https://repository.apache.org/content/repositories/snapshots/org/apache/myfaces/core/myfaces-core-project/2.2.4-SNAPSHOT/maven-metadata.xml
(834 B at 2.3 KB/sec)
[INFO]                                                                         
[INFO] ------------------------------------------------------------------------
[INFO] Building Apache MyFaces JSF-2.2 Core API 2.2.4-SNAPSHOT
[INFO] ------------------------------------------------------------------------
Downloading: http://repository.apache.org/snapshots/de/berlios/jsunit/jsunit-maven2-plugin/maven-metadata.xml
Downloading: http://repo.maven.apache.org/maven2/de/berlios/jsunit/jsunit-maven2-plugin/maven-metadata.xml
Downloaded: http://repo.maven.apache.org/maven2/de/berlios/jsunit/jsunit-maven2-plugin/maven-metadata.xml
(398 B at 1.7 KB/sec)
Downloading: http://repo.maven.apache.org/maven2/org/apache/myfaces/buildtools/myfaces-builder-plugin/1.0.10/myfaces-builder-plugin-1.0.10.pom
Downloaded: http://repo.maven.apache.org/maven2/org/apache/myfaces/buildtools/myfaces-builder-plugin/1.0.10/myfaces-builder-plugin-1.0.10.pom
(8 KB at 35.8 KB/sec)
Downloading: http://repo.maven.apache.org/maven2/org/apache/myfaces/buildtools/myfaces-builder-plugin/1.0.10/myfaces-builder-plugin-1.0.10.jar
Downloaded: http://repo.maven.apache.org/maven2/org/apache/myfaces/buildtools/myfaces-builder-plugin/1.0.10/myfaces-builder-plugin-1.0.10.jar
(369 KB at 865.9 KB/sec)
Downloading: http://repo.maven.apache.org/maven2/org/apache/felix/maven-bundle-plugin/2.1.0/maven-bundle-plugin-2.1.0.pom
Downloaded: http://repo.maven.apache.org/maven2/org/apache/felix/maven-bundle-plugin/2.1.0/maven-bundle-plugin-2.1.0.pom
(5 KB at 606.1 KB/sec)
Downloading: http://repo.maven.apache.org/maven2/org/apache/felix/maven-bundle-plugin/2.1.0/maven-bundle-plugin-2.1.0.jar
Downloaded: http://repo.maven.apache.org/maven2/org/apache/felix/maven-bundle-plugin/2.1.0/maven-bundle-plugin-2.1.0.jar
(130 KB at 11762.7 KB/sec)
Downloading: http://tomcat.apache.org/dev/dist/m2-repository/org/apache/myfaces/test/myfaces-test22/1.0.6/myfaces-test22-1.0.6.pom
Downloading: http://repo.maven.apache.org/maven2/org/apache/myfaces/test/myfaces-test22/1.0.6/myfaces-test22-1.0.6.pom
Downloaded: http://repo.maven.apache.org/maven2/org/apache/myfaces/test/myfaces-test22/1.0.6/myfaces-test22-1.0.6.pom
(10 KB at 26.1 KB/sec)
Downloading: http://tomcat.apache.org/dev/dist/m2-repository/org/apache/myfaces/test/myfaces-test-project/1.0.6/myfaces-test-project-1.0.6.pom
Downloading: http://repo.maven.apache.org/maven2/org/apache/myfaces/test/myfaces-test-project/1.0.6/myfaces-test-project-1.0.6.pom
Downloaded: http://repo.maven.apache.org/maven2/org/apache/myfaces/test/myfaces-test-project/1.0.6/myfaces-test-project-1.0.6.pom
(0 B at 0.0 KB/sec)
Downloading: http://tomcat.apache.org/dev/dist/m2-repository/org/apache/myfaces/myfaces/10/myfaces-10.pom
Downloading: http://repo.maven.apache.org/maven2/org/apache/myfaces/myfaces/10/myfaces-10.pom
Downloaded: http://repo.maven.apache.org/maven2/org/apache/myfaces/myfaces/10/myfaces-10.pom
(0 B at 0.0 KB/sec)
[WARNING] The POM for org.easymock:easymock:jar:2.3 is invalid, transitive dependencies (if
any) will not be available, enable debug logging for more details
[WARNING] The POM for org.easymock:easymockclassextension:jar:2.3 is invalid, transitive dependencies
(if any) will not be available, enable debug logging for more details
Downloading: http://tomcat.apache.org/dev/dist/m2-repository/jmock/jmock-cglib/1.2.0/jmock-cglib-1.2.0.pom
Downloading: http://repo.maven.apache.org/maven2/jmock/jmock-cglib/1.2.0/jmock-cglib-1.2.0.pom
Downloaded: http://repo.maven.apache.org/maven2/jmock/jmock-cglib/1.2.0/jmock-cglib-1.2.0.pom
(2 KB at 155.3 KB/sec)
Downloading: http://tomcat.apache.org/dev/dist/m2-repository/org/apache/myfaces/test/myfaces-test22/1.0.6/myfaces-test22-1.0.6.jar
Downloading: http://tomcat.apache.org/dev/dist/m2-repository/jmock/jmock-cglib/1.2.0/jmock-cglib-1.2.0.jar
Downloading: http://tomcat.apache.org/dev/dist/m2-repository/org/apache/maven/maven-plugin-api/2.0.5/maven-plugin-api-2.0.5.jar
Downloading: http://repo.maven.apache.org/maven2/org/apache/myfaces/test/myfaces-test22/1.0.6/myfaces-test22-1.0.6.jar
Downloading: http://repo.maven.apache.org/maven2/jmock/jmock-cglib/1.2.0/jmock-cglib-1.2.0.jar
Downloading: http://repo.maven.apache.org/maven2/org/apache/maven/maven-plugin-api/2.0.5/maven-plugin-api-2.0.5.jar
Downloaded: http://repo.maven.apache.org/maven2/jmock/jmock-cglib/1.2.0/jmock-cglib-1.2.0.jar
(4 KB at 294.5 KB/sec)
Downloaded: http://repo.maven.apache.org/maven2/org/apache/maven/maven-plugin-api/2.0.5/maven-plugin-api-2.0.5.jar
(13 KB at 261.7 KB/sec)
Downloaded: http://repo.maven.apache.org/maven2/org/apache/myfaces/test/myfaces-test22/1.0.6/myfaces-test22-1.0.6.jar
(277 KB at 1797.7 KB/sec)
[INFO] 
[INFO] --- maven-clean-plugin:2.5:clean (default-clean) @ myfaces-api ---
[INFO] 
[INFO] --- myfaces-builder-plugin:1.0.10:build-metadata (default) @ myfaces-api ---
Downloading: http://repo.maven.apache.org/maven2/logkit/logkit/2.0/logkit-2.0.pom
Downloaded: http://repo.maven.apache.org/maven2/logkit/logkit/2.0/logkit-2.0.pom (144 B at
1.6 KB/sec)
Downloading: http://repo.maven.apache.org/maven2/logkit/logkit/2.0/logkit-2.0.jar
Downloaded: http://repo.maven.apache.org/maven2/logkit/logkit/2.0/logkit-2.0.jar (80 KB at
5331.1 KB/sec)
log4j:WARN No appenders could be found for logger (org.apache.myfaces.buildtools.maven2.plugin.builder.qdox.QdoxModelBuilder).
log4j:WARN Please initialize the log4j system properly.
[INFO] 
[INFO] --- myfaces-builder-plugin:1.0.10:make-components (makecomp) @ myfaces-api ---
[INFO] Using template from file loader: <https://builds.apache.org/job/myfaces-current22-1/ws/current22/core/api/src/main/resources/META-INF/componentClass20.vm>
[WARNING] *******************************************************************
[WARNING] RuntimeInstance initializing.
[WARNING] Default ResourceManager initializing. (class org.apache.velocity.runtime.resource.ResourceManagerImpl)
[WARNING] FileResourceLoader : initialization starting.
[WARNING] FileResourceLoader : initialization complete.
[WARNING] RelativeClasspathResourceLoader : initialization complete.
[INFO] RelativeClasspathResourceLoader : adding path 'META-INF'
[WARNING] RelativeClasspathResourceLoader : initialization complete.
[WARNING] Default ResourceManager initialization complete.
[WARNING] Velocimacro : initialization starting.
[WARNING] Velocimacro : VM library registration complete.
[WARNING] Velocimacro : Velocimacro : initialization complete.
[WARNING] RuntimeInstance successfully initialized.
[INFO] Generating component class:javax.faces.component.UIMessage
[INFO] Generating component class:javax.faces.component.UIMessages
[INFO] Generating component class:javax.faces.component.UIParameter
[INFO] Generating component class:javax.faces.component.UISelectItem
[INFO] Generating component class:javax.faces.component.UISelectItems
[INFO] Generating component class:javax.faces.component.html.HtmlBody
[INFO] Generating component class:javax.faces.component.html.HtmlColumn
[INFO] Generating component class:javax.faces.component.html.HtmlCommandButton
[INFO] Generating component class:javax.faces.component.html.HtmlCommandLink
[INFO] Generating component class:javax.faces.component.html.HtmlDataTable
[INFO] Generating component class:javax.faces.component.html.HtmlDoctype
[INFO] Generating component class:javax.faces.component.html.HtmlForm
[INFO] Generating component class:javax.faces.component.html.HtmlGraphicImage
[INFO] Generating component class:javax.faces.component.html.HtmlHead
[INFO] Generating component class:javax.faces.component.html.HtmlInputFile
[INFO] Generating component class:javax.faces.component.html.HtmlInputSecret
[INFO] Generating component class:javax.faces.component.html.HtmlInputText
[INFO] Generating component class:javax.faces.component.html.HtmlInputTextarea
[INFO] Generating component class:javax.faces.component.html.HtmlMessage
[INFO] Generating component class:javax.faces.component.html.HtmlMessages
[INFO] Generating component class:javax.faces.component.html.HtmlOutcomeTargetButton
[INFO] Generating component class:javax.faces.component.html.HtmlOutcomeTargetLink
[INFO] Generating component class:javax.faces.component.html.HtmlOutputFormat
[INFO] Generating component class:javax.faces.component.html.HtmlOutputLabel
[INFO] Generating component class:javax.faces.component.html.HtmlOutputLink
[INFO] Generating component class:javax.faces.component.html.HtmlOutputText
[INFO] Generating component class:javax.faces.component.html.HtmlPanelGrid
[INFO] Generating component class:javax.faces.component.html.HtmlPanelGroup
[INFO] Generating component class:javax.faces.component.html.HtmlSelectBooleanCheckbox
[INFO] Generating component class:javax.faces.component.html.HtmlSelectManyCheckbox
[INFO] Generating component class:javax.faces.component.html.HtmlSelectManyListbox
[INFO] Generating component class:javax.faces.component.html.HtmlSelectManyMenu
[INFO] Generating component class:javax.faces.component.html.HtmlSelectOneListbox
[INFO] Generating component class:javax.faces.component.html.HtmlSelectOneMenu
[INFO] Generating component class:javax.faces.component.html.HtmlSelectOneRadio
[INFO] 
[INFO] --- maven-remote-resources-plugin:1.4:process (default) @ myfaces-api ---
[INFO] ------------------------------------------------------------------------
[INFO] Reactor Summary:
[INFO] 
[INFO] Apache MyFaces Shared For JSF 2.2 - Project ....... SUCCESS [41.957s]
[INFO] Apache MyFaces Shared For JSF 2.2 - Core Mirror ... SUCCESS [45.563s]
[INFO] MyFaces Shared Tomahawk ........................... SUCCESS [24.291s]
[INFO] Apache MyFaces JSF-2.2 Core Project ............... SUCCESS [13.277s]
[INFO] Apache MyFaces JSF-2.2 Core API ................... FAILURE [20.111s]
[INFO] Apache MyFaces Shared Public API For JSF 2.2 - Core  SKIPPED
[INFO] Apache MyFaces Core For JSF 2.2 - Shared .......... SKIPPED
[INFO] Apache MyFaces JSF-2.2 Core Impl .................. SKIPPED
[INFO] Apache MyFaces JSF-2.2 Core OSGi Bundle ........... SKIPPED
[INFO] Apache MyFaces JSF-2.2 Impl Test .................. SKIPPED
[INFO] Apache MyFaces JSF-2.2 Core Module ................ SKIPPED
[INFO] Apache MyFaces Composite Build .................... SKIPPED
[INFO] ------------------------------------------------------------------------
[INFO] BUILD FAILURE
[INFO] ------------------------------------------------------------------------
[INFO] Total time: 2:37.401s
[INFO] Finished at: Sun Jun 01 19:03:47 UTC 2014
[INFO] Final Memory: 65M/205M
[INFO] ------------------------------------------------------------------------
Waiting for Jenkins to finish collecting data
[ERROR] Failed to execute goal org.apache.maven.plugins:maven-remote-resources-plugin:1.4:process
(default) on project myfaces-api: Execution default of goal org.apache.maven.plugins:maven-remote-resources-plugin:1.4:process
failed: For artifact {null:null:null:jar}: The groupId cannot be empty. -> [Help 1]
[ERROR] 
[JENKINS] Archiving <https://builds.apache.org/job/myfaces-current22-1/ws/current22/shared/shared-tomahawk/pom.xml>
to org.apache.myfaces.shared/myfaces-shared-tomahawk/4.2.3-SNAPSHOT/myfaces-shared-tomahawk-4.2.3-SNAPSHOT.pom
[ERROR] To see the full stack trace of the errors, re-run Maven with the -e switch.
[JENKINS] Archiving <https://builds.apache.org/job/myfaces-current22-1/ws/current22/shared/shared-tomahawk/target/myfaces-shared-tomahawk-4.2.3-SNAPSHOT.jar>
to org.apache.myfaces.shared/myfaces-shared-tomahawk/4.2.3-20140601.190306-23/myfaces-shared-tomahawk-4.2.3-20140601.190306-23.jar
[ERROR] Re-run Maven using the -X switch to enable full debug logging.
[JENKINS] Archiving <https://builds.apache.org/job/myfaces-current22-1/ws/current22/shared/shared-tomahawk/target/myfaces-shared-tomahawk-4.2.3-SNAPSHOT-sources.jar>
to org.apache.myfaces.shared/myfaces-shared-tomahawk/4.2.3-20140601.190306-23/myfaces-shared-tomahawk-4.2.3-20140601.190306-23-sources.jar
[ERROR] 
[ERROR] For more information about the errors and possible solutions, please read the following
articles:
[ERROR] [Help 1] http://cwiki.apache.org/confluence/display/MAVEN/PluginExecutionException
[ERROR] 
[ERROR] After correcting the problems, you can resume the build with the command
[ERROR]   mvn <goals> -rf :myfaces-api
[JENKINS] Archiving <https://builds.apache.org/job/myfaces-current22-1/ws/current22/core/shared-public/pom.xml>
to org.apache.myfaces.core.internal/myfaces-impl-shared-public/2.2.4-SNAPSHOT/myfaces-impl-shared-public-2.2.4-SNAPSHOT.pom
[JENKINS] Archiving <https://builds.apache.org/job/myfaces-current22-1/ws/current22/core/impl-test/pom.xml>
to org.apache.myfaces.core/myfaces-impl-test/2.2.4-SNAPSHOT/myfaces-impl-test-2.2.4-SNAPSHOT.pom
[JENKINS] Archiving <https://builds.apache.org/job/myfaces-current22-1/ws/current22/core/impl/pom.xml>
to org.apache.myfaces.core/myfaces-impl/2.2.4-SNAPSHOT/myfaces-impl-2.2.4-SNAPSHOT.pom
[JENKINS] Archiving <https://builds.apache.org/job/myfaces-current22-1/ws/current22/shared/core/pom.xml>
to org.apache.myfaces.shared/myfaces-shared-core/4.2.3-SNAPSHOT/myfaces-shared-core-4.2.3-SNAPSHOT.pom
[JENKINS] Archiving <https://builds.apache.org/job/myfaces-current22-1/ws/current22/shared/core/target/myfaces-shared-core-4.2.3-SNAPSHOT.jar>
to org.apache.myfaces.shared/myfaces-shared-core/4.2.3-20140601.190241-24/myfaces-shared-core-4.2.3-20140601.190241-24.jar
[JENKINS] Archiving <https://builds.apache.org/job/myfaces-current22-1/ws/current22/shared/core/target/myfaces-shared-core-4.2.3-SNAPSHOT-sources.jar>
to org.apache.myfaces.shared/myfaces-shared-core/4.2.3-20140601.190241-24/myfaces-shared-core-4.2.3-20140601.190241-24-sources.jar
[JENKINS] Archiving <https://builds.apache.org/job/myfaces-current22-1/ws/current22/core/bundle/pom.xml>
to org.apache.myfaces.core/myfaces-bundle/2.2.4-SNAPSHOT/myfaces-bundle-2.2.4-SNAPSHOT.pom
[JENKINS] Archiving <https://builds.apache.org/job/myfaces-current22-1/ws/current22/core/api/pom.xml>
to org.apache.myfaces.core/myfaces-api/2.2.4-SNAPSHOT/myfaces-api-2.2.4-SNAPSHOT.pom
[JENKINS] Archiving <https://builds.apache.org/job/myfaces-current22-1/ws/current22/shared/pom.xml>
to org.apache.myfaces.shared/myfaces-shared-project/4.2.3-SNAPSHOT/myfaces-shared-project-4.2.3-SNAPSHOT.pom
[JENKINS] Archiving <https://builds.apache.org/job/myfaces-current22-1/ws/current22/shared/target/myfaces-shared-project-4.2.3-SNAPSHOT-site.xml>
to org.apache.myfaces.shared/myfaces-shared-project/4.2.3-20140601.190153-26/myfaces-shared-project-4.2.3-20140601.190153-26-site.xml
[JENKINS] Archiving <https://builds.apache.org/job/myfaces-current22-1/ws/current22/core/parent/pom.xml>
to org.apache.myfaces.core/myfaces-core-project/2.2.4-SNAPSHOT/myfaces-core-project-2.2.4-SNAPSHOT.pom
[JENKINS] Archiving <https://builds.apache.org/job/myfaces-current22-1/ws/current22/core/parent/target/myfaces-core-project-2.2.4-SNAPSHOT-site.xml>
to org.apache.myfaces.core/myfaces-core-project/2.2.4-20140601.190323-21/myfaces-core-project-2.2.4-20140601.190323-21-site.xml
[JENKINS] Archiving <https://builds.apache.org/job/myfaces-current22-1/ws/current22/core/pom.xml>
to org.apache.myfaces.core/myfaces-core-module/2.2.4-SNAPSHOT/myfaces-core-module-2.2.4-SNAPSHOT.pom
[JENKINS] Archiving <https://builds.apache.org/job/myfaces-current22-1/ws/current22/pom.xml>
to org.apache.myfaces/myfaces-base/2.2.0-SNAPSHOT/myfaces-base-2.2.0-SNAPSHOT.pom
[JENKINS] Archiving <https://builds.apache.org/job/myfaces-current22-1/ws/current22/core/shared/pom.xml>
to org.apache.myfaces.core.internal/myfaces-impl-shared/2.2.4-SNAPSHOT/myfaces-impl-shared-2.2.4-SNAPSHOT.pom
Sending e-mails to: commits@myfaces.apache.org grantsmith@apache.org
channel stopped

Mime
View raw message