myfaces-commits mailing list archives

Site index · List index
Message view « Date » · « Thread »
Top « Date » · « Thread »
From Apache Jenkins Server <jenk...@builds.apache.org>
Subject Build failed in Jenkins: myfaces-shared #401
Date Mon, 11 Aug 2014 00:28:53 GMT
See <https://builds.apache.org/job/myfaces-shared/401/>

------------------------------------------
[...truncated 406 lines...]
Running org.apache.myfaces.shared.util.MessageUtilsTest
currency ?100.00
Tests run: 11, Failures: 0, Errors: 0, Skipped: 0, Time elapsed: 0.061 sec
Running org.apache.myfaces.shared.util.SecretKeyConfigurationTest
Tests run: 4, Failures: 0, Errors: 0, Skipped: 0, Time elapsed: 0.006 sec
Running org.apache.myfaces.shared.util.CachedStateUtilsBlowfish_ECBTest
Tests run: 11, Failures: 0, Errors: 0, Skipped: 0, Time elapsed: 0.026 sec
Running org.apache.myfaces.shared.util.StateUtilsAES_CBCTest
Tests run: 11, Failures: 0, Errors: 0, Skipped: 0, Time elapsed: 0.014 sec
Running org.apache.myfaces.shared.util.CommentUtilsTest
Tests run: 5, Failures: 0, Errors: 0, Skipped: 0, Time elapsed: 0.004 sec
Running org.apache.myfaces.shared.util.CachedStateUtilsDefaultTest
Tests run: 11, Failures: 0, Errors: 0, Skipped: 0, Time elapsed: 0.016 sec
Running org.apache.myfaces.shared.renderkit.RendererUtilsTest
No Renderer found for component {Component-Path : [Class: javax.faces.component.html.HtmlGraphicImage,Id:
graphicImageId]} (component-family=javax.faces.Graphic, renderer-type=javax.faces.Image)
Aug 11, 2014 12:27:16 AM javax.faces.component.UIComponentBase getRenderer
WARNING: No Renderer found for component {Component-Path : [Class: javax.faces.component.html.HtmlGraphicImage,Id:
graphicImageId]} (component-family=javax.faces.Graphic, renderer-type=javax.faces.Image)
Tests run: 7, Failures: 0, Errors: 0, Skipped: 0, Time elapsed: 1.009 sec
Running org.apache.myfaces.shared.renderkit.html.HtmlResponseWriterImplTest
Tests run: 13, Failures: 0, Errors: 0, Skipped: 0, Time elapsed: 0.039 sec
Running org.apache.myfaces.shared.renderkit.html.HtmlRendererUtilsTest
No Renderer found for component {Component-Path : [Class: javax.faces.component.html.HtmlInputText,Id:
j_id__v_0]} (component-family=javax.faces.Input, renderer-type=javax.faces.Text)
Aug 11, 2014 12:27:17 AM javax.faces.component.UIComponentBase getRenderer
WARNING: No Renderer found for component {Component-Path : [Class: javax.faces.component.html.HtmlInputText,Id:
j_id__v_0]} (component-family=javax.faces.Input, renderer-type=javax.faces.Text)
Tests run: 2, Failures: 0, Errors: 0, Skipped: 0, Time elapsed: 0.019 sec
Running org.apache.myfaces.shared.renderkit.html.util.HTMLEncoderTest
Tests run: 26, Failures: 0, Errors: 0, Skipped: 0, Time elapsed: 0.021 sec

Results :

Tests run: 171, Failures: 0, Errors: 0, Skipped: 0

[JENKINS] Recording test results
[INFO] [jar:jar {execution: default-jar}]
[INFO] Building jar: <https://builds.apache.org/job/myfaces-shared/ws/trunk/core/target/myfaces-shared-core-4.2.4-SNAPSHOT.jar>
[INFO] Preparing source:jar
[WARNING] Removing: jar from forked lifecycle, to prevent recursive invocation.
[INFO] No goals needed for project - skipping
[INFO] [source:jar {execution: attach-source}]
[INFO] META-INF already added, skipping
[INFO] META-INF already added, skipping
[INFO] META-INF/LICENSE already added, skipping
[INFO] META-INF/NOTICE already added, skipping
[INFO] META-INF/DEPENDENCIES already added, skipping
[INFO] META-INF already added, skipping
[INFO] Building jar: <https://builds.apache.org/job/myfaces-shared/ws/trunk/core/target/myfaces-shared-core-4.2.4-SNAPSHOT-sources.jar>
[INFO] META-INF already added, skipping
[INFO] META-INF already added, skipping
[INFO] META-INF/LICENSE already added, skipping
[INFO] META-INF/NOTICE already added, skipping
[INFO] META-INF/DEPENDENCIES already added, skipping
[INFO] META-INF already added, skipping
[INFO] [checkstyle:check {execution: verify-style}]
[INFO] Starting audit...
Audit done.

[INFO] [install:install {execution: default-install}]
[INFO] Installing <https://builds.apache.org/job/myfaces-shared/ws/trunk/core/target/myfaces-shared-core-4.2.4-SNAPSHOT.jar>
to /home/jenkins/jenkins-slave/maven-repositories/1/org/apache/myfaces/shared/myfaces-shared-core/4.2.4-SNAPSHOT/myfaces-shared-core-4.2.4-SNAPSHOT.jar
[INFO] Installing <https://builds.apache.org/job/myfaces-shared/ws/trunk/core/target/myfaces-shared-core-4.2.4-SNAPSHOT-sources.jar>
to /home/jenkins/jenkins-slave/maven-repositories/1/org/apache/myfaces/shared/myfaces-shared-core/4.2.4-SNAPSHOT/myfaces-shared-core-4.2.4-SNAPSHOT-sources.jar
[INFO] [remote-resources:process {execution: default}]
[INFO] [build-helper:add-resource {execution: add-resource}]
[INFO] [myfaces-javascript:compile {execution: compile-myfacesscripts}]
[INFO] Reading assembler descriptor <https://builds.apache.org/job/myfaces-shared/ws/trunk/core/src/assembler/myfacesscripts-compiler.xml>
[INFO] [myfaces-javascript:compile {execution: compile-myfacesscripts-uncompressed}]
[INFO] Reading assembler descriptor <https://builds.apache.org/job/myfaces-shared/ws/trunk/core/src/assembler/myfacesscripts-uncompressed-compiler.xml>
[INFO] [myfaces-javascript:compress {execution: compress-myfacesscripts}]
[INFO] Compressing javascript using YahooUI
[INFO] ------------------------------------------------------------------------------

[WARNING] [WARNING] The variable i has already been declared in the same scope...
&&params!=null){for(var i ---> = <--- 0,param;(param=params[

[WARNING] [WARNING] The variable param has already been declared in the same scope...
){for(var i=0,param ---> ; <--- (param=params[i]);
[INFO] oamSubmit.js (5,742 bytes) ................................. compressed at 67%
[INFO] ------------------------------------------------------------------------------
[INFO] compression saved 3,868 bytes
[debug] execute contextualize
[INFO] [resources:resources {execution: default-resources}]
[INFO] Using 'UTF-8' encoding to copy filtered resources.
[INFO] Copying 3 resources
[INFO] Copying 3 resources
[INFO] Copying 2 resources
[INFO] Copying 3 resources
[INFO] Copying 2 resources
[INFO] [compiler:compile {execution: default-compile}]
[INFO] Nothing to compile - all classes are up to date
[debug] execute contextualize
[INFO] [resources:testResources {execution: default-testResources}]
[INFO] Using 'UTF-8' encoding to copy filtered resources.
[INFO] Copying 15 resources
[INFO] Copying 3 resources
[INFO] Copying 3 resources
[INFO] [compiler:testCompile {execution: default-testCompile}]
[INFO] Nothing to compile - all classes are up to date
[INFO] [surefire:test {execution: default-test}]
[INFO] Skipping execution of surefire because it has already been run for this configuration
[JENKINS] Recording test results
[INFO] [jar:jar {execution: default-jar}]
[INFO] Building jar: <https://builds.apache.org/job/myfaces-shared/ws/trunk/core/target/myfaces-shared-core-4.2.4-SNAPSHOT.jar>
[INFO] Preparing source:jar
[WARNING] Removing: jar from forked lifecycle, to prevent recursive invocation.
[INFO] No goals needed for project - skipping
[INFO] [source:jar {execution: attach-source}]
[INFO] META-INF already added, skipping
[INFO] META-INF/LICENSE already added, skipping
[INFO] META-INF/NOTICE already added, skipping
[INFO] META-INF/DEPENDENCIES already added, skipping
[INFO] META-INF already added, skipping
[INFO] META-INF already added, skipping
[INFO] META-INF/LICENSE already added, skipping
[INFO] META-INF/NOTICE already added, skipping
[INFO] META-INF/DEPENDENCIES already added, skipping
[INFO] META-INF already added, skipping
[INFO] META-INF already added, skipping
[INFO] META-INF/LICENSE already added, skipping
[INFO] META-INF/NOTICE already added, skipping
[INFO] META-INF/DEPENDENCIES already added, skipping
[INFO] META-INF already added, skipping
[INFO] META-INF/internal-resources already added, skipping
[INFO] META-INF/internal-resources/org.apache.myfaces already added, skipping
[INFO] META-INF/resources already added, skipping
[INFO] META-INF/resources/org.apache.myfaces already added, skipping
[INFO] META-INF/internal-resources/org.apache.myfaces/oamSubmit-uncompressed.js already added,
skipping
[INFO] META-INF/resources/org.apache.myfaces/oamSubmit.js already added, skipping
[INFO] Building jar: <https://builds.apache.org/job/myfaces-shared/ws/trunk/core/target/myfaces-shared-core-4.2.4-SNAPSHOT-sources.jar>
[INFO] META-INF already added, skipping
[INFO] META-INF/LICENSE already added, skipping
[INFO] META-INF/NOTICE already added, skipping
[INFO] META-INF/DEPENDENCIES already added, skipping
[INFO] META-INF already added, skipping
[INFO] META-INF already added, skipping
[INFO] META-INF/LICENSE already added, skipping
[INFO] META-INF/NOTICE already added, skipping
[INFO] META-INF/DEPENDENCIES already added, skipping
[INFO] META-INF already added, skipping
[INFO] META-INF already added, skipping
[INFO] META-INF/LICENSE already added, skipping
[INFO] META-INF/NOTICE already added, skipping
[INFO] META-INF/DEPENDENCIES already added, skipping
[INFO] META-INF already added, skipping
[INFO] META-INF/internal-resources already added, skipping
[INFO] META-INF/internal-resources/org.apache.myfaces already added, skipping
[INFO] META-INF/resources already added, skipping
[INFO] META-INF/resources/org.apache.myfaces already added, skipping
[INFO] META-INF/internal-resources/org.apache.myfaces/oamSubmit-uncompressed.js already added,
skipping
[INFO] META-INF/resources/org.apache.myfaces/oamSubmit.js already added, skipping
[INFO] [checkstyle:check {execution: verify-style}]
[INFO] Starting audit...
Audit done.

[INFO] [install:install {execution: default-install}]
[INFO] Installing <https://builds.apache.org/job/myfaces-shared/ws/trunk/core/target/myfaces-shared-core-4.2.4-SNAPSHOT.jar>
to /home/jenkins/jenkins-slave/maven-repositories/1/org/apache/myfaces/shared/myfaces-shared-core/4.2.4-SNAPSHOT/myfaces-shared-core-4.2.4-SNAPSHOT.jar
[INFO] Installing <https://builds.apache.org/job/myfaces-shared/ws/trunk/core/target/myfaces-shared-core-4.2.4-SNAPSHOT-sources.jar>
to /home/jenkins/jenkins-slave/maven-repositories/1/org/apache/myfaces/shared/myfaces-shared-core/4.2.4-SNAPSHOT/myfaces-shared-core-4.2.4-SNAPSHOT-sources.jar
[INFO] Installing <https://builds.apache.org/job/myfaces-shared/ws/trunk/core/target/myfaces-shared-core-4.2.4-SNAPSHOT-sources.jar>
to /home/jenkins/jenkins-slave/maven-repositories/1/org/apache/myfaces/shared/myfaces-shared-core/4.2.4-SNAPSHOT/myfaces-shared-core-4.2.4-SNAPSHOT-sources.jar
[INFO] [deploy:deploy {execution: default-deploy}]
[INFO] Retrieving previous build number from apache.snapshots.https
[WARNING] *** CHECKSUM FAILED - Checksum failed on download: local = '00e84ad31c4e8d05cf719fa66746b18c61ce79a9';
remote = 'd56c5844ad6470a347aae04172b3ffcba8002ca3' - RETRYING
[WARNING] *** CHECKSUM FAILED - Checksum failed on download: local = '00e84ad31c4e8d05cf719fa66746b18c61ce79a9';
remote = 'd56c5844ad6470a347aae04172b3ffcba8002ca3' - IGNORING
Uploading: https://repository.apache.org/content/repositories/snapshots/org/apache/myfaces/shared/myfaces-shared-core/4.2.4-SNAPSHOT/myfaces-shared-core-4.2.4-20140811.002703-131.jar
478K uploaded  (myfaces-shared-core-4.2.4-20140811.002703-131.jar)
[INFO] Retrieving previous metadata from apache.snapshots.https
[WARNING] *** CHECKSUM FAILED - Checksum failed on download: local = '00e84ad31c4e8d05cf719fa66746b18c61ce79a9';
remote = 'd56c5844ad6470a347aae04172b3ffcba8002ca3' - RETRYING
[WARNING] *** CHECKSUM FAILED - Checksum failed on download: local = '00e84ad31c4e8d05cf719fa66746b18c61ce79a9';
remote = 'd56c5844ad6470a347aae04172b3ffcba8002ca3' - IGNORING
[INFO] Uploading repository metadata for: 'snapshot org.apache.myfaces.shared:myfaces-shared-core:4.2.4-SNAPSHOT'
[INFO] Uploading project information for myfaces-shared-core 4.2.4-20140811.002703-131
[INFO] Retrieving previous metadata from apache.snapshots.https
[INFO] Uploading repository metadata for: 'artifact org.apache.myfaces.shared:myfaces-shared-core'
[INFO] Retrieving previous build number from apache.snapshots.https
Uploading: https://repository.apache.org/content/repositories/snapshots/org/apache/myfaces/shared/myfaces-shared-core/4.2.4-SNAPSHOT/myfaces-shared-core-4.2.4-20140811.002703-131-sources.jar
425K uploaded  (myfaces-shared-core-4.2.4-20140811.002703-131-sources.jar)
[INFO] Retrieving previous build number from apache.snapshots.https
Uploading: https://repository.apache.org/content/repositories/snapshots/org/apache/myfaces/shared/myfaces-shared-core/4.2.4-SNAPSHOT/myfaces-shared-core-4.2.4-20140811.002703-131-sources.jar
425K uploaded  (myfaces-shared-core-4.2.4-20140811.002703-131-sources.jar)
[INFO] ------------------------------------------------------------------------
[INFO] Building MyFaces Shared Tomahawk
[INFO]    task-segment: [clean, install, deploy]
[INFO] ------------------------------------------------------------------------
[INFO] [clean:clean {execution: default-clean}]
[INFO] [dependency:unpack {execution: unpack-sources}]
[INFO] Configured Artifact: org.apache.myfaces.shared:myfaces-shared-core:sources:4.2.4-SNAPSHOT:jar
[INFO] snapshot org.apache.myfaces.shared:myfaces-shared-core:4.2.4-SNAPSHOT: checking for
updates from apache-maven-snapshots
[INFO] snapshot org.apache.myfaces.shared:myfaces-shared-core:4.2.4-SNAPSHOT: checking for
updates from apache.snapshots
Downloading: http://repository.apache.org/snapshots/org/apache/myfaces/shared/myfaces-shared-core/4.2.4-SNAPSHOT/myfaces-shared-core-4.2.4-20140811.002735-130-sources.jar
[INFO] ------------------------------------------------------------------------
[ERROR] BUILD ERROR
[INFO] ------------------------------------------------------------------------
[INFO] Unable to find artifact.

Embedded error: Unable to locate resource in repository

Try downloading the file manually from the project website.

Then, install it using the command: 
    mvn install:install-file -DgroupId=org.apache.myfaces.shared -DartifactId=myfaces-shared-core
-Dversion=4.2.4-20140811.002735-130 -Dclassifier=sources -Dpackaging=jar -Dfile=/path/to/file

Alternatively, if you host your own repository you can deploy the file there: 
    mvn deploy:deploy-file -DgroupId=org.apache.myfaces.shared -DartifactId=myfaces-shared-core
-Dversion=4.2.4-20140811.002735-130 -Dclassifier=sources -Dpackaging=jar -Dfile=/path/to/file
-Durl=[url] -DrepositoryId=[id]


  org.apache.myfaces.shared:myfaces-shared-core:jar:4.2.4-20140811.002735-130

from the specified remote repositories:
  central (http://repo1.maven.org/maven2),
  apache-maven-snapshots (http://people.apache.org/repo/m2-snapshot-repository),
  Nexus (http://repository.apache.org/snapshots)


http://repository.apache.org/snapshots/org/apache/myfaces/shared/myfaces-shared-core/4.2.4-SNAPSHOT/myfaces-shared-core-4.2.4-20140811.002735-130-sources.jar
[INFO] ------------------------------------------------------------------------
[INFO] For more information, run Maven with the -e switch
[INFO] ------------------------------------------------------------------------
[INFO] Total time: 45 seconds
[INFO] Finished at: Mon Aug 11 00:27:38 UTC 2014
[INFO] Final Memory: 81M/409M
[INFO] ------------------------------------------------------------------------
[JENKINS] Archiving <https://builds.apache.org/job/myfaces-shared/ws/trunk/shared-tomahawk/pom.xml>
to org.apache.myfaces.shared/myfaces-shared-tomahawk/4.2.4-SNAPSHOT/myfaces-shared-tomahawk-4.2.4-SNAPSHOT.pom
Sending artifact delta relative to myfaces-shared ? MyFaces Shared Tomahawk #400
Archived 1 artifacts
Archive block size is 32768
Received 0 blocks and 7974 bytes
Compression is 0.0%
Took 0.2 sec
[JENKINS] Archiving <https://builds.apache.org/job/myfaces-shared/ws/trunk/core/pom.xml>
to org.apache.myfaces.shared/myfaces-shared-core/4.2.4-SNAPSHOT/myfaces-shared-core-4.2.4-SNAPSHOT.pom
[JENKINS] Archiving <https://builds.apache.org/job/myfaces-shared/ws/trunk/core/target/myfaces-shared-core-4.2.4-SNAPSHOT.jar>
to org.apache.myfaces.shared/myfaces-shared-core/4.2.4-20140811.002703-131/myfaces-shared-core-4.2.4-20140811.002703-131.jar
[JENKINS] Archiving <https://builds.apache.org/job/myfaces-shared/ws/trunk/core/target/myfaces-shared-core-4.2.4-SNAPSHOT-sources.jar>
to org.apache.myfaces.shared/myfaces-shared-core/4.2.4-20140811.002703-131/myfaces-shared-core-4.2.4-20140811.002703-131-sources.jar
Sending artifact delta relative to myfaces-shared ? Apache MyFaces Shared For JSF 2.2 - Core
Mirror #400
Archived 3 artifacts
Archive block size is 32768
Received 0 blocks and 938417 bytes
Compression is 0.0%
Took 2.3 sec
[JENKINS] Archiving <https://builds.apache.org/job/myfaces-shared/ws/trunk/pom.xml>
to org.apache.myfaces.shared/myfaces-shared-project/4.2.4-SNAPSHOT/myfaces-shared-project-4.2.4-SNAPSHOT.pom
[JENKINS] Archiving /home/jenkins/jenkins-slave/maven-repositories/1/org/apache/myfaces/shared/myfaces-shared-project/4.2.4-SNAPSHOT/myfaces-shared-project-4.2.4-SNAPSHOT.pom
to org.apache.myfaces.shared/myfaces-shared-project/4.2.4-20140811.002703-141/myfaces-shared-project-4.2.4-20140811.002703-141.pom
[JENKINS] Archiving <https://builds.apache.org/job/myfaces-shared/ws/trunk/target/myfaces-shared-project-4.2.4-SNAPSHOT-site.xml>
to org.apache.myfaces.shared/myfaces-shared-project/4.2.4-20140811.002703-141/myfaces-shared-project-4.2.4-20140811.002703-141-site.xml
/home/jenkins/jenkins-slave/maven-repositories/1/org/apache/myfaces/shared/myfaces-shared-project/4.2.4-SNAPSHOT/myfaces-shared-project-4.2.4-SNAPSHOT.pom
is not inside <https://builds.apache.org/job/myfaces-shared/ws/trunk/;> will archive
in a separate pass
Sending artifact delta relative to myfaces-shared ? Apache MyFaces Shared For JSF 2.2 - Project
#400
Archived 2 artifacts
Archive block size is 32768
Received 0 blocks and 11131 bytes
Compression is 0.0%
Took 0.19 sec
Sending artifact delta relative to myfaces-shared ? Apache MyFaces Shared For JSF 2.2 - Project
#400
Archived 1 artifacts
Archive block size is 32768
Received 0 blocks and 8586 bytes
Compression is 0.0%
Took 36 ms
channel stopped

Mime
View raw message