myfaces-commits mailing list archives

Site index · List index
Message view « Date » · « Thread »
Top « Date » · « Thread »
From Apache Jenkins Server <jenk...@builds.apache.org>
Subject Build failed in Jenkins: myfaces-current22-1 #1427
Date Wed, 13 Aug 2014 13:20:38 GMT
See <https://builds.apache.org/job/myfaces-current22-1/1427/>

------------------------------------------
[...truncated 3019 lines...]
[INFO] Apache MyFaces Shared For JSF 2.2 - Core Mirror ... SUCCESS [0.301s]
[INFO] MyFaces Shared Tomahawk ........................... SUCCESS [0.062s]
[INFO] Apache MyFaces JSF-2.2 Core Project ............... SUCCESS [0.458s]
[INFO] Apache MyFaces JSF-2.2 Core API ................... SUCCESS [1:04.821s]
[INFO] Apache MyFaces Shared Public API For JSF 2.2 - Core  SUCCESS [0.079s]
[INFO] Apache MyFaces Core For JSF 2.2 - Shared .......... SUCCESS [0.088s]
[INFO] Apache MyFaces JSF-2.2 Core Impl .................. SUCCESS [0.359s]
[INFO] Apache MyFaces JSF-2.2 Core OSGi Bundle ........... SUCCESS [0.049s]
[INFO] Apache MyFaces JSF-2.2 Impl Test .................. SUCCESS [0.075s]
[INFO] Apache MyFaces JSF-2.2 Core Module ................ SUCCESS [0.015s]
[INFO] Apache MyFaces Composite Build .................... SUCCESS [1.262s]
[INFO] ------------------------------------------------------------------------
[INFO] BUILD SUCCESS
[INFO] ------------------------------------------------------------------------
[INFO] Total time: 1:18.526s
[INFO] Finished at: Wed Aug 13 13:18:40 UTC 2014
[INFO] Final Memory: 11M/122M
[INFO] ------------------------------------------------------------------------
Parsing POMs
maven3-agent.jar already up to date
maven3-interceptor.jar already up to date
maven3-interceptor-commons.jar already up to date
[current22] $ /home/jenkins/tools/java/latest1.6/bin/java -Xmx2048m -Xms128m -XX:MaxPermSize=256m
-cp /home/jenkins/jenkins-slave/maven3-agent.jar:/home/jenkins/tools/maven/apache-maven-3.0.4/boot/plexus-classworlds-2.4.jar
org.jvnet.hudson.maven3.agent.Maven3Main /home/jenkins/tools/maven/apache-maven-3.0.4 /x1/jenkins/jenkins-slave/slave.jar
/home/jenkins/jenkins-slave/maven3-interceptor.jar /home/jenkins/jenkins-slave/maven3-interceptor-commons.jar
36968
<===[JENKINS REMOTING CAPACITY]===>   channel started
log4j:WARN No appenders could be found for logger (org.apache.commons.beanutils.converters.BooleanConverter).
log4j:WARN Please initialize the log4j system properly.
Executing Maven:  -B -f <https://builds.apache.org/job/myfaces-current22-1/ws/current22/pom.xml>
-Dmaven.repo.local=/home/jenkins/jenkins-slave/maven-repositories/1 clean install deploy
[INFO] Scanning for projects...
[WARNING] 
[WARNING] Some problems were encountered while building the effective model for org.apache.myfaces.shared:myfaces-shared-core:jar:4.2.4-SNAPSHOT
[WARNING] 'reporting.plugins.plugin.version' for org.codehaus.mojo:jxr-maven-plugin is missing.
@ line 264, column 15
[WARNING] 
[WARNING] Some problems were encountered while building the effective model for org.apache.myfaces.shared:myfaces-shared-project:pom:4.2.4-SNAPSHOT
[WARNING] 'parent.relativePath' points at org.apache.myfaces:myfaces-base instead of org.apache.myfaces:myfaces,
please verify your project structure @ line 39, column 11
[WARNING] 
[WARNING] Some problems were encountered while building the effective model for org.apache.myfaces.core:myfaces-core-project:pom:2.2.5-SNAPSHOT
[WARNING] 'reporting.plugins.plugin.version' for org.codehaus.mojo:cobertura-maven-plugin
is missing. @ line 315, column 21
[WARNING] 
[WARNING] Some problems were encountered while building the effective model for org.apache.myfaces.core:myfaces-api:jar:2.2.5-SNAPSHOT
[WARNING] 'build.plugins.plugin.version' for de.berlios.jsunit:jsunit-maven2-plugin is missing.
@ line 308, column 21
[WARNING] 'reporting.plugins.plugin.version' for org.codehaus.mojo:cobertura-maven-plugin
is missing. @ org.apache.myfaces.core:myfaces-core-project:2.2.5-SNAPSHOT, <https://builds.apache.org/job/myfaces-current22-1/ws/current22/core/parent/pom.xml,>
line 315, column 21
[WARNING] 'reporting.plugins.plugin.version' for org.apache.maven.plugins:maven-javadoc-plugin
is missing. @ line 691, column 21
[WARNING] 'reporting.plugins.plugin.version' for org.apache.maven.plugins:maven-changelog-plugin
is missing. @ line 701, column 21
[WARNING] 'reporting.plugins.plugin.version' for org.apache.maven.plugins:maven-jxr-plugin
is missing. @ line 719, column 21
[WARNING] 'reporting.plugins.plugin.version' for org.apache.maven.plugins:maven-surefire-report-plugin
is missing. @ line 723, column 21
[WARNING] 'reporting.plugins.plugin.version' for org.codehaus.mojo:taglist-maven-plugin is
missing. @ line 727, column 21
[WARNING] 
[WARNING] Some problems were encountered while building the effective model for org.apache.myfaces.core.internal:myfaces-impl-shared-public:jar:2.2.5-SNAPSHOT
[WARNING] 'reporting.plugins.plugin.version' for org.codehaus.mojo:cobertura-maven-plugin
is missing. @ org.apache.myfaces.core:myfaces-core-project:2.2.5-SNAPSHOT, <https://builds.apache.org/job/myfaces-current22-1/ws/current22/core/parent/pom.xml,>
line 315, column 21
[WARNING] 'reporting.plugins.plugin.version' for org.apache.maven.plugins:maven-javadoc-plugin
is missing. @ line 141, column 15
[WARNING] 'reporting.plugins.plugin.version' for org.apache.maven.plugins:maven-jxr-plugin
is missing. @ line 144, column 15
[WARNING] 'reporting.plugins.plugin.version' for org.apache.maven.plugins:maven-changelog-plugin
is missing. @ line 147, column 15
[WARNING] 'reporting.plugins.plugin.version' for org.codehaus.mojo:taglist-maven-plugin is
missing. @ line 170, column 15
[WARNING] 
[WARNING] Some problems were encountered while building the effective model for org.apache.myfaces.core.internal:myfaces-impl-shared:jar:2.2.5-SNAPSHOT
[WARNING] 'reporting.plugins.plugin.version' for org.codehaus.mojo:cobertura-maven-plugin
is missing. @ org.apache.myfaces.core:myfaces-core-project:2.2.5-SNAPSHOT, <https://builds.apache.org/job/myfaces-current22-1/ws/current22/core/parent/pom.xml,>
line 315, column 21
[WARNING] 'reporting.plugins.plugin.version' for org.apache.maven.plugins:maven-javadoc-plugin
is missing. @ line 257, column 15
[WARNING] 'reporting.plugins.plugin.version' for org.apache.maven.plugins:maven-jxr-plugin
is missing. @ line 260, column 15
[WARNING] 'reporting.plugins.plugin.version' for org.apache.maven.plugins:maven-changelog-plugin
is missing. @ line 263, column 15
[WARNING] 'reporting.plugins.plugin.version' for org.codehaus.mojo:taglist-maven-plugin is
missing. @ line 286, column 15
[WARNING] 
[WARNING] Some problems were encountered while building the effective model for org.apache.myfaces.core:myfaces-impl:jar:2.2.5-SNAPSHOT
[WARNING] 'build.plugins.plugin.(groupId:artifactId)' must be unique but found duplicate declaration
of plugin org.apache.maven.plugins:maven-jar-plugin @ line 522, column 21
[WARNING] 'reporting.plugins.plugin.version' for org.codehaus.mojo:cobertura-maven-plugin
is missing. @ org.apache.myfaces.core:myfaces-core-project:2.2.5-SNAPSHOT, <https://builds.apache.org/job/myfaces-current22-1/ws/current22/core/parent/pom.xml,>
line 315, column 21
[WARNING] 'reporting.plugins.plugin.version' for org.apache.maven.plugins:maven-javadoc-plugin
is missing. @ line 1250, column 21
[WARNING] 'reporting.plugins.plugin.version' for org.apache.maven.plugins:maven-changelog-plugin
is missing. @ line 1256, column 21
[WARNING] 'reporting.plugins.plugin.version' for org.apache.maven.plugins:maven-jxr-plugin
is missing. @ line 1274, column 21
[WARNING] 'reporting.plugins.plugin.version' for org.apache.maven.plugins:maven-surefire-report-plugin
is missing. @ line 1278, column 21
[WARNING] 'reporting.plugins.plugin.version' for org.codehaus.mojo:taglist-maven-plugin is
missing. @ line 1282, column 21
[WARNING] 
[WARNING] Some problems were encountered while building the effective model for org.apache.myfaces.core:myfaces-bundle:bundle:2.2.5-SNAPSHOT
[WARNING] 'reporting.plugins.plugin.version' for org.codehaus.mojo:cobertura-maven-plugin
is missing. @ org.apache.myfaces.core:myfaces-core-project:2.2.5-SNAPSHOT, <https://builds.apache.org/job/myfaces-current22-1/ws/current22/core/parent/pom.xml,>
line 315, column 21
[WARNING] 
[WARNING] Some problems were encountered while building the effective model for org.apache.myfaces.core:myfaces-impl-test:jar:2.2.5-SNAPSHOT
[WARNING] 'reporting.plugins.plugin.version' for org.codehaus.mojo:cobertura-maven-plugin
is missing. @ org.apache.myfaces.core:myfaces-core-project:2.2.5-SNAPSHOT, <https://builds.apache.org/job/myfaces-current22-1/ws/current22/core/parent/pom.xml,>
line 315, column 21
[WARNING] 
[WARNING] It is highly recommended to fix these problems because they threaten the stability
of your build.
[WARNING] 
[WARNING] For this reason, future Maven versions might no longer support building such malformed
projects.
[WARNING] 
[INFO] ------------------------------------------------------------------------
[INFO] Reactor Build Order:
[INFO] 
[INFO] Apache MyFaces Shared For JSF 2.2 - Project
[INFO] Apache MyFaces Shared For JSF 2.2 - Core Mirror
[INFO] MyFaces Shared Tomahawk
[INFO] Apache MyFaces JSF-2.2 Core Project
[INFO] Apache MyFaces JSF-2.2 Core API
[INFO] Apache MyFaces Shared Public API For JSF 2.2 - Core
[INFO] Apache MyFaces Core For JSF 2.2 - Shared
[INFO] Apache MyFaces JSF-2.2 Core Impl
[INFO] Apache MyFaces JSF-2.2 Core OSGi Bundle
[INFO] Apache MyFaces JSF-2.2 Impl Test
[INFO] Apache MyFaces JSF-2.2 Core Module
[INFO] Apache MyFaces Composite Build
[INFO]                                                                         
[INFO] ------------------------------------------------------------------------
[INFO] Building Apache MyFaces Shared For JSF 2.2 - Project 4.2.4-SNAPSHOT
[INFO] ------------------------------------------------------------------------
[INFO] 
[INFO] --- maven-clean-plugin:2.5:clean (default-clean) @ myfaces-shared-project ---
[INFO] 
[INFO] --- maven-remote-resources-plugin:1.4:process (default) @ myfaces-shared-project ---
[INFO] 
[INFO] --- maven-site-plugin:3.2:attach-descriptor (attach-descriptor) @ myfaces-shared-project
---
[INFO] 
[INFO] --- maven-checkstyle-plugin:2.6:check (verify-style) @ myfaces-shared-project ---
[INFO] Starting audit...
Audit done.

[INFO] 
[INFO] --- maven-install-plugin:2.3.1:install (default-install) @ myfaces-shared-project ---
[INFO] Installing <https://builds.apache.org/job/myfaces-current22-1/ws/current22/shared/pom.xml>
to /home/jenkins/jenkins-slave/maven-repositories/1/org/apache/myfaces/shared/myfaces-shared-project/4.2.4-SNAPSHOT/myfaces-shared-project-4.2.4-SNAPSHOT.pom
[INFO] Installing <https://builds.apache.org/job/myfaces-current22-1/ws/current22/shared/target/myfaces-shared-project-4.2.4-SNAPSHOT-site.xml>
to /home/jenkins/jenkins-slave/maven-repositories/1/org/apache/myfaces/shared/myfaces-shared-project/4.2.4-SNAPSHOT/myfaces-shared-project-4.2.4-SNAPSHOT-site.xml
[INFO] 
[INFO] --- maven-remote-resources-plugin:1.4:process (default) @ myfaces-shared-project ---
[INFO] 
[INFO] --- maven-site-plugin:3.2:attach-descriptor (attach-descriptor) @ myfaces-shared-project
---
[WARNING] Artifact org.apache.myfaces.shared:myfaces-shared-project:xml:site:4.2.4-SNAPSHOT
already attached to project, ignoring duplicate
[INFO] 
[INFO] --- maven-checkstyle-plugin:2.6:check (verify-style) @ myfaces-shared-project ---
[INFO] Starting audit...
Audit done.

[INFO] 
[INFO] --- maven-install-plugin:2.3.1:install (default-install) @ myfaces-shared-project ---
[INFO] Installing <https://builds.apache.org/job/myfaces-current22-1/ws/current22/shared/pom.xml>
to /home/jenkins/jenkins-slave/maven-repositories/1/org/apache/myfaces/shared/myfaces-shared-project/4.2.4-SNAPSHOT/myfaces-shared-project-4.2.4-SNAPSHOT.pom
[INFO] Installing <https://builds.apache.org/job/myfaces-current22-1/ws/current22/shared/target/myfaces-shared-project-4.2.4-SNAPSHOT-site.xml>
to /home/jenkins/jenkins-slave/maven-repositories/1/org/apache/myfaces/shared/myfaces-shared-project/4.2.4-SNAPSHOT/myfaces-shared-project-4.2.4-SNAPSHOT-site.xml
[INFO] 
[INFO] --- maven-deploy-plugin:2.7:deploy (default-deploy) @ myfaces-shared-project ---
Downloading: https://repository.apache.org/content/repositories/snapshots/org/apache/myfaces/shared/myfaces-shared-project/4.2.4-SNAPSHOT/maven-metadata.xml
[WARNING] Could not transfer metadata org.apache.myfaces.shared:myfaces-shared-project:4.2.4-SNAPSHOT/maven-metadata.xml
from/to apache.snapshots.https (https://repository.apache.org/content/repositories/snapshots):
Failed to transfer file: https://repository.apache.org/content/repositories/snapshots/org/apache/myfaces/shared/myfaces-shared-project/4.2.4-SNAPSHOT/maven-metadata.xml.
Return code is: 502, ReasonPhrase:Proxy Error.
[INFO] ------------------------------------------------------------------------
[INFO] Reactor Summary:
[INFO] 
[INFO] Apache MyFaces Shared For JSF 2.2 - Project ....... FAILURE [1:35.645s]
[INFO] Apache MyFaces Shared For JSF 2.2 - Core Mirror ... SKIPPED
[INFO] MyFaces Shared Tomahawk ........................... SKIPPED
[INFO] Apache MyFaces JSF-2.2 Core Project ............... SKIPPED
[INFO] Apache MyFaces JSF-2.2 Core API ................... SKIPPED
[INFO] Apache MyFaces Shared Public API For JSF 2.2 - Core  SKIPPED
[INFO] Apache MyFaces Core For JSF 2.2 - Shared .......... SKIPPED
[INFO] Apache MyFaces JSF-2.2 Core Impl .................. SKIPPED
[INFO] Apache MyFaces JSF-2.2 Core OSGi Bundle ........... SKIPPED
[INFO] Apache MyFaces JSF-2.2 Impl Test .................. SKIPPED
[INFO] Apache MyFaces JSF-2.2 Core Module ................ SKIPPED
[INFO] Apache MyFaces Composite Build .................... SKIPPED
[INFO] ------------------------------------------------------------------------
[INFO] BUILD FAILURE
[INFO] ------------------------------------------------------------------------
[INFO] Total time: 1:37.591s
[INFO] Finished at: Wed Aug 13 13:20:26 UTC 2014
[INFO] Final Memory: 18M/139M
[INFO] ------------------------------------------------------------------------
Waiting for Jenkins to finish collecting data
[ERROR] Failed to execute goal org.apache.maven.plugins:maven-deploy-plugin:2.7:deploy (default-deploy)
on project myfaces-shared-project: Failed to retrieve remote metadata org.apache.myfaces.shared:myfaces-shared-project:4.2.4-SNAPSHOT/maven-metadata.xml:
Could not transfer metadata org.apache.myfaces.shared:myfaces-shared-project:4.2.4-SNAPSHOT/maven-metadata.xml
from/to apache.snapshots.https (https://repository.apache.org/content/repositories/snapshots):
Failed to transfer file: https://repository.apache.org/content/repositories/snapshots/org/apache/myfaces/shared/myfaces-shared-project/4.2.4-SNAPSHOT/maven-metadata.xml.
Return code is: 502, ReasonPhrase:Proxy Error. -> [Help 1]
[ERROR] 
[ERROR] To see the full stack trace of the errors, re-run Maven with the -e switch.
[ERROR] Re-run Maven using the -X switch to enable full debug logging.
[ERROR] 
[ERROR] For more information about the errors and possible solutions, please read the following
articles:
[ERROR] [Help 1] http://cwiki.apache.org/confluence/display/MAVEN/MojoExecutionException
[JENKINS] Archiving <https://builds.apache.org/job/myfaces-current22-1/ws/current22/shared/shared-tomahawk/pom.xml>
to org.apache.myfaces.shared/myfaces-shared-tomahawk/4.2.4-SNAPSHOT/myfaces-shared-tomahawk-4.2.4-SNAPSHOT.pom
Sending artifact delta relative to myfaces-current22-1 ? MyFaces Shared Tomahawk #1426
Archived 1 artifacts
Archive block size is 32768
Received 0 blocks and 7974 bytes
Compression is 0.0%
Took 92 ms
[JENKINS] Archiving <https://builds.apache.org/job/myfaces-current22-1/ws/current22/core/shared-public/pom.xml>
to org.apache.myfaces.core.internal/myfaces-impl-shared-public/2.2.5-SNAPSHOT/myfaces-impl-shared-public-2.2.5-SNAPSHOT.pom
Sending artifact delta relative to myfaces-current22-1 ? Apache MyFaces Shared Public API
For JSF 2.2 - Core #1426
Archived 1 artifacts
Archive block size is 32768
Received 0 blocks and 7047 bytes
Compression is 0.0%
Took 58 ms
[JENKINS] Archiving <https://builds.apache.org/job/myfaces-current22-1/ws/current22/core/impl-test/pom.xml>
to org.apache.myfaces.core/myfaces-impl-test/2.2.5-SNAPSHOT/myfaces-impl-test-2.2.5-SNAPSHOT.pom
Sending artifact delta relative to myfaces-current22-1 ? Apache MyFaces JSF-2.2 Impl Test
#1426
Archived 1 artifacts
Archive block size is 32768
Received 0 blocks and 9288 bytes
Compression is 0.0%
Took 46 ms
[JENKINS] Archiving <https://builds.apache.org/job/myfaces-current22-1/ws/current22/core/impl/pom.xml>
to org.apache.myfaces.core/myfaces-impl/2.2.5-SNAPSHOT/myfaces-impl-2.2.5-SNAPSHOT.pom
Sending artifact delta relative to myfaces-current22-1 ? Apache MyFaces JSF-2.2 Core Impl
#1426
Archived 1 artifacts
Archive block size is 32768
Received 1 blocks and 29632 bytes
Compression is 52.5%
Took 2.1 sec
[JENKINS] Archiving <https://builds.apache.org/job/myfaces-current22-1/ws/current22/shared/core/pom.xml>
to org.apache.myfaces.shared/myfaces-shared-core/4.2.4-SNAPSHOT/myfaces-shared-core-4.2.4-SNAPSHOT.pom
Sending artifact delta relative to myfaces-current22-1 ? Apache MyFaces Shared For JSF 2.2
- Core Mirror #1426
Archived 1 artifacts
Archive block size is 32768
Received 0 blocks and 12498 bytes
Compression is 0.0%
Took 0.36 sec
[JENKINS] Archiving <https://builds.apache.org/job/myfaces-current22-1/ws/current22/core/bundle/pom.xml>
to org.apache.myfaces.core/myfaces-bundle/2.2.5-SNAPSHOT/myfaces-bundle-2.2.5-SNAPSHOT.pom
Sending artifact delta relative to myfaces-current22-1 ? Apache MyFaces JSF-2.2 Core OSGi
Bundle #1426
Archived 1 artifacts
Archive block size is 32768
Received 0 blocks and 8555 bytes
Compression is 0.0%
Took 0.27 sec
[JENKINS] Archiving <https://builds.apache.org/job/myfaces-current22-1/ws/current22/core/api/pom.xml>
to org.apache.myfaces.core/myfaces-api/2.2.5-SNAPSHOT/myfaces-api-2.2.5-SNAPSHOT.pom
Sending artifact delta relative to myfaces-current22-1 ? Apache MyFaces JSF-2.2 Core API #1426
Archived 1 artifacts
Archive block size is 32768
Received 0 blocks and 33461 bytes
Compression is 0.0%
Took 0.18 sec
[JENKINS] Archiving <https://builds.apache.org/job/myfaces-current22-1/ws/current22/shared/pom.xml>
to org.apache.myfaces.shared/myfaces-shared-project/4.2.4-SNAPSHOT/myfaces-shared-project-4.2.4-SNAPSHOT.pom
[JENKINS] Archiving <https://builds.apache.org/job/myfaces-current22-1/ws/current22/shared/target/myfaces-shared-project-4.2.4-SNAPSHOT-site.xml>
to org.apache.myfaces.shared/myfaces-shared-project/4.2.4-SNAPSHOT/myfaces-shared-project-4.2.4-SNAPSHOT-site.xml
Sending artifact delta relative to myfaces-current22-1 ? Apache MyFaces Shared For JSF 2.2
- Project #1426
Archived 2 artifacts
Archive block size is 32768
Received 0 blocks and 11108 bytes
Compression is 0.0%
Took 90 ms
[JENKINS] Archiving <https://builds.apache.org/job/myfaces-current22-1/ws/current22/core/parent/pom.xml>
to org.apache.myfaces.core/myfaces-core-project/2.2.5-SNAPSHOT/myfaces-core-project-2.2.5-SNAPSHOT.pom
Sending artifact delta relative to myfaces-current22-1 ? Apache MyFaces JSF-2.2 Core Project
#1426
Archived 1 artifacts
Archive block size is 32768
Received 0 blocks and 25776 bytes
Compression is 0.0%
Took 0.11 sec
[JENKINS] Archiving <https://builds.apache.org/job/myfaces-current22-1/ws/current22/core/pom.xml>
to org.apache.myfaces.core/myfaces-core-module/2.2.5-SNAPSHOT/myfaces-core-module-2.2.5-SNAPSHOT.pom
Sending artifact delta relative to myfaces-current22-1 ? Apache MyFaces JSF-2.2 Core Module
#1426
Archived 1 artifacts
Archive block size is 32768
Received 0 blocks and 8428 bytes
Compression is 0.0%
Took 1.6 sec
[JENKINS] Archiving <https://builds.apache.org/job/myfaces-current22-1/ws/current22/pom.xml>
to org.apache.myfaces/myfaces-base/2.2.0-SNAPSHOT/myfaces-base-2.2.0-SNAPSHOT.pom
Sending artifact delta relative to myfaces-current22-1 ? Apache MyFaces Composite Build #1426
Archived 1 artifacts
Archive block size is 32768
Received 0 blocks and 2225 bytes
Compression is 0.0%
Took 30 ms
[JENKINS] Archiving <https://builds.apache.org/job/myfaces-current22-1/ws/current22/core/shared/pom.xml>
to org.apache.myfaces.core.internal/myfaces-impl-shared/2.2.5-SNAPSHOT/myfaces-impl-shared-2.2.5-SNAPSHOT.pom
Sending artifact delta relative to myfaces-current22-1 ? Apache MyFaces Core For JSF 2.2 -
Shared #1426
Archived 1 artifacts
Archive block size is 32768
Received 0 blocks and 11915 bytes
Compression is 0.0%
Took 85 ms
Sending e-mails to: commits@myfaces.apache.org grantsmith@apache.org
channel stopped

Mime
View raw message