myfaces-commits mailing list archives

Site index · List index
Message view « Date » · « Thread »
Top « Date » · « Thread »
From Apache Jenkins Server <jenk...@builds.apache.org>
Subject Build failed in Jenkins: tobago-1.0.x-deploy #733
Date Wed, 08 Oct 2014 23:23:31 GMT
See <https://builds.apache.org/job/tobago-1.0.x-deploy/733/>

------------------------------------------
[...truncated 2557 lines...]
25K uploaded  (maven-apt-plugin-1.0.42-SNAPSHOT.jar)
[INFO] Retrieving previous metadata from apache.snapshots.https
[INFO] Uploading repository metadata for: 'org.apache.myfaces.tobago'
[INFO] Uploading project information for maven-apt-plugin 1.0.42-SNAPSHOT
[INFO] Retrieving previous metadata from apache.snapshots.https
[INFO] Uploading repository metadata for: 'artifact org.apache.myfaces.tobago:maven-apt-plugin'
[INFO] Retrieving previous metadata from apache.snapshots.https
[INFO] Uploading repository metadata for: 'snapshot org.apache.myfaces.tobago:maven-apt-plugin:1.0.42-SNAPSHOT'
[INFO] Retrieving previous build number from apache.snapshots.https
Uploading: https://repository.apache.org/content/repositories/snapshots/org/apache/myfaces/tobago/maven-apt-plugin/1.0.42-SNAPSHOT/maven-apt-plugin-1.0.42-SNAPSHOT-sources.jar
15K uploaded  (maven-apt-plugin-1.0.42-SNAPSHOT-sources.jar)
[INFO] ------------------------------------------------------------------------
[INFO] Building Maven Tobago Theme Plugin
[INFO]    task-segment: [clean, source:jar, deploy]
[INFO] ------------------------------------------------------------------------
[INFO] [clean:clean {execution: default-clean}]
[INFO] Preparing source:jar
[INFO] [buildnumber:create {execution: default}]
ERROR: Could not find local repository for 2.2.1
[INFO] [source:jar {execution: default-cli}]
[INFO] Building jar: <https://builds.apache.org/job/tobago-1.0.x-deploy/ws/tobago-1.0.x-deploy/tobago-tool/maven-theme-plugin/target/maven-theme-plugin-1.0.42-SNAPSHOT-sources.jar>
[INFO] [buildnumber:create {execution: default}]
[INFO] [plugin:descriptor {execution: default-descriptor}]
[INFO] Using 'UTF-8' encoding to read mojo metadata.
[INFO] Applying mojo extractor for language: java
[WARNING] org.apache.myfaces.tobago.maven.plugin.PackThemeMojo#archiver:
[WARNING]   The syntax
[WARNING]     @parameter expression="${component.<role>#<roleHint>}"
[WARNING]   is deprecated, please use
[WARNING]     @component role="<role>" roleHint="<roleHint>"
[WARNING]   instead.
[WARNING] org.apache.myfaces.tobago.maven.plugin.UnPackThemeMojo#archiverManager:
[WARNING]   The syntax
[WARNING]     @parameter expression="${component.<role>#<roleHint>}"
[WARNING]   is deprecated, please use
[WARNING]     @component role="<role>" roleHint="<roleHint>"
[WARNING]   instead.
[INFO] Mojo extractor for language: java found 2 mojo descriptors.
[INFO] Applying mojo extractor for language: bsh
[INFO] Mojo extractor for language: bsh found 0 mojo descriptors.
[INFO] [remote-resources:process {execution: default}]
[INFO] [resources:resources {execution: default-resources}]
[INFO] Using 'UTF-8' encoding to copy filtered resources.
[INFO] Copying 2 resources
[INFO] Copying 3 resources
[INFO] [compiler:compile {execution: default-compile}]
[INFO] Compiling 3 source files to <https://builds.apache.org/job/tobago-1.0.x-deploy/ws/tobago-1.0.x-deploy/tobago-tool/maven-theme-plugin/target/classes>
[INFO] [resources:testResources {execution: default-testResources}]
[INFO] Using 'UTF-8' encoding to copy filtered resources.
[INFO] skip non existing resourceDirectory <https://builds.apache.org/job/tobago-1.0.x-deploy/ws/tobago-1.0.x-deploy/tobago-tool/maven-theme-plugin/src/test/resources>
[INFO] Copying 3 resources
[INFO] [compiler:testCompile {execution: default-testCompile}]
[INFO] No sources to compile
[INFO] [surefire:test {execution: default-test}]
[INFO] Surefire report directory: <https://builds.apache.org/job/tobago-1.0.x-deploy/ws/tobago-1.0.x-deploy/tobago-tool/maven-theme-plugin/target/surefire-reports>

-------------------------------------------------------
 T E S T S
-------------------------------------------------------
There are no tests to run.

Results :

Tests run: 0, Failures: 0, Errors: 0, Skipped: 0

[JENKINS] Recording test results
[INFO] [jar:jar {execution: default-jar}]
[INFO] Building jar: <https://builds.apache.org/job/tobago-1.0.x-deploy/ws/tobago-1.0.x-deploy/tobago-tool/maven-theme-plugin/target/maven-theme-plugin-1.0.42-SNAPSHOT.jar>
[INFO] [plugin:addPluginArtifactMetadata {execution: default-addPluginArtifactMetadata}]
[INFO] [assembly:single {execution: source-release-assembly}]
[INFO] Skipping the assembly in this project because it's not the Execution Root
[INFO] [install:install {execution: default-install}]
[INFO] Installing <https://builds.apache.org/job/tobago-1.0.x-deploy/ws/tobago-1.0.x-deploy/tobago-tool/maven-theme-plugin/target/maven-theme-plugin-1.0.42-SNAPSHOT.jar>
to /home/jenkins/jenkins-slave/maven-repositories/1/org/apache/myfaces/tobago/maven-theme-plugin/1.0.42-SNAPSHOT/maven-theme-plugin-1.0.42-SNAPSHOT.jar
[INFO] Installing <https://builds.apache.org/job/tobago-1.0.x-deploy/ws/tobago-1.0.x-deploy/tobago-tool/maven-theme-plugin/target/maven-theme-plugin-1.0.42-SNAPSHOT-sources.jar>
to /home/jenkins/jenkins-slave/maven-repositories/1/org/apache/myfaces/tobago/maven-theme-plugin/1.0.42-SNAPSHOT/maven-theme-plugin-1.0.42-SNAPSHOT-sources.jar
[INFO] [deploy:deploy {execution: default-deploy}]
[INFO] Retrieving previous build number from apache.snapshots.https
Uploading: https://repository.apache.org/content/repositories/snapshots/org/apache/myfaces/tobago/maven-theme-plugin/1.0.42-SNAPSHOT/maven-theme-plugin-1.0.42-SNAPSHOT.jar
19K uploaded  (maven-theme-plugin-1.0.42-SNAPSHOT.jar)
[INFO] Uploading project information for maven-theme-plugin 1.0.42-SNAPSHOT
[INFO] Retrieving previous metadata from apache.snapshots.https
[INFO] Uploading repository metadata for: 'snapshot org.apache.myfaces.tobago:maven-theme-plugin:1.0.42-SNAPSHOT'
[INFO] Retrieving previous metadata from apache.snapshots.https
[INFO] Uploading repository metadata for: 'org.apache.myfaces.tobago'
[INFO] Retrieving previous metadata from apache.snapshots.https
[INFO] Uploading repository metadata for: 'artifact org.apache.myfaces.tobago:maven-theme-plugin'
[INFO] Retrieving previous build number from apache.snapshots.https
Uploading: https://repository.apache.org/content/repositories/snapshots/org/apache/myfaces/tobago/maven-theme-plugin/1.0.42-SNAPSHOT/maven-theme-plugin-1.0.42-SNAPSHOT-sources.jar
10K uploaded  (maven-theme-plugin-1.0.42-SNAPSHOT-sources.jar)
[INFO] ------------------------------------------------------------------------
[INFO] Building Tobago Annotation
[INFO]    task-segment: [clean, source:jar, deploy]
[INFO] ------------------------------------------------------------------------
[INFO] [clean:clean {execution: default-clean}]
[INFO] Preparing source:jar
[INFO] [buildnumber:create {execution: default}]
ERROR: Could not find local repository for 2.2.1
[INFO] [source:jar {execution: default-cli}]
[INFO] Building jar: <https://builds.apache.org/job/tobago-1.0.x-deploy/ws/tobago-1.0.x-deploy/tobago-tool/tobago-tool-annotation/target/tobago-tool-annotation-1.0.42-SNAPSHOT-sources.jar>
[INFO] [buildnumber:create {execution: default}]
[INFO] [remote-resources:process {execution: default}]
[INFO] [resources:resources {execution: default-resources}]
[INFO] Using 'UTF-8' encoding to copy filtered resources.
[INFO] Copying 2 resources
[INFO] Copying 3 resources
[INFO] [compiler:compile {execution: default-compile}]
[INFO] Compiling 14 source files to <https://builds.apache.org/job/tobago-1.0.x-deploy/ws/tobago-1.0.x-deploy/tobago-tool/tobago-tool-annotation/target/classes>
[INFO] [resources:testResources {execution: default-testResources}]
[INFO] Using 'UTF-8' encoding to copy filtered resources.
[INFO] skip non existing resourceDirectory <https://builds.apache.org/job/tobago-1.0.x-deploy/ws/tobago-1.0.x-deploy/tobago-tool/tobago-tool-annotation/src/test/resources>
[INFO] Copying 3 resources
[INFO] [compiler:testCompile {execution: default-testCompile}]
[INFO] No sources to compile
[INFO] [surefire:test {execution: default-test}]
[INFO] Surefire report directory: <https://builds.apache.org/job/tobago-1.0.x-deploy/ws/tobago-1.0.x-deploy/tobago-tool/tobago-tool-annotation/target/surefire-reports>

-------------------------------------------------------
 T E S T S
-------------------------------------------------------
There are no tests to run.

Results :

Tests run: 0, Failures: 0, Errors: 0, Skipped: 0

[JENKINS] Recording test results
[INFO] [jar:jar {execution: default-jar}]
[INFO] Building jar: <https://builds.apache.org/job/tobago-1.0.x-deploy/ws/tobago-1.0.x-deploy/tobago-tool/tobago-tool-annotation/target/tobago-tool-annotation-1.0.42-SNAPSHOT.jar>
[INFO] [assembly:single {execution: source-release-assembly}]
[INFO] Skipping the assembly in this project because it's not the Execution Root
[INFO] [install:install {execution: default-install}]
[INFO] Installing <https://builds.apache.org/job/tobago-1.0.x-deploy/ws/tobago-1.0.x-deploy/tobago-tool/tobago-tool-annotation/target/tobago-tool-annotation-1.0.42-SNAPSHOT.jar>
to /home/jenkins/jenkins-slave/maven-repositories/1/org/apache/myfaces/tobago/tobago-tool-annotation/1.0.42-SNAPSHOT/tobago-tool-annotation-1.0.42-SNAPSHOT.jar
[INFO] Installing <https://builds.apache.org/job/tobago-1.0.x-deploy/ws/tobago-1.0.x-deploy/tobago-tool/tobago-tool-annotation/target/tobago-tool-annotation-1.0.42-SNAPSHOT-sources.jar>
to /home/jenkins/jenkins-slave/maven-repositories/1/org/apache/myfaces/tobago/tobago-tool-annotation/1.0.42-SNAPSHOT/tobago-tool-annotation-1.0.42-SNAPSHOT-sources.jar
[INFO] [deploy:deploy {execution: default-deploy}]
[INFO] Retrieving previous build number from apache.snapshots.https
Uploading: https://repository.apache.org/content/repositories/snapshots/org/apache/myfaces/tobago/tobago-tool-annotation/1.0.42-SNAPSHOT/tobago-tool-annotation-1.0.42-SNAPSHOT.jar
22K uploaded  (tobago-tool-annotation-1.0.42-SNAPSHOT.jar)
[INFO] Retrieving previous metadata from apache.snapshots.https
[INFO] Uploading repository metadata for: 'artifact org.apache.myfaces.tobago:tobago-tool-annotation'
[INFO] Retrieving previous metadata from apache.snapshots.https
[INFO] Uploading repository metadata for: 'snapshot org.apache.myfaces.tobago:tobago-tool-annotation:1.0.42-SNAPSHOT'
[INFO] Uploading project information for tobago-tool-annotation 1.0.42-SNAPSHOT
[INFO] Retrieving previous build number from apache.snapshots.https
Uploading: https://repository.apache.org/content/repositories/snapshots/org/apache/myfaces/tobago/tobago-tool-annotation/1.0.42-SNAPSHOT/tobago-tool-annotation-1.0.42-SNAPSHOT-sources.jar
18K uploaded  (tobago-tool-annotation-1.0.42-SNAPSHOT-sources.jar)
[INFO] ------------------------------------------------------------------------
[INFO] Building Tobago Apt
[INFO]    task-segment: [clean, source:jar, deploy]
[INFO] ------------------------------------------------------------------------
[INFO] [clean:clean {execution: default-clean}]
[INFO] Preparing source:jar
[INFO] [buildnumber:create {execution: default}]
ERROR: Could not find local repository for 2.2.1
[INFO] [source:jar {execution: default-cli}]
[INFO] org already added, skipping
[INFO] org/apache already added, skipping
[INFO] org/apache/myfaces already added, skipping
[INFO] org/apache/myfaces/tobago already added, skipping
[INFO] Building jar: <https://builds.apache.org/job/tobago-1.0.x-deploy/ws/tobago-1.0.x-deploy/tobago-tool/tobago-tool-apt/target/tobago-tool-apt-1.0.42-SNAPSHOT-sources.jar>
[INFO] org already added, skipping
[INFO] org/apache already added, skipping
[INFO] org/apache/myfaces already added, skipping
[INFO] org/apache/myfaces/tobago already added, skipping
[INFO] [buildnumber:create {execution: default}]
[INFO] [remote-resources:process {execution: default}]
[INFO] [resources:resources {execution: default-resources}]
[INFO] Using 'UTF-8' encoding to copy filtered resources.
[INFO] Copying 3 resources
[INFO] Copying 3 resources
[INFO] [compiler:compile {execution: default-compile}]
[INFO] Compiling 17 source files to <https://builds.apache.org/job/tobago-1.0.x-deploy/ws/tobago-1.0.x-deploy/tobago-tool/tobago-tool-apt/target/classes>
[INFO] -------------------------------------------------------------
[ERROR] COMPILATION ERROR : 
[INFO] -------------------------------------------------------------
[ERROR] <https://builds.apache.org/job/tobago-1.0.x-deploy/ws/tobago-1.0.x-deploy/tobago-tool/tobago-tool-apt/src/main/java/org/apache/myfaces/tobago/apt/TobagoAnnotationProcessor.java>:[22,-1]
cannot access com.sun.mirror.apt.AnnotationProcessor
bad class file: /home/jenkins/tools/java/jdk1.7.0_55/jre/../lib/tools.jar(com/sun/mirror/apt/AnnotationProcessor.class)
class file has wrong version 51.0, should be 49.0
[INFO] 1 error
[INFO] -------------------------------------------------------------
[INFO] ------------------------------------------------------------------------
[ERROR] BUILD FAILURE
[INFO] ------------------------------------------------------------------------
[INFO] Compilation failure
<https://builds.apache.org/job/tobago-1.0.x-deploy/ws/tobago-1.0.x-deploy/tobago-tool/tobago-tool-apt/src/main/java/org/apache/myfaces/tobago/apt/TobagoAnnotationProcessor.java>:[22,-1]
cannot access com.sun.mirror.apt.AnnotationProcessor
bad class file: /home/jenkins/tools/java/jdk1.7.0_55/jre/../lib/tools.jar(com/sun/mirror/apt/AnnotationProcessor.class)
class file has wrong version 51.0, should be 49.0

[INFO] ------------------------------------------------------------------------
[INFO] For more information, run Maven with the -e switch
[INFO] ------------------------------------------------------------------------
[INFO] Total time: 1 minute 5 seconds
[INFO] Finished at: Wed Oct 08 23:23:13 UTC 2014
[INFO] Final Memory: 61M/1656M
[INFO] ------------------------------------------------------------------------
[JENKINS] Archiving <https://builds.apache.org/job/tobago-1.0.x-deploy/ws/tobago-1.0.x-deploy/tobago-tool/maven-apt-plugin/pom.xml>
to org.apache.myfaces.tobago/maven-apt-plugin/1.0.42-SNAPSHOT/maven-apt-plugin-1.0.42-SNAPSHOT.pom
[JENKINS] Archiving <https://builds.apache.org/job/tobago-1.0.x-deploy/ws/tobago-1.0.x-deploy/tobago-tool/maven-apt-plugin/target/maven-apt-plugin-1.0.42-SNAPSHOT.jar>
to org.apache.myfaces.tobago/maven-apt-plugin/1.0.42-SNAPSHOT/maven-apt-plugin-1.0.42-SNAPSHOT.jar
[JENKINS] Archiving <https://builds.apache.org/job/tobago-1.0.x-deploy/ws/tobago-1.0.x-deploy/tobago-tool/maven-apt-plugin/target/maven-apt-plugin-1.0.42-SNAPSHOT-sources.jar>
to org.apache.myfaces.tobago/maven-apt-plugin/1.0.42-SNAPSHOT/maven-apt-plugin-1.0.42-SNAPSHOT-sources.jar
Sending artifact delta relative to tobago-1.0.x-deploy » Maven Apt Plugin #732
Archived 3 artifacts
Archive block size is 32768
Received 0 blocks and 46283 bytes
Compression is 0.0%
Took 0.13 sec
[JENKINS] Archiving <https://builds.apache.org/job/tobago-1.0.x-deploy/ws/tobago-1.0.x-deploy/tobago-tool/tobago-tool-annotation/pom.xml>
to org.apache.myfaces.tobago/tobago-tool-annotation/1.0.42-SNAPSHOT/tobago-tool-annotation-1.0.42-SNAPSHOT.pom
[JENKINS] Archiving <https://builds.apache.org/job/tobago-1.0.x-deploy/ws/tobago-1.0.x-deploy/tobago-tool/tobago-tool-annotation/target/tobago-tool-annotation-1.0.42-SNAPSHOT.jar>
to org.apache.myfaces.tobago/tobago-tool-annotation/1.0.42-SNAPSHOT/tobago-tool-annotation-1.0.42-SNAPSHOT.jar
[JENKINS] Archiving <https://builds.apache.org/job/tobago-1.0.x-deploy/ws/tobago-1.0.x-deploy/tobago-tool/tobago-tool-annotation/target/tobago-tool-annotation-1.0.42-SNAPSHOT-sources.jar>
to org.apache.myfaces.tobago/tobago-tool-annotation/1.0.42-SNAPSHOT/tobago-tool-annotation-1.0.42-SNAPSHOT-sources.jar
Sending artifact delta relative to tobago-1.0.x-deploy » Tobago Annotation #732
Archived 3 artifacts
Archive block size is 32768
Received 0 blocks and 43640 bytes
Compression is 0.0%
Took 63 ms
[JENKINS] Archiving <https://builds.apache.org/job/tobago-1.0.x-deploy/ws/tobago-1.0.x-deploy/tobago-tool/tobago-tool-apt/pom.xml>
to org.apache.myfaces.tobago/tobago-tool-apt/1.0.42-SNAPSHOT/tobago-tool-apt-1.0.42-SNAPSHOT.pom
[JENKINS] Archiving <https://builds.apache.org/job/tobago-1.0.x-deploy/ws/tobago-1.0.x-deploy/tobago-tool/tobago-tool-apt/target/tobago-tool-apt-1.0.42-SNAPSHOT-sources.jar>
to org.apache.myfaces.tobago/tobago-tool-apt/1.0.42-SNAPSHOT/tobago-tool-apt-1.0.42-SNAPSHOT-sources.jar
No artifacts from tobago-1.0.x-deploy » Tobago Apt #706 to compare, so performing full copy
of artifacts
[JENKINS] Archiving /home/jenkins/jenkins-slave/maven-repositories/1/org/apache/myfaces/tobago/tobago-tool/1.0.42-SNAPSHOT/tobago-tool-1.0.42-SNAPSHOT.pom
to org.apache.myfaces.tobago/tobago-tool/1.0.42-SNAPSHOT/tobago-tool-1.0.42-SNAPSHOT.pom
/home/jenkins/jenkins-slave/maven-repositories/1/org/apache/myfaces/tobago/tobago-tool/1.0.42-SNAPSHOT/tobago-tool-1.0.42-SNAPSHOT.pom
is not inside <https://builds.apache.org/job/tobago-1.0.x-deploy/ws/tobago-1.0.x-deploy/tobago-tool/;>
will archive in a separate pass
Sending artifact delta relative to tobago-1.0.x-deploy » Tobago Tool #732
Archived 1 artifacts
Archive block size is 32768
Received 0 blocks and 1620 bytes
Compression is 0.0%
Took 47 ms
[JENKINS] Archiving <https://builds.apache.org/job/tobago-1.0.x-deploy/ws/tobago-1.0.x-deploy/tobago-tool/maven-theme-plugin/pom.xml>
to org.apache.myfaces.tobago/maven-theme-plugin/1.0.42-SNAPSHOT/maven-theme-plugin-1.0.42-SNAPSHOT.pom
[JENKINS] Archiving <https://builds.apache.org/job/tobago-1.0.x-deploy/ws/tobago-1.0.x-deploy/tobago-tool/maven-theme-plugin/target/maven-theme-plugin-1.0.42-SNAPSHOT.jar>
to org.apache.myfaces.tobago/maven-theme-plugin/1.0.42-SNAPSHOT/maven-theme-plugin-1.0.42-SNAPSHOT.jar
[JENKINS] Archiving <https://builds.apache.org/job/tobago-1.0.x-deploy/ws/tobago-1.0.x-deploy/tobago-tool/maven-theme-plugin/target/maven-theme-plugin-1.0.42-SNAPSHOT-sources.jar>
to org.apache.myfaces.tobago/maven-theme-plugin/1.0.42-SNAPSHOT/maven-theme-plugin-1.0.42-SNAPSHOT-sources.jar
Sending artifact delta relative to tobago-1.0.x-deploy » Maven Tobago Theme Plugin #732
Archived 3 artifacts
Archive block size is 32768
Received 0 blocks and 33442 bytes
Compression is 0.0%
Took 59 ms
[JENKINS] Archiving /home/jenkins/jenkins-slave/maven-repositories/1/org/apache/myfaces/tobago/tobago/1.0.42-SNAPSHOT/tobago-1.0.42-SNAPSHOT.pom
to org.apache.myfaces.tobago/tobago/1.0.42-SNAPSHOT/tobago-1.0.42-SNAPSHOT.pom
[JENKINS] Archiving <https://builds.apache.org/job/tobago-1.0.x-deploy/ws/tobago-1.0.x-deploy/target/tobago-1.0.42-SNAPSHOT-site.xml>
to org.apache.myfaces.tobago/tobago/1.0.42-SNAPSHOT/tobago-1.0.42-SNAPSHOT-site.xml
[JENKINS] Archiving <https://builds.apache.org/job/tobago-1.0.x-deploy/ws/tobago-1.0.x-deploy/target/tobago-1.0.42-SNAPSHOT-source-release.zip>
to org.apache.myfaces.tobago/tobago/1.0.42-SNAPSHOT/tobago-1.0.42-SNAPSHOT-source-release.zip
/home/jenkins/jenkins-slave/maven-repositories/1/org/apache/myfaces/tobago/tobago/1.0.42-SNAPSHOT/tobago-1.0.42-SNAPSHOT.pom
is not inside <https://builds.apache.org/job/tobago-1.0.x-deploy/ws/tobago-1.0.x-deploy/;>
will archive in a separate pass
Sending artifact delta relative to tobago-1.0.x-deploy » Apache Tobago #732
Archived 2 artifacts
Archive block size is 32768
Received 6 blocks and 2822802 bytes
Compression is 6.5%
Took 3.1 sec
Sending artifact delta relative to tobago-1.0.x-deploy » Apache Tobago #732
Archived 1 artifacts
Archive block size is 32768
Received 0 blocks and 44031 bytes
Compression is 0.0%
Took 41 ms
Sending e-mails to: commits@myfaces.apache.org
channel stopped

Mime
View raw message