myfaces-commits mailing list archives

Site index · List index
Message view « Date » · « Thread »
Top « Date » · « Thread »
From Apache Jenkins Server <jenk...@builds.apache.org>
Subject Build failed in Jenkins: Trinidad Core 1.2.x (sanity) #1800
Date Mon, 03 Nov 2014 22:30:15 GMT
See <https://builds.apache.org/job/Trinidad%20Core%201.2.x%20(sanity)/1800/>

------------------------------------------
[...truncated 9245 lines...]
[INFO] META-INF/adf/jsLibsDebug/resources/LocaleElements_uk.js already added, skipping
[INFO] META-INF/adf/jsLibsDebug/resources/LocaleElements_es_VE.js already added, skipping
[INFO] META-INF/adf/jsLibsDebug/resources/LocaleElements_bg.js already added, skipping
[INFO] META-INF/adf/jsLibsDebug/MessageBox.js already added, skipping
[INFO] META-INF/adf/jsLibsDebug/DateField.js already added, skipping
[INFO] META-INF/adf/jsLibsDebug/Shuttle.js already added, skipping
[INFO] META-INF/adf/jsLibsDebug/Page.js already added, skipping
[INFO] META-INF/adf/jsLibsDebug/CharSets.js already added, skipping
[INFO] META-INF/adf/jsLibsDebug/Core.js already added, skipping
[INFO] META-INF/adf/jsLibsDebug/xhr/RequestQueue.js already added, skipping
[INFO] META-INF/adf/jsLibsDebug/xhr/XMLRequestEvent.js already added, skipping
[INFO] META-INF/adf/jsLibsDebug/xhr/XMLRequest.js already added, skipping
[INFO] META-INF/adf/jsLibsDebug/xhr/IFrameXMLRequestEvent.js already added, skipping
[INFO] META-INF/adf/jsLibsDebug/ColorFieldFormat.js already added, skipping
[INFO] META-INF/adf/jsLibsDebug/ColorFormat.js already added, skipping
[INFO] META-INF/adf/jsLibsDebug/NumberFormat.js already added, skipping
[INFO] META-INF/adf/jsLibsDebug/CoreFormat.js already added, skipping
[INFO] META-INF/adf/jsLibsDebug/TableProxy.js already added, skipping
[INFO] META-INF/adf/jsLibsDebug/PPR.js already added, skipping
[INFO] META-INF/adf/jsLibsDebug/StatusIndicator.js already added, skipping
[INFO] META-INF/adf/jsLibsDebug/PanelPopup.js already added, skipping
[INFO] META-INF/adf/jsLibsDebug/Poll.js already added, skipping
[INFO] META-INF/adf/jsLibsDebug/PopupDialog.js already added, skipping
[INFO] META-INF/adf/jsLibsDebug/NumberConverter.js already added, skipping
[INFO] META-INF/adf/jsLibsDebug/TrCollections.js already added, skipping
[INFO] META-INF/adf/jsLibsDebug/Locale.js already added, skipping
[INFO] META-INF/adf/jsLibsDebug/ScriptEval.js already added, skipping
[INFO] META-INF/adf/jsLibsDebug/ApacheChart.js already added, skipping
[INFO] [jar:test-jar {execution: default}]
[INFO] Building jar: <https://builds.apache.org/job/Trinidad%20Core%201.2.x%20(sanity)/ws/trinidad-impl/target/trinidad-impl-1.2.15-SNAPSHOT-tests.jar>
[INFO] [install:install {execution: default-install}]
[INFO] Installing <https://builds.apache.org/job/Trinidad%20Core%201.2.x%20(sanity)/ws/trinidad-impl/target/trinidad-impl-1.2.15-SNAPSHOT.jar>
to /jenkins/maven-repositories/0/org/apache/myfaces/trinidad/trinidad-impl/1.2.15-SNAPSHOT/trinidad-impl-1.2.15-SNAPSHOT.jar
[INFO] Installing <https://builds.apache.org/job/Trinidad%20Core%201.2.x%20(sanity)/ws/trinidad-impl/target/trinidad-impl-1.2.15-SNAPSHOT-sources.jar>
to /jenkins/maven-repositories/0/org/apache/myfaces/trinidad/trinidad-impl/1.2.15-SNAPSHOT/trinidad-impl-1.2.15-SNAPSHOT-sources.jar
[INFO] Installing <https://builds.apache.org/job/Trinidad%20Core%201.2.x%20(sanity)/ws/trinidad-impl/target/trinidad-impl-1.2.15-SNAPSHOT-tests.jar>
to /jenkins/maven-repositories/0/org/apache/myfaces/trinidad/trinidad-impl/1.2.15-SNAPSHOT/trinidad-impl-1.2.15-SNAPSHOT-tests.jar
[INFO] ------------------------------------------------------------------------
[INFO] Building Apache MyFaces Trinidad Examples
[INFO]    task-segment: [clean, install]
[INFO] ------------------------------------------------------------------------
[INFO] [clean:clean {execution: default-clean}]
[INFO] [xrts:generate-sources {execution: default}]
Downloading: http://repository.jboss.org/nexus/content/groups/public-jboss//org/apache/myfaces/portlet-bridge/portlet-bridge-impl/1.0.0-beta/portlet-bridge-impl-1.0.0-beta.pom
2K downloaded  (portlet-bridge-impl-1.0.0-beta.pom)
Downloading: http://repository.jboss.org/nexus/content/groups/public-jboss//javax/portlet/portlet-api/1.0/portlet-api-1.0.pom
427b downloaded  (portlet-api-1.0.pom)
[INFO] [remote-resources:process {execution: default}]
[INFO] [xrts:generate-test-sources {execution: default}]
[INFO] [site:attach-descriptor {execution: default-attach-descriptor}]
[INFO] Preparing source:jar
[WARNING] Removing: jar from forked lifecycle, to prevent recursive invocation.
[INFO] [xrts:generate-sources {execution: default}]
ERROR: Could not find local repository for 2.2.1
[INFO] [source:jar {execution: attach-source}]
[INFO] [install:install {execution: default-install}]
[INFO] Installing <https://builds.apache.org/job/Trinidad%20Core%201.2.x%20(sanity)/ws/trinidad-examples/pom.xml>
to /jenkins/maven-repositories/0/org/apache/myfaces/trinidad/trinidad-example/1.2.15-SNAPSHOT/trinidad-example-1.2.15-SNAPSHOT.pom
[INFO] ------------------------------------------------------------------------
[INFO] Building Apache MyFaces Trinidad Blank Demo
[INFO]    task-segment: [clean, install]
[INFO] ------------------------------------------------------------------------
[INFO] [clean:clean {execution: default-clean}]
Downloading: http://repo1.maven.org/maven2/org/apache/maven/plugins/maven-war-plugin/2.1-alpha-2/maven-war-plugin-2.1-alpha-2.pom
7K downloaded  (maven-war-plugin-2.1-alpha-2.pom)
Downloading: http://repo1.maven.org/maven2/org/apache/maven/plugins/maven-plugins/11/maven-plugins-11.pom
10K downloaded  (maven-plugins-11.pom)
Downloading: http://repo1.maven.org/maven2/org/apache/maven/plugins/maven-war-plugin/2.1-alpha-2/maven-war-plugin-2.1-alpha-2.jar
72K downloaded  (maven-war-plugin-2.1-alpha-2.jar)
[INFO] [xrts:generate-sources {execution: default}]
[INFO] [remote-resources:process {execution: default}]
[INFO] [resources:resources {execution: default-resources}]
[INFO] Using 'UTF-8' encoding to copy filtered resources.
[INFO] skip non existing resourceDirectory <https://builds.apache.org/job/Trinidad%20Core%201.2.x%20(sanity)/ws/trinidad-examples/trinidad-blank/src/main/resources>
[INFO] Copying 2 resources
Downloading: http://repository.jboss.org/nexus/content/groups/public-jboss//org/apache/myfaces/portlet-bridge/portlet-bridge-impl/1.0.0-beta/portlet-bridge-impl-1.0.0-beta.jar
Downloading: http://repository.jboss.org/nexus/content/groups/public-jboss//javax/portlet/portlet-api/1.0/portlet-api-1.0.jar
16K downloaded  (portlet-api-1.0.jar)
109K downloaded  (portlet-bridge-impl-1.0.0-beta.jar)
[INFO] [compiler:compile {execution: default-compile}]
[INFO] Compiling 1 source file to <https://builds.apache.org/job/Trinidad%20Core%201.2.x%20(sanity)/ws/trinidad-examples/trinidad-blank/target/classes>
[INFO] [xrts:generate-test-sources {execution: default}]
[INFO] [resources:testResources {execution: default-testResources}]
[INFO] Using 'UTF-8' encoding to copy filtered resources.
[INFO] skip non existing resourceDirectory <https://builds.apache.org/job/Trinidad%20Core%201.2.x%20(sanity)/ws/trinidad-examples/trinidad-blank/src/test/resources>
[INFO] Copying 2 resources
[INFO] [compiler:testCompile {execution: default-testCompile}]
[INFO] No sources to compile
[INFO] [surefire:test {execution: default-test}]
[INFO] Surefire report directory: <https://builds.apache.org/job/Trinidad%20Core%201.2.x%20(sanity)/ws/trinidad-examples/trinidad-blank/target/surefire-reports>

-------------------------------------------------------
 T E S T S
-------------------------------------------------------
There are no tests to run.

Results :

Tests run: 0, Failures: 0, Errors: 0, Skipped: 0

[JENKINS] Recording test results
Downloading: http://repo1.maven.org/maven2/com/thoughtworks/xstream/xstream/1.2.2/xstream-1.2.2.pom
10K downloaded  (xstream-1.2.2.pom)
Downloading: http://repo1.maven.org/maven2/com/thoughtworks/xstream/xstream-parent/1.2.2/xstream-parent-1.2.2.pom
11K downloaded  (xstream-parent-1.2.2.pom)
Downloading: http://repository.jboss.org/nexus/content/groups/public-jboss//xpp3/xpp3_min/1.1.3.4.O/xpp3_min-1.1.3.4.O.pom
638b downloaded  (xpp3_min-1.1.3.4.O.pom)
Downloading: http://repo1.maven.org/maven2/org/apache/maven/shared/maven-filtering/1.0-beta-1/maven-filtering-1.0-beta-1.pom
3K downloaded  (maven-filtering-1.0-beta-1.pom)
Downloading: http://repository.jboss.org/nexus/content/groups/public-jboss//org/codehaus/plexus/plexus-interpolation/1.2/plexus-interpolation-1.2.pom
2K downloaded  (plexus-interpolation-1.2.pom)
Downloading: http://repository.jboss.org/nexus/content/groups/public-jboss//xpp3/xpp3_min/1.1.3.4.O/xpp3_min-1.1.3.4.O.jar
Downloading: http://repo1.maven.org/maven2/com/thoughtworks/xstream/xstream/1.2.2/xstream-1.2.2.jar
Downloading: http://repo1.maven.org/maven2/org/codehaus/plexus/plexus-utils/1.5.5/plexus-utils-1.5.5.jar
Downloading: http://repo1.maven.org/maven2/org/apache/maven/shared/maven-filtering/1.0-beta-1/maven-filtering-1.0-beta-1.jar
28K downloaded  (maven-filtering-1.0-beta-1.jar)
24K downloaded  (xpp3_min-1.1.3.4.O.jar)
245K downloaded  (plexus-utils-1.5.5.jar)
364K downloaded  (xstream-1.2.2.jar)
Downloading: http://repository.jboss.org/nexus/content/groups/public-jboss//org/codehaus/plexus/plexus-interpolation/1.2/plexus-interpolation-1.2.jar
35K downloaded  (plexus-interpolation-1.2.jar)
[INFO] [war:war {execution: default-war}]
[INFO] Packaging webapp
[INFO] Assembling webapp[trinidad-blank] in [<https://builds.apache.org/job/Trinidad%20Core%201.2.x%20(sanity)/ws/trinidad-examples/trinidad-blank/target/trinidad-blank-1.2.15-SNAPSHOT]>
[INFO] Processing war project
[INFO] Copying webapp resources[<https://builds.apache.org/job/Trinidad%20Core%201.2.x%20(sanity)/ws/trinidad-examples/trinidad-blank/src/main/webapp]>
[INFO] Webapp assembled in[90 msecs]
[INFO] Building war: <https://builds.apache.org/job/Trinidad%20Core%201.2.x%20(sanity)/ws/trinidad-examples/trinidad-blank/target/trinidad-blank-1.2.15-SNAPSHOT.war>
[INFO] Preparing source:jar
[WARNING] Removing: jar from forked lifecycle, to prevent recursive invocation.
[INFO] [xrts:generate-sources {execution: default}]
ERROR: Could not find local repository for 2.2.1
[INFO] [source:jar {execution: attach-source}]
[INFO] META-INF already added, skipping
[INFO] META-INF/LICENSE already added, skipping
[INFO] META-INF/NOTICE already added, skipping
[INFO] Building jar: <https://builds.apache.org/job/Trinidad%20Core%201.2.x%20(sanity)/ws/trinidad-examples/trinidad-blank/target/trinidad-blank-1.2.15-SNAPSHOT-sources.jar>
[INFO] META-INF already added, skipping
[INFO] META-INF/LICENSE already added, skipping
[INFO] META-INF/NOTICE already added, skipping
[INFO] [install:install {execution: default-install}]
[INFO] Installing <https://builds.apache.org/job/Trinidad%20Core%201.2.x%20(sanity)/ws/trinidad-examples/trinidad-blank/target/trinidad-blank-1.2.15-SNAPSHOT.war>
to /jenkins/maven-repositories/0/org/apache/myfaces/trinidad/trinidad-blank/1.2.15-SNAPSHOT/trinidad-blank-1.2.15-SNAPSHOT.war
[INFO] Installing <https://builds.apache.org/job/Trinidad%20Core%201.2.x%20(sanity)/ws/trinidad-examples/trinidad-blank/target/trinidad-blank-1.2.15-SNAPSHOT-sources.jar>
to /jenkins/maven-repositories/0/org/apache/myfaces/trinidad/trinidad-blank/1.2.15-SNAPSHOT/trinidad-blank-1.2.15-SNAPSHOT-sources.jar
[INFO] ------------------------------------------------------------------------
[INFO] Building Apache MyFaces Trinidad Demo
[INFO]    task-segment: [clean, install]
[INFO] ------------------------------------------------------------------------
[INFO] [clean:clean {execution: default-clean}]
[INFO] [xrts:generate-sources {execution: default}]
Downloading: http://repository.jboss.org/nexus/content/groups/public-jboss//javax/mail/mail/1.4.1/mail-1.4.1.pom
995b downloaded  (mail-1.4.1.pom)
[WARNING] POM for 'javax.activation:activation:pom:1.1:compile' is invalid.

Its dependencies (if any) will NOT be available to the current build.
Downloading: http://repository.jboss.org/nexus/content/groups/public-jboss//javax/mail/mail/1.4.1/mail-1.4.1.jar
437K downloaded  (mail-1.4.1.jar)
[INFO] [remote-resources:process {execution: default}]
[WARNING] Invalid project model for artifact [activation:javax.activation:1.1]. It will be
ignored by the remote resources Mojo.
[INFO] [resources:resources {execution: default-resources}]
[INFO] Using 'UTF-8' encoding to copy filtered resources.
[INFO] Copying 0 resource
[INFO] Copying 2 resources
[INFO] [compiler:compile {execution: default-compile}]
[INFO] Compiling 88 source files to <https://builds.apache.org/job/Trinidad%20Core%201.2.x%20(sanity)/ws/trinidad-examples/trinidad-demo/target/classes>
[INFO] -------------------------------------------------------------
[ERROR] COMPILATION ERROR : 
[INFO] -------------------------------------------------------------
[ERROR] error: error reading /jenkins/maven-repositories/0/javax/activation/activation/1.1/activation-1.1.jar;
error in opening zip file
[INFO] 1error
[INFO] -------------------------------------------------------------
[INFO] ------------------------------------------------------------------------
[ERROR] BUILD FAILURE
[INFO] ------------------------------------------------------------------------
[INFO] Compilation failure
error: error reading /jenkins/maven-repositories/0/javax/activation/activation/1.1/activation-1.1.jar;
error in opening zip file

[INFO] ------------------------------------------------------------------------
[INFO] For more information, run Maven with the -e switch
[INFO] ------------------------------------------------------------------------
[INFO] Total time: 4 minutes 25 seconds
[INFO] Finished at: Mon Nov 03 22:29:39 UTC 2014
[INFO] Final Memory: 70M/409M
[INFO] ------------------------------------------------------------------------
[JENKINS] Archiving <https://builds.apache.org/job/Trinidad%20Core%201.2.x%20(sanity)/ws/trinidad-examples/trinidad-demo/pom.xml>
to org.apache.myfaces.trinidad/trinidad-demo/1.2.15-SNAPSHOT/trinidad-demo-1.2.15-SNAPSHOT.pom
Sending artifact delta relative to Trinidad Core 1.2.x (sanity) » Apache MyFaces Trinidad
Demo #1799
Archived 1 artifacts
Archive block size is 32768
Received 0 blocks and 9291 bytes
Compression is 0.0%
Took 0.49 sec
[JENKINS] Archiving <https://builds.apache.org/job/Trinidad%20Core%201.2.x%20(sanity)/ws/trinidad-build/pom.xml>
to org.apache.myfaces.trinidad/trinidad-build/1.2.15-SNAPSHOT/trinidad-build-1.2.15-SNAPSHOT.pom
[JENKINS] Archiving <https://builds.apache.org/job/Trinidad%20Core%201.2.x%20(sanity)/ws/trinidad-build/target/trinidad-build-1.2.15-SNAPSHOT.jar>
to org.apache.myfaces.trinidad/trinidad-build/1.2.15-SNAPSHOT/trinidad-build-1.2.15-SNAPSHOT.jar
[JENKINS] Archiving <https://builds.apache.org/job/Trinidad%20Core%201.2.x%20(sanity)/ws/trinidad-build/target/trinidad-build-1.2.15-SNAPSHOT-sources.jar>
to org.apache.myfaces.trinidad/trinidad-build/1.2.15-SNAPSHOT/trinidad-build-1.2.15-SNAPSHOT-sources.jar
Sending artifact delta relative to Trinidad Core 1.2.x (sanity) » Apache MyFaces Trinidad
Build #1799
Archived 3 artifacts
Archive block size is 32768
Received 0 blocks and 894335 bytes
Compression is 0.0%
Took 0.68 sec
[JENKINS] Archiving /jenkins/maven-repositories/0/org/apache/myfaces/trinidad/trinidad/1.2.15-SNAPSHOT/trinidad-1.2.15-SNAPSHOT.pom
to org.apache.myfaces.trinidad/trinidad/1.2.15-SNAPSHOT/trinidad-1.2.15-SNAPSHOT.pom
[JENKINS] Archiving <https://builds.apache.org/job/Trinidad%20Core%201.2.x%20(sanity)/ws/target/trinidad-1.2.15-SNAPSHOT-site.xml>
to org.apache.myfaces.trinidad/trinidad/1.2.15-SNAPSHOT/trinidad-1.2.15-SNAPSHOT-site.xml
/jenkins/maven-repositories/0/org/apache/myfaces/trinidad/trinidad/1.2.15-SNAPSHOT/trinidad-1.2.15-SNAPSHOT.pom
is not inside <https://builds.apache.org/job/Trinidad%20Core%201.2.x%20(sanity)/ws/;>
will archive in a separate pass
Sending artifact delta relative to Trinidad Core 1.2.x (sanity) » Apache MyFaces Trinidad
1.2 #1799
Archived 1 artifacts
Archive block size is 32768
Received 0 blocks and 2565 bytes
Compression is 0.0%
Took 0.18 sec
Sending artifact delta relative to Trinidad Core 1.2.x (sanity) » Apache MyFaces Trinidad
1.2 #1799
Archived 1 artifacts
Archive block size is 32768
Received 0 blocks and 26742 bytes
Compression is 0.0%
Took 0.22 sec
[JENKINS] Archiving /jenkins/maven-repositories/0/org/apache/myfaces/trinidad/trinidad-example/1.2.15-SNAPSHOT/trinidad-example-1.2.15-SNAPSHOT.pom
to org.apache.myfaces.trinidad/trinidad-example/1.2.15-SNAPSHOT/trinidad-example-1.2.15-SNAPSHOT.pom
/jenkins/maven-repositories/0/org/apache/myfaces/trinidad/trinidad-example/1.2.15-SNAPSHOT/trinidad-example-1.2.15-SNAPSHOT.pom
is not inside <https://builds.apache.org/job/Trinidad%20Core%201.2.x%20(sanity)/ws/trinidad-examples/;>
will archive in a separate pass
Sending artifact delta relative to Trinidad Core 1.2.x (sanity) » Apache MyFaces Trinidad
Examples #1799
Archived 1 artifacts
Archive block size is 32768
Received 0 blocks and 7233 bytes
Compression is 0.0%
Took 0.23 sec
[JENKINS] Archiving <https://builds.apache.org/job/Trinidad%20Core%201.2.x%20(sanity)/ws/trinidad-api/pom.xml>
to org.apache.myfaces.trinidad/trinidad-api/1.2.15-SNAPSHOT/trinidad-api-1.2.15-SNAPSHOT.pom
[JENKINS] Archiving <https://builds.apache.org/job/Trinidad%20Core%201.2.x%20(sanity)/ws/trinidad-api/target/trinidad-api-1.2.15-SNAPSHOT.jar>
to org.apache.myfaces.trinidad/trinidad-api/1.2.15-SNAPSHOT/trinidad-api-1.2.15-SNAPSHOT.jar
[JENKINS] Archiving <https://builds.apache.org/job/Trinidad%20Core%201.2.x%20(sanity)/ws/trinidad-api/target/trinidad-api-1.2.15-SNAPSHOT-sources.jar>
to org.apache.myfaces.trinidad/trinidad-api/1.2.15-SNAPSHOT/trinidad-api-1.2.15-SNAPSHOT-sources.jar
[JENKINS] Archiving <https://builds.apache.org/job/Trinidad%20Core%201.2.x%20(sanity)/ws/trinidad-api/target/trinidad-api-1.2.15-SNAPSHOT-tests.jar>
to org.apache.myfaces.trinidad/trinidad-api/1.2.15-SNAPSHOT/trinidad-api-1.2.15-SNAPSHOT-tests.jar
Sending artifact delta relative to Trinidad Core 1.2.x (sanity) » Apache MyFaces Trinidad
API #1799
Archived 4 artifacts
Archive block size is 32768
Received 4 blocks and 2787824 bytes
Compression is 4.5%
Took 3.3 sec
[JENKINS] Archiving <https://builds.apache.org/job/Trinidad%20Core%201.2.x%20(sanity)/ws/trinidad-examples/trinidad-blank/pom.xml>
to org.apache.myfaces.trinidad/trinidad-blank/1.2.15-SNAPSHOT/trinidad-blank-1.2.15-SNAPSHOT.pom
[JENKINS] Archiving <https://builds.apache.org/job/Trinidad%20Core%201.2.x%20(sanity)/ws/trinidad-examples/trinidad-blank/target/trinidad-blank-1.2.15-SNAPSHOT.war>
to org.apache.myfaces.trinidad/trinidad-blank/1.2.15-SNAPSHOT/trinidad-blank-1.2.15-SNAPSHOT.war
[JENKINS] Archiving <https://builds.apache.org/job/Trinidad%20Core%201.2.x%20(sanity)/ws/trinidad-examples/trinidad-blank/target/trinidad-blank-1.2.15-SNAPSHOT-sources.jar>
to org.apache.myfaces.trinidad/trinidad-blank/1.2.15-SNAPSHOT/trinidad-blank-1.2.15-SNAPSHOT-sources.jar
Sending artifact delta relative to Trinidad Core 1.2.x (sanity) » Apache MyFaces Trinidad
Blank Demo #1799
Archived 3 artifacts
Archive block size is 32768
Received 0 blocks and 5302190 bytes
Compression is 0.0%
Took 3.6 sec
[JENKINS] Archiving <https://builds.apache.org/job/Trinidad%20Core%201.2.x%20(sanity)/ws/trinidad-impl/pom.xml>
to org.apache.myfaces.trinidad/trinidad-impl/1.2.15-SNAPSHOT/trinidad-impl-1.2.15-SNAPSHOT.pom
[JENKINS] Archiving <https://builds.apache.org/job/Trinidad%20Core%201.2.x%20(sanity)/ws/trinidad-impl/target/trinidad-impl-1.2.15-SNAPSHOT.jar>
to org.apache.myfaces.trinidad/trinidad-impl/1.2.15-SNAPSHOT/trinidad-impl-1.2.15-SNAPSHOT.jar
[JENKINS] Archiving <https://builds.apache.org/job/Trinidad%20Core%201.2.x%20(sanity)/ws/trinidad-impl/target/trinidad-impl-1.2.15-SNAPSHOT-sources.jar>
to org.apache.myfaces.trinidad/trinidad-impl/1.2.15-SNAPSHOT/trinidad-impl-1.2.15-SNAPSHOT-sources.jar
[JENKINS] Archiving <https://builds.apache.org/job/Trinidad%20Core%201.2.x%20(sanity)/ws/trinidad-impl/target/trinidad-impl-1.2.15-SNAPSHOT-tests.jar>
to org.apache.myfaces.trinidad/trinidad-impl/1.2.15-SNAPSHOT/trinidad-impl-1.2.15-SNAPSHOT-tests.jar
Sending artifact delta relative to Trinidad Core 1.2.x (sanity) » Apache MyFaces Trinidad
Impl #1799
Archived 4 artifacts
Archive block size is 32768
Received 6 blocks and 9976368 bytes
Compression is 1.9%
Took 9.5 sec
Sending e-mails to: commits@myfaces.apache.org
channel stopped

Mime
View raw message