myfaces-commits mailing list archives

Site index · List index
Message view « Date » · « Thread »
Top « Date » · « Thread »
From Apache Jenkins Server <jenk...@builds.apache.org>
Subject Build failed in Jenkins: Trinidad Core 1.2.x (sanity) » Apache MyFaces Trinidad Demo #1800
Date Mon, 03 Nov 2014 22:30:13 GMT
See <https://builds.apache.org/job/Trinidad%20Core%201.2.x%20(sanity)/org.apache.myfaces.trinidad$trinidad-demo/1800/>

------------------------------------------
[INFO] ------------------------------------------------------------------------
[INFO] Building Apache MyFaces Trinidad Demo
[INFO]    task-segment: [clean, install]
[INFO] ------------------------------------------------------------------------
[INFO] [clean:clean {execution: default-clean}]
[INFO] [xrts:generate-sources {execution: default}]
Downloading: http://repository.jboss.org/nexus/content/groups/public-jboss//javax/mail/mail/1.4.1/mail-1.4.1.pom
995b downloaded  (mail-1.4.1.pom)
[WARNING] POM for 'javax.activation:activation:pom:1.1:compile' is invalid.

Its dependencies (if any) will NOT be available to the current build.
Downloading: http://repository.jboss.org/nexus/content/groups/public-jboss//javax/mail/mail/1.4.1/mail-1.4.1.jar
437K downloaded  (mail-1.4.1.jar)
[INFO] [remote-resources:process {execution: default}]
[WARNING] Invalid project model for artifact [activation:javax.activation:1.1]. It will be
ignored by the remote resources Mojo.
[INFO] [resources:resources {execution: default-resources}]
[INFO] Using 'UTF-8' encoding to copy filtered resources.
[INFO] Copying 0 resource
[INFO] Copying 2 resources
[INFO] [compiler:compile {execution: default-compile}]
[INFO] Compiling 88 source files to <https://builds.apache.org/job/Trinidad%20Core%201.2.x%20(sanity)/org.apache.myfaces.trinidad$trinidad-demo/ws/target/classes>
[INFO] -------------------------------------------------------------
[ERROR] COMPILATION ERROR : 
[INFO] -------------------------------------------------------------
[ERROR] error: error reading /jenkins/maven-repositories/0/javax/activation/activation/1.1/activation-1.1.jar;
error in opening zip file
[INFO] 1error
[INFO] -------------------------------------------------------------
[INFO] ------------------------------------------------------------------------
[ERROR] BUILD FAILURE
[INFO] ------------------------------------------------------------------------
[INFO] Compilation failure
error: error reading /jenkins/maven-repositories/0/javax/activation/activation/1.1/activation-1.1.jar;
error in opening zip file

[INFO] ------------------------------------------------------------------------
[INFO] For more information, run Maven with the -e switch
[INFO] ------------------------------------------------------------------------
[INFO] Total time: 4 minutes 25 seconds
[INFO] Finished at: Mon Nov 03 22:29:39 UTC 2014
[INFO] Final Memory: 70M/409M
[INFO] ------------------------------------------------------------------------

Mime
View raw message