myfaces-commits mailing list archives

Site index · List index
Message view « Date » · « Thread »
Top « Date » · « Thread »
From Apache Jenkins Server <jenk...@builds.apache.org>
Subject Build failed in Jenkins: tobago-3.0.x #1
Date Fri, 29 May 2015 07:38:14 GMT
See <https://builds.apache.org/job/tobago-3.0.x/1/>

------------------------------------------
[...truncated 2754 lines...]
A         tobago-tool/tobago-tool-annotation/src/main/java/org/apache/myfaces/tobago/apt
A         tobago-tool/tobago-tool-annotation/src/main/java/org/apache/myfaces/tobago/apt/annotation
AU        tobago-tool/tobago-tool-annotation/src/main/java/org/apache/myfaces/tobago/apt/annotation/Preliminary.java
AU        tobago-tool/tobago-tool-annotation/src/main/java/org/apache/myfaces/tobago/apt/annotation/Tag.java
AU        tobago-tool/tobago-tool-annotation/src/main/java/org/apache/myfaces/tobago/apt/annotation/BodyContentDescription.java
AU        tobago-tool/tobago-tool-annotation/src/main/java/org/apache/myfaces/tobago/apt/annotation/UIComponentTag.java
AU        tobago-tool/tobago-tool-annotation/src/main/java/org/apache/myfaces/tobago/apt/annotation/Category.java
AU        tobago-tool/tobago-tool-annotation/src/main/java/org/apache/myfaces/tobago/apt/annotation/TagAttribute.java
AU        tobago-tool/tobago-tool-annotation/src/main/java/org/apache/myfaces/tobago/apt/annotation/UIComponentTagAttribute.java
AU        tobago-tool/tobago-tool-annotation/src/main/java/org/apache/myfaces/tobago/apt/annotation/ValidatorTag.java
AU        tobago-tool/tobago-tool-annotation/src/main/java/org/apache/myfaces/tobago/apt/annotation/Facet.java
AU        tobago-tool/tobago-tool-annotation/src/main/java/org/apache/myfaces/tobago/apt/annotation/Taglib.java
AU        tobago-tool/tobago-tool-annotation/src/main/java/org/apache/myfaces/tobago/apt/annotation/DynamicExpression.java
AU        tobago-tool/tobago-tool-annotation/src/main/java/org/apache/myfaces/tobago/apt/annotation/SimpleTag.java
AU        tobago-tool/tobago-tool-annotation/src/main/java/org/apache/myfaces/tobago/apt/annotation/Validator.java
AU        tobago-tool/tobago-tool-annotation/src/main/java/org/apache/myfaces/tobago/apt/annotation/Converter.java
AU        tobago-tool/tobago-tool-annotation/src/main/java/org/apache/myfaces/tobago/apt/annotation/ExtensionTag.java
A         tobago-tool/tobago-tool-annotation/src/main/appended-resouces
A         tobago-tool/tobago-tool-annotation/src/main/appended-resouces/META-INF
AU        tobago-tool/tobago-tool-annotation/src/main/appended-resouces/META-INF/NOTICE
AU        tobago-tool/tobago-tool-annotation/pom.xml
A         src
A         src/docbook
A         src/docbook/resources
AU        src/docbook/resources/progress.png
AU        src/docbook/resources/theme-speyside.png
AU        src/docbook/resources/editor.png
AU        src/docbook/resources/list.png
AU        src/docbook/resources/editor-simple.png
AU        src/docbook/resources/theme-scarborough.png
AU        src/docbook/resources/theme-charlotteville.png
AU        src/docbook/resources/basic-controls.png
AU        src/docbook/resources/slider.png
AU        src/docbook/resources/theme-richmond.png
AU        src/docbook/tobago-tutorial.xml
A         src/changes
AU        src/changes/changes.xml
A         tobago-3.0.txt
 U        .
At revision 1682378
Parsing POMs
Discovered a new module org.apache.myfaces.tobago:tobago Apache Tobago
Discovered a new module org.apache.myfaces.tobago:tobago-tool Tobago Tool
Discovered a new module org.apache.myfaces.tobago:tobago-tool-apt Tobago Tool Apt
Discovered a new module org.apache.myfaces.tobago:tobago-tool-annotation Tobago Tool Annotation
Discovered a new module org.apache.myfaces.tobago:tobago-theme-plugin Tobago Maven2 Theme
Plugin
Discovered a new module org.apache.myfaces.tobago:tobago-core Tobago Core
Discovered a new module org.apache.myfaces.tobago:tobago-theme Tobago Themes
Discovered a new module org.apache.myfaces.tobago:tobago-theme-standard Tobago Theme Standard
Discovered a new module org.apache.myfaces.tobago:tobago-theme-scarborough Tobago Theme Scarborough
Discovered a new module org.apache.myfaces.tobago:tobago-theme-speyside Tobago Theme Speyside
Discovered a new module org.apache.myfaces.tobago:tobago-theme-richmond Tobago Theme Richmond
Discovered a new module org.apache.myfaces.tobago:tobago-theme-charlotteville Tobago Theme
Charlotteville
Discovered a new module org.apache.myfaces.tobago:tobago-theme-bootstrap tobago-theme-bootstrap
Discovered a new module org.apache.myfaces.tobago:tobago-extension Tobago Extensions
Discovered a new module org.apache.myfaces.tobago:tobago-deprecation Tobago Deprecation
Discovered a new module org.apache.myfaces.tobago:tobago-fileupload Tobago Fileupload
Discovered a new module org.apache.myfaces.tobago:tobago-sandbox Tobago Sandbox
Discovered a new module org.apache.myfaces.tobago:tobago-security Tobago Security
Discovered a new module org.apache.myfaces.tobago:tobago-example Tobago Examples
Discovered a new module org.apache.myfaces.tobago:tobago-example-addressbook Tobago Example
Addressbook (Java EE 6)
Discovered a new module org.apache.myfaces.tobago:tobago-example-blank Tobago Example Blank
Discovered a new module org.apache.myfaces.tobago:tobago-example-data Tobago Example Data
Discovered a new module org.apache.myfaces.tobago:tobago-example-demo Tobago Example Demo
Discovered a new module org.apache.myfaces.tobago:tobago-example-test Tobago Example Test
Discovered a new module org.apache.myfaces.tobago:tobago-example-portlet Tobago Example for
Portlets
Discovered a new module org.apache.myfaces.tobago:tobago-example-sandbox Tobago Example Sandbox
Discovered a new module org.apache.myfaces.tobago:tobago-example-security Tobago Example Security
Discovered a new module org.apache.myfaces.tobago:tobago-example-assembly Tobago Example Assembly
Discovered a new module org.apache.myfaces.tobago:tobago-theme-example Tobago Theme Example
Discovered a new module org.apache.myfaces.tobago:tobago-assembly Tobago Assembly
Modules changed, recalculating dependency graph
maven3-agent.jar already up to date
maven3-interceptor.jar already up to date
maven3-interceptor-commons.jar already up to date
[tobago-3.0.x] $ /home/jenkins/tools/java/latest1.7/bin/java -Xmx2g -Xms256m -XX:MaxPermSize=512m
-cp /home/jenkins/jenkins-slave/maven3-agent.jar:/home/jenkins/tools/maven/apache-maven-3.0.4/boot/plexus-classworlds-2.4.jar
org.jvnet.hudson.maven3.agent.Maven3Main /home/jenkins/tools/maven/apache-maven-3.0.4 /x1/jenkins/jenkins-slave/slave.jar
/home/jenkins/jenkins-slave/maven3-interceptor.jar /home/jenkins/jenkins-slave/maven3-interceptor-commons.jar
46841
<===[JENKINS REMOTING CAPACITY]===>   channel started
Executing Maven:  -B -f <https://builds.apache.org/job/tobago-3.0.x/ws/tobago-3.0.x/pom.xml>
-Dmaven.repo.local=/home/jenkins/jenkins-slave/maven-repositories/0 -Pall-modules clean animal-sniffer:check
checkstyle:check install
[INFO] Scanning for projects...
[WARNING] 
[WARNING] Some problems were encountered while building the effective model for org.apache.myfaces.tobago:tobago-core:jar:3.0.0-alpha-1-SNAPSHOT
[WARNING] 'reporting.plugins.plugin.version' for net.sourceforge.maven-taglib:maven-taglib-plugin
is missing. @ line 130, column 15
[WARNING] 
[WARNING] Some problems were encountered while building the effective model for org.apache.myfaces.tobago:tobago-sandbox:jar:3.0.0-alpha-1-SNAPSHOT
[WARNING] 'reporting.plugins.plugin.version' for net.sourceforge.maven-taglib:maven-taglib-plugin
is missing. @ line 187, column 15
[WARNING] 
[WARNING] It is highly recommended to fix these problems because they threaten the stability
of your build.
[WARNING] 
[WARNING] For this reason, future Maven versions might no longer support building such malformed
projects.
[WARNING] 
[INFO] ------------------------------------------------------------------------
[INFO] Reactor Build Order:
[INFO] 
[INFO] Apache Tobago
[INFO] Tobago Tool
[INFO] Tobago Tool Annotation
[INFO] Tobago Tool Apt
[INFO] Tobago Maven2 Theme Plugin
[INFO] Tobago Core
[INFO] Tobago Themes
[INFO] Tobago Theme Standard
[INFO] Tobago Theme Scarborough
[INFO] Tobago Theme Speyside
[INFO] Tobago Theme Richmond
[INFO] Tobago Theme Charlotteville
[INFO] tobago-theme-bootstrap
[INFO] Tobago Extensions
[INFO] Tobago Deprecation
[INFO] Tobago Fileupload
[INFO] Tobago Sandbox
[INFO] Tobago Security
[INFO] Tobago Examples
[INFO] Tobago Example Addressbook (Java EE 6)
[INFO] Tobago Example Blank
[INFO] Tobago Example Data
[INFO] Tobago Example Demo
[INFO] Tobago Example Test
[INFO] Tobago Example for Portlets
[INFO] Tobago Example Sandbox
[INFO] Tobago Example Security
[INFO] Tobago Example Assembly
[INFO] Tobago Theme Example
[INFO] Tobago Assembly
[INFO]                                                                         
[INFO] ------------------------------------------------------------------------
[INFO] Building Apache Tobago 3.0.0-alpha-1-SNAPSHOT
[INFO] ------------------------------------------------------------------------
[INFO] 
[INFO] --- maven-clean-plugin:2.4.1:clean (default-clean) @ tobago ---
[INFO] 
[INFO] --- animal-sniffer-maven-plugin:1.7:check (default-cli) @ tobago ---
[INFO] Checking unresolved references to org.codehaus.mojo.signature:java15:1.0
[INFO] 
[INFO] --- maven-checkstyle-plugin:2.9:check (default-cli) @ tobago ---
[INFO] 
[INFO] 
[INFO] --- maven-enforcer-plugin:1.1:enforce (enforce) @ tobago ---
[WARNING] Rule 0: org.apache.maven.plugins.enforcer.RequireMavenVersion failed with message:
Detected Maven Version: 3.0.4 is not in the allowed range 3.3.1.
[INFO] ------------------------------------------------------------------------
[INFO] Reactor Summary:
[INFO] 
[INFO] Apache Tobago ..................................... FAILURE [5.118s]
[INFO] Tobago Tool ....................................... SKIPPED
[INFO] Tobago Tool Annotation ............................ SKIPPED
[INFO] Tobago Tool Apt ................................... SKIPPED
[INFO] Tobago Maven2 Theme Plugin ........................ SKIPPED
[INFO] Tobago Core ....................................... SKIPPED
[INFO] Tobago Themes ..................................... SKIPPED
[INFO] Tobago Theme Standard ............................. SKIPPED
[INFO] Tobago Theme Scarborough .......................... SKIPPED
[INFO] Tobago Theme Speyside ............................. SKIPPED
[INFO] Tobago Theme Richmond ............................. SKIPPED
[INFO] Tobago Theme Charlotteville ....................... SKIPPED
[INFO] tobago-theme-bootstrap ............................ SKIPPED
[INFO] Tobago Extensions ................................. SKIPPED
[INFO] Tobago Deprecation ................................ SKIPPED
[INFO] Tobago Fileupload ................................. SKIPPED
[INFO] Tobago Sandbox .................................... SKIPPED
[INFO] Tobago Security ................................... SKIPPED
[INFO] Tobago Examples ................................... SKIPPED
[INFO] Tobago Example Addressbook (Java EE 6) ............ SKIPPED
[INFO] Tobago Example Blank .............................. SKIPPED
[INFO] Tobago Example Data ............................... SKIPPED
[INFO] Tobago Example Demo ............................... SKIPPED
[INFO] Tobago Example Test ............................... SKIPPED
[INFO] Tobago Example for Portlets ....................... SKIPPED
[INFO] Tobago Example Sandbox ............................ SKIPPED
[INFO] Tobago Example Security ........................... SKIPPED
[INFO] Tobago Example Assembly ........................... SKIPPED
[INFO] Tobago Theme Example .............................. SKIPPED
[INFO] Tobago Assembly ................................... SKIPPED
[INFO] ------------------------------------------------------------------------
[INFO] BUILD FAILURE
[INFO] ------------------------------------------------------------------------
[INFO] Total time: 7.921s
[INFO] Finished at: Fri May 29 07:38:08 UTC 2015
[INFO] Final Memory: 20M/250M
[INFO] ------------------------------------------------------------------------
Waiting for Jenkins to finish collecting data
[ERROR] Failed to execute goal org.apache.maven.plugins:maven-enforcer-plugin:1.1:enforce
(enforce) on project tobago: Some Enforcer rules have failed. Look above for specific messages
explaining why the rule failed. -> [Help 1]
[ERROR] 
[ERROR] To see the full stack trace of the errors, re-run Maven with the -e switch.
[ERROR] Re-run Maven using the -X switch to enable full debug logging.
[ERROR] 
[ERROR] For more information about the errors and possible solutions, please read the following
articles:
[ERROR] [Help 1] http://cwiki.apache.org/confluence/display/MAVEN/MojoExecutionException
[JENKINS] Archiving <https://builds.apache.org/job/tobago-3.0.x/ws/tobago-3.0.x/tobago-assembly/pom.xml>
to org.apache.myfaces.tobago/tobago-assembly/3.0.0-alpha-1-SNAPSHOT/tobago-assembly-3.0.0-alpha-1-SNAPSHOT.pom
No prior successful build to compare, so performing full copy of artifacts
[JENKINS] Archiving <https://builds.apache.org/job/tobago-3.0.x/ws/tobago-3.0.x/tobago-extension/tobago-sandbox/pom.xml>
to org.apache.myfaces.tobago/tobago-sandbox/3.0.0-alpha-1-SNAPSHOT/tobago-sandbox-3.0.0-alpha-1-SNAPSHOT.pom
No prior successful build to compare, so performing full copy of artifacts
[JENKINS] Archiving <https://builds.apache.org/job/tobago-3.0.x/ws/tobago-3.0.x/tobago-theme/tobago-theme-speyside/pom.xml>
to org.apache.myfaces.tobago/tobago-theme-speyside/3.0.0-alpha-1-SNAPSHOT/tobago-theme-speyside-3.0.0-alpha-1-SNAPSHOT.pom
No prior successful build to compare, so performing full copy of artifacts
[JENKINS] Archiving <https://builds.apache.org/job/tobago-3.0.x/ws/tobago-3.0.x/tobago-tool/tobago-theme-plugin/pom.xml>
to org.apache.myfaces.tobago/tobago-theme-plugin/3.0.0-alpha-1-SNAPSHOT/tobago-theme-plugin-3.0.0-alpha-1-SNAPSHOT.pom
No prior successful build to compare, so performing full copy of artifacts
[JENKINS] Archiving <https://builds.apache.org/job/tobago-3.0.x/ws/tobago-3.0.x/tobago-example/tobago-example-portlet/pom.xml>
to org.apache.myfaces.tobago/tobago-example-portlet/3.0.0-alpha-1-SNAPSHOT/tobago-example-portlet-3.0.0-alpha-1-SNAPSHOT.pom
No prior successful build to compare, so performing full copy of artifacts
[JENKINS] Archiving <https://builds.apache.org/job/tobago-3.0.x/ws/tobago-3.0.x/tobago-example/tobago-example-data/pom.xml>
to org.apache.myfaces.tobago/tobago-example-data/3.0.0-alpha-1-SNAPSHOT/tobago-example-data-3.0.0-alpha-1-SNAPSHOT.pom
No prior successful build to compare, so performing full copy of artifacts
[JENKINS] Archiving <https://builds.apache.org/job/tobago-3.0.x/ws/tobago-3.0.x/tobago-example/tobago-theme-example/pom.xml>
to org.apache.myfaces.tobago/tobago-theme-example/3.0.0-alpha-1-SNAPSHOT/tobago-theme-example-3.0.0-alpha-1-SNAPSHOT.pom
No prior successful build to compare, so performing full copy of artifacts
[JENKINS] Archiving <https://builds.apache.org/job/tobago-3.0.x/ws/tobago-3.0.x/tobago-theme/tobago-theme-bootstrap/pom.xml>
to org.apache.myfaces.tobago/tobago-theme-bootstrap/3.0.0-alpha-1-SNAPSHOT/tobago-theme-bootstrap-3.0.0-alpha-1-SNAPSHOT.pom
No prior successful build to compare, so performing full copy of artifacts
[JENKINS] Archiving <https://builds.apache.org/job/tobago-3.0.x/ws/tobago-3.0.x/tobago-example/pom.xml>
to org.apache.myfaces.tobago/tobago-example/3.0.0-alpha-1-SNAPSHOT/tobago-example-3.0.0-alpha-1-SNAPSHOT.pom
No prior successful build to compare, so performing full copy of artifacts
[JENKINS] Archiving <https://builds.apache.org/job/tobago-3.0.x/ws/tobago-3.0.x/tobago-core/pom.xml>
to org.apache.myfaces.tobago/tobago-core/3.0.0-alpha-1-SNAPSHOT/tobago-core-3.0.0-alpha-1-SNAPSHOT.pom
No prior successful build to compare, so performing full copy of artifacts
[JENKINS] Archiving <https://builds.apache.org/job/tobago-3.0.x/ws/tobago-3.0.x/tobago-example/tobago-example-blank/pom.xml>
to org.apache.myfaces.tobago/tobago-example-blank/3.0.0-alpha-1-SNAPSHOT/tobago-example-blank-3.0.0-alpha-1-SNAPSHOT.pom
No prior successful build to compare, so performing full copy of artifacts
[JENKINS] Archiving <https://builds.apache.org/job/tobago-3.0.x/ws/tobago-3.0.x/tobago-theme/pom.xml>
to org.apache.myfaces.tobago/tobago-theme/3.0.0-alpha-1-SNAPSHOT/tobago-theme-3.0.0-alpha-1-SNAPSHOT.pom
No prior successful build to compare, so performing full copy of artifacts
[JENKINS] Archiving <https://builds.apache.org/job/tobago-3.0.x/ws/tobago-3.0.x/tobago-tool/tobago-tool-annotation/pom.xml>
to org.apache.myfaces.tobago/tobago-tool-annotation/3.0.0-alpha-1-SNAPSHOT/tobago-tool-annotation-3.0.0-alpha-1-SNAPSHOT.pom
No prior successful build to compare, so performing full copy of artifacts
[JENKINS] Archiving <https://builds.apache.org/job/tobago-3.0.x/ws/tobago-3.0.x/tobago-theme/tobago-theme-richmond/pom.xml>
to org.apache.myfaces.tobago/tobago-theme-richmond/3.0.0-alpha-1-SNAPSHOT/tobago-theme-richmond-3.0.0-alpha-1-SNAPSHOT.pom
No prior successful build to compare, so performing full copy of artifacts
[JENKINS] Archiving <https://builds.apache.org/job/tobago-3.0.x/ws/tobago-3.0.x/tobago-example/tobago-example-sandbox/pom.xml>
to org.apache.myfaces.tobago/tobago-example-sandbox/3.0.0-alpha-1-SNAPSHOT/tobago-example-sandbox-3.0.0-alpha-1-SNAPSHOT.pom
No prior successful build to compare, so performing full copy of artifacts
[JENKINS] Archiving <https://builds.apache.org/job/tobago-3.0.x/ws/tobago-3.0.x/tobago-theme/tobago-theme-standard/pom.xml>
to org.apache.myfaces.tobago/tobago-theme-standard/3.0.0-alpha-1-SNAPSHOT/tobago-theme-standard-3.0.0-alpha-1-SNAPSHOT.pom
No prior successful build to compare, so performing full copy of artifacts
[JENKINS] Archiving <https://builds.apache.org/job/tobago-3.0.x/ws/tobago-3.0.x/tobago-example/tobago-example-security/pom.xml>
to org.apache.myfaces.tobago/tobago-example-security/3.0.0-alpha-1-SNAPSHOT/tobago-example-security-3.0.0-alpha-1-SNAPSHOT.pom
No prior successful build to compare, so performing full copy of artifacts
[JENKINS] Archiving <https://builds.apache.org/job/tobago-3.0.x/ws/tobago-3.0.x/tobago-example/tobago-example-addressbook/pom.xml>
to org.apache.myfaces.tobago/tobago-example-addressbook/3.0.0-alpha-1-SNAPSHOT/tobago-example-addressbook-3.0.0-alpha-1-SNAPSHOT.pom
No prior successful build to compare, so performing full copy of artifacts
[JENKINS] Archiving <https://builds.apache.org/job/tobago-3.0.x/ws/tobago-3.0.x/tobago-tool/tobago-tool-apt/pom.xml>
to org.apache.myfaces.tobago/tobago-tool-apt/3.0.0-alpha-1-SNAPSHOT/tobago-tool-apt-3.0.0-alpha-1-SNAPSHOT.pom
No prior successful build to compare, so performing full copy of artifacts
[JENKINS] Archiving <https://builds.apache.org/job/tobago-3.0.x/ws/tobago-3.0.x/tobago-tool/pom.xml>
to org.apache.myfaces.tobago/tobago-tool/3.0.0-alpha-1-SNAPSHOT/tobago-tool-3.0.0-alpha-1-SNAPSHOT.pom
No prior successful build to compare, so performing full copy of artifacts
[JENKINS] Archiving <https://builds.apache.org/job/tobago-3.0.x/ws/tobago-3.0.x/tobago-extension/tobago-deprecation/pom.xml>
to org.apache.myfaces.tobago/tobago-deprecation/3.0.0-alpha-1-SNAPSHOT/tobago-deprecation-3.0.0-alpha-1-SNAPSHOT.pom
No prior successful build to compare, so performing full copy of artifacts
[JENKINS] Archiving <https://builds.apache.org/job/tobago-3.0.x/ws/tobago-3.0.x/tobago-extension/tobago-fileupload/pom.xml>
to org.apache.myfaces.tobago/tobago-fileupload/3.0.0-alpha-1-SNAPSHOT/tobago-fileupload-3.0.0-alpha-1-SNAPSHOT.pom
No prior successful build to compare, so performing full copy of artifacts
[JENKINS] Archiving <https://builds.apache.org/job/tobago-3.0.x/ws/tobago-3.0.x/tobago-example/tobago-example-demo/pom.xml>
to org.apache.myfaces.tobago/tobago-example-demo/3.0.0-alpha-1-SNAPSHOT/tobago-example-demo-3.0.0-alpha-1-SNAPSHOT.pom
No prior successful build to compare, so performing full copy of artifacts
[JENKINS] Archiving <https://builds.apache.org/job/tobago-3.0.x/ws/tobago-3.0.x/tobago-extension/pom.xml>
to org.apache.myfaces.tobago/tobago-extension/3.0.0-alpha-1-SNAPSHOT/tobago-extension-3.0.0-alpha-1-SNAPSHOT.pom
No prior successful build to compare, so performing full copy of artifacts
[JENKINS] Archiving <https://builds.apache.org/job/tobago-3.0.x/ws/tobago-3.0.x/tobago-theme/tobago-theme-charlotteville/pom.xml>
to org.apache.myfaces.tobago/tobago-theme-charlotteville/3.0.0-alpha-1-SNAPSHOT/tobago-theme-charlotteville-3.0.0-alpha-1-SNAPSHOT.pom
No prior successful build to compare, so performing full copy of artifacts
[JENKINS] Archiving <https://builds.apache.org/job/tobago-3.0.x/ws/tobago-3.0.x/tobago-extension/tobago-security/pom.xml>
to org.apache.myfaces.tobago/tobago-security/3.0.0-alpha-1-SNAPSHOT/tobago-security-3.0.0-alpha-1-SNAPSHOT.pom
No prior successful build to compare, so performing full copy of artifacts
[JENKINS] Archiving <https://builds.apache.org/job/tobago-3.0.x/ws/tobago-3.0.x/tobago-example/tobago-example-assembly/pom.xml>
to org.apache.myfaces.tobago/tobago-example-assembly/3.0.0-alpha-1-SNAPSHOT/tobago-example-assembly-3.0.0-alpha-1-SNAPSHOT.pom
No prior successful build to compare, so performing full copy of artifacts
[JENKINS] Archiving <https://builds.apache.org/job/tobago-3.0.x/ws/tobago-3.0.x/pom.xml>
to org.apache.myfaces.tobago/tobago/3.0.0-alpha-1-SNAPSHOT/tobago-3.0.0-alpha-1-SNAPSHOT.pom
No prior successful build to compare, so performing full copy of artifacts
[JENKINS] Archiving <https://builds.apache.org/job/tobago-3.0.x/ws/tobago-3.0.x/tobago-example/tobago-example-test/pom.xml>
to org.apache.myfaces.tobago/tobago-example-test/3.0.0-alpha-1-SNAPSHOT/tobago-example-test-3.0.0-alpha-1-SNAPSHOT.pom
No prior successful build to compare, so performing full copy of artifacts
[JENKINS] Archiving <https://builds.apache.org/job/tobago-3.0.x/ws/tobago-3.0.x/tobago-theme/tobago-theme-scarborough/pom.xml>
to org.apache.myfaces.tobago/tobago-theme-scarborough/3.0.0-alpha-1-SNAPSHOT/tobago-theme-scarborough-3.0.0-alpha-1-SNAPSHOT.pom
No prior successful build to compare, so performing full copy of artifacts
Sending e-mails to: commits@myfaces.apache.org
channel stopped

Mime
View raw message