myfaces-commits mailing list archives

Site index · List index
Message view « Date » · « Thread »
Top « Date » · « Thread »
From Apache Jenkins Server <jenk...@builds.apache.org>
Subject Build failed in Jenkins: myfaces-current-2.0 #3168
Date Tue, 25 Aug 2015 00:20:39 GMT
See <https://builds.apache.org/job/myfaces-current-2.0/3168/>

------------------------------------------
[...truncated 13 lines...]
A         test-webapp/jar/src/main/java
A         test-webapp/jar/src/main/resources
A         test-webapp/jar/src/main/resources/META-INF
A         test-webapp/jar/src/main/resources/META-INF/resources
AU        test-webapp/jar/pom.xml
A         test-webapp/webapp
AU        test-webapp/webapp/pom.xml
A         test-webapp/webapp/src
A         test-webapp/webapp/src/main
A         test-webapp/webapp/src/main/resources
A         test-webapp/webapp/src/main/resources/test
AU        test-webapp/webapp/src/main/resources/test/messages.properties
A         test-webapp/webapp/src/main/resources/org
A         test-webapp/webapp/src/main/resources/org/apache
A         test-webapp/webapp/src/main/resources/org/apache/myfaces
A         test-webapp/webapp/src/main/resources/org/apache/myfaces/examples
A         test-webapp/webapp/src/main/resources/org/apache/myfaces/examples/resource
AU        test-webapp/webapp/src/main/resources/org/apache/myfaces/examples/resource/example_messages_en.properties
AU        test-webapp/webapp/src/main/resources/org/apache/myfaces/examples/resource/example_messages_ca.properties
AU        test-webapp/webapp/src/main/resources/org/apache/myfaces/examples/resource/example_messages_pt_BR.properties
AU        test-webapp/webapp/src/main/resources/org/apache/myfaces/examples/resource/example_messages_ru.properties
AU        test-webapp/webapp/src/main/resources/org/apache/myfaces/examples/resource/example_messages_es.properties
AU        test-webapp/webapp/src/main/resources/org/apache/myfaces/examples/resource/example_messages_fr.properties
AU        test-webapp/webapp/src/main/resources/org/apache/myfaces/examples/resource/example_messages_de.properties
AU        test-webapp/webapp/src/main/resources/org/apache/myfaces/examples/resource/example_messages_ja.properties
AU        test-webapp/webapp/src/main/resources/org/apache/myfaces/examples/resource/build.properties
AU        test-webapp/webapp/src/main/resources/org/apache/myfaces/examples/resource/example_messages.properties
AU        test-webapp/webapp/src/main/resources/org/apache/myfaces/examples/resource/example_messages_zh.properties
A         test-webapp/webapp/src/main/webapp
A         test-webapp/webapp/src/main/webapp/step3.xhtml
A         test-webapp/webapp/src/main/webapp/multipleRenderKit.xhtml
A         test-webapp/webapp/src/main/webapp/labelattribute.xhtml
A         test-webapp/webapp/src/main/webapp/forEachInclude.xhtml
AU        test-webapp/webapp/src/main/webapp/page.jsp
AU        test-webapp/webapp/src/main/webapp/flashhw1.xhtml
A         test-webapp/webapp/src/main/webapp/resources
A         test-webapp/webapp/src/main/webapp/resources/testComposite
A         test-webapp/webapp/src/main/webapp/resources/testComposite/simpleInsertChildren.xhtml
A         test-webapp/webapp/src/main/webapp/resources/testComposite/compositeInsertChildren.xhtml
A         test-webapp/webapp/src/main/webapp/resources/testComposite/simpleInsertFacet.xhtml
AU        test-webapp/webapp/src/main/webapp/resources/basic.css
AU        test-webapp/webapp/src/main/webapp/flash2.xhtml
A         test-webapp/webapp/src/main/webapp/comp2.xhtml
A         test-webapp/webapp/src/main/webapp/if2.xhtml
A         test-webapp/webapp/src/main/webapp/imageCommand.xhtml
A         test-webapp/webapp/src/main/webapp/comp4.xhtml
A         test-webapp/webapp/src/main/webapp/onclick.xhtml
A         test-webapp/webapp/src/main/webapp/ajax1n.xhtml
A         test-webapp/webapp/src/main/webapp/convertBig2.xhtml
A         test-webapp/webapp/src/main/webapp/bundleWithEL.xhtml
AU        test-webapp/webapp/src/main/webapp/flashprg1.xhtml
A         test-webapp/webapp/src/main/webapp/convertBig.xhtml
A         test-webapp/webapp/src/main/webapp/ajax1.xhtml
A         test-webapp/webapp/src/main/webapp/cc1.xhtml
A         test-webapp/webapp/src/main/webapp/ajax3.xhtml
AU        test-webapp/webapp/src/main/webapp/flashKeep4_2.xhtml
AU        test-webapp/webapp/src/main/webapp/index.jsp
A         test-webapp/webapp/src/main/webapp/cc3.xhtml
A         test-webapp/webapp/src/main/webapp/bundleTest.xhtml
AU        test-webapp/webapp/src/main/webapp/helloWorld.jsp
A         test-webapp/webapp/src/main/webapp/invokeOnComponent.xhtml
AU        test-webapp/webapp/src/main/webapp/test.jsp
A         test-webapp/webapp/src/main/webapp/bindingCLV.xhtml
AU        test-webapp/webapp/src/main/webapp/flashKeep1.xhtml
A         test-webapp/webapp/src/main/webapp/ajax4n.xhtml
AU        test-webapp/webapp/src/main/webapp/ajax5jsp.jsp
AU        test-webapp/webapp/src/main/webapp/flashKeep3.xhtml
A         test-webapp/webapp/src/main/webapp/suppressRuntimeEx.xhtml
A         test-webapp/webapp/src/main/webapp/phaseMethodsUIRoot.xhtml
A         test-webapp/webapp/src/main/webapp/flashg2.xhtml
A         test-webapp/webapp/src/main/webapp/selectOneMenuEnum.xhtml
A         test-webapp/webapp/src/main/webapp/column.xhtml
AU        test-webapp/webapp/src/main/webapp/helloWorld2.jsp
AU        test-webapp/webapp/src/main/webapp/forEachInclude2.jsp
A         test-webapp/webapp/src/main/webapp/step2.xhtml
AU        test-webapp/webapp/src/main/webapp/page2.jsp
AU        test-webapp/webapp/src/main/webapp/forEachInclude3.jsp
A         test-webapp/webapp/src/main/webapp/detectPostback.xhtml
AU        test-webapp/webapp/src/main/webapp/forEachInclude4.jsp
AU        test-webapp/webapp/src/main/webapp/test2.jsp
A         test-webapp/webapp/src/main/webapp/bindingCLV2.xhtml
A         test-webapp/webapp/src/main/webapp/checkScriptInline.xhtml
AU        test-webapp/webapp/src/main/webapp/test3.jsp
A         test-webapp/webapp/src/main/webapp/prettyOutRB.xhtml
A         test-webapp/webapp/src/main/webapp/layoutMessages.xhtml
AU        test-webapp/webapp/src/main/webapp/forEachTest.jsp
A         test-webapp/webapp/src/main/webapp/selectOneMenuEnum2.xhtml
AU        test-webapp/webapp/src/main/webapp/flashhw2.xhtml
AU        test-webapp/webapp/src/main/webapp/flash1.xhtml
A         test-webapp/webapp/src/main/webapp/if1.xhtml
A         test-webapp/webapp/src/main/webapp/checkScriptCommandLink.xhtml
AU        test-webapp/webapp/src/main/webapp/flash3.xhtml
A         test-webapp/webapp/src/main/webapp/comp3.xhtml
A         test-webapp/webapp/src/main/webapp/ajax3n.xhtml
AU        test-webapp/webapp/src/main/webapp/flashprg2.xhtml
A         test-webapp/webapp/src/main/webapp/viewparamLayout.xhtml
A         test-webapp/webapp/src/main/webapp/hideShowRadio.xhtml
A         test-webapp/webapp/src/main/webapp/nullSelectItem.xhtml
A         test-webapp/webapp/src/main/webapp/viewparam.xhtml
A         test-webapp/webapp/src/main/webapp/convertDateTime.xhtml
A         test-webapp/webapp/src/main/webapp/setProperty.xhtml
A         test-webapp/webapp/src/main/webapp/ajax2.xhtml
AU        test-webapp/webapp/src/main/webapp/flashKeep4_1.xhtml
AU        test-webapp/webapp/src/main/webapp/pageScope.jsp
A         test-webapp/webapp/src/main/webapp/forEach.xhtml
A         test-webapp/webapp/src/main/webapp/cc2.xhtml
A         test-webapp/webapp/src/main/webapp/cc4.xhtml
A         test-webapp/webapp/src/main/webapp/layoutPanelGroup.xhtml
A         test-webapp/webapp/src/main/webapp/viewparam2.xhtml
AU        test-webapp/webapp/src/main/webapp/comp2.jsp
AU        test-webapp/webapp/src/main/webapp/comp3.jsp
A         test-webapp/webapp/src/main/webapp/verbatimRendered.xhtml
A         test-webapp/webapp/src/main/webapp/commandParams.xhtml
AU        test-webapp/webapp/src/main/webapp/comp4.jsp
A         test-webapp/webapp/src/main/webapp/ajax2n.xhtml
AU        test-webapp/webapp/src/main/webapp/flashKeep2.xhtml
A         test-webapp/webapp/src/main/webapp/disabledLink.xhtml
A         test-webapp/webapp/src/main/webapp/flashg1.xhtml
AU        test-webapp/webapp/src/main/webapp/flashKeep4.xhtml
A         test-webapp/webapp/src/main/webapp/selectOneManyEscape.xhtml
A         test-webapp/webapp/src/main/webapp/home.xhtml
A         test-webapp/webapp/src/main/webapp/WEB-INF
AU        test-webapp/webapp/src/main/webapp/WEB-INF/faces-config.xml
AU        test-webapp/webapp/src/main/webapp/WEB-INF/web.xml
A         test-webapp/webapp/src/main/webapp/step1.xhtml
A         test-webapp/webapp/src/main/log4j
AU        test-webapp/webapp/src/main/log4j/log4j.properties
A         test-webapp/webapp/src/main/java
A         test-webapp/webapp/src/main/java/org
A         test-webapp/webapp/src/main/java/org/apache
A         test-webapp/webapp/src/main/java/org/apache/myfaces
A         test-webapp/webapp/src/main/java/org/apache/myfaces/setprop
AU        test-webapp/webapp/src/main/java/org/apache/myfaces/setprop/SetPropertyBean.java
A         test-webapp/webapp/src/main/java/org/apache/myfaces/flash
AU        test-webapp/webapp/src/main/java/org/apache/myfaces/flash/HelloWorldFlashBean.java
AU        test-webapp/webapp/src/main/java/org/apache/myfaces/flash/FlashBean.java
A         test-webapp/webapp/src/main/java/org/apache/myfaces/convertDateTime
AU        test-webapp/webapp/src/main/java/org/apache/myfaces/convertDateTime/DateTimeBean.java
A         test-webapp/webapp/src/main/java/org/apache/myfaces/selectItem
AU        test-webapp/webapp/src/main/java/org/apache/myfaces/selectItem/SelectItemBean.java
AU        test-webapp/webapp/src/main/java/org/apache/myfaces/selectItem/SelectItemEscapeBean.java
A         test-webapp/webapp/src/main/java/org/apache/myfaces/testif
AU        test-webapp/webapp/src/main/java/org/apache/myfaces/testif/HelloWorldIfBean.java
A         test-webapp/webapp/src/main/java/org/apache/myfaces/convertbig
AU        test-webapp/webapp/src/main/java/org/apache/myfaces/convertbig/ConvertBigBean.java
A         test-webapp/webapp/src/main/java/org/apache/myfaces/phaseuiroot
AU        test-webapp/webapp/src/main/java/org/apache/myfaces/phaseuiroot/PhaseMethodsUIRootBean.java
A         test-webapp/webapp/src/main/java/org/apache/myfaces/enumtest
AU        test-webapp/webapp/src/main/java/org/apache/myfaces/enumtest/EnumBean.java
A         test-webapp/webapp/src/main/java/org/apache/myfaces/postback
AU        test-webapp/webapp/src/main/java/org/apache/myfaces/postback/PostbackBean.java
A         test-webapp/webapp/src/main/java/org/apache/myfaces/disabled
AU        test-webapp/webapp/src/main/java/org/apache/myfaces/disabled/DisabledBean.java
A         test-webapp/webapp/src/main/java/org/apache/myfaces/jstl
AU        test-webapp/webapp/src/main/java/org/apache/myfaces/jstl/ListBean.java
A         test-webapp/webapp/src/main/java/org/apache/myfaces/examples
A         test-webapp/webapp/src/main/java/org/apache/myfaces/examples/example1
AU        test-webapp/webapp/src/main/java/org/apache/myfaces/examples/example1/ValidationController.java
AU        test-webapp/webapp/src/main/java/org/apache/myfaces/examples/example1/CalcActionListener.java
AU        test-webapp/webapp/src/main/java/org/apache/myfaces/examples/example1/CalcForm.java
A         test-webapp/webapp/src/main/java/org/apache/myfaces/examples/listexample
AU        test-webapp/webapp/src/main/java/org/apache/myfaces/examples/listexample/SimpleCountryList.java
AU        test-webapp/webapp/src/main/java/org/apache/myfaces/examples/listexample/SimpleCountry.java
AU        test-webapp/webapp/src/main/java/org/apache/myfaces/examples/listexample/SimpleCity.java
A         test-webapp/webapp/src/main/java/org/apache/myfaces/test
AU        test-webapp/webapp/src/main/java/org/apache/myfaces/test/Bean.java
A         test-webapp/webapp/src/main/java/org/apache/myfaces/bindingCLV
AU        test-webapp/webapp/src/main/java/org/apache/myfaces/bindingCLV/DelegateActionListener.java
AU        test-webapp/webapp/src/main/java/org/apache/myfaces/bindingCLV/DummyActionListener.java
AU        test-webapp/webapp/src/main/java/org/apache/myfaces/bindingCLV/DelegateValidator.java
AU        test-webapp/webapp/src/main/java/org/apache/myfaces/bindingCLV/ActionListenerImplTag.java
AU        test-webapp/webapp/src/main/java/org/apache/myfaces/bindingCLV/DummyValidator.java
AU        test-webapp/webapp/src/main/java/org/apache/myfaces/bindingCLV/DelegateConverter.java
AU        test-webapp/webapp/src/main/java/org/apache/myfaces/bindingCLV/ValidatorImplTag.java
AU        test-webapp/webapp/src/main/java/org/apache/myfaces/bindingCLV/BindingCLVBean.java
AU        test-webapp/webapp/src/main/java/org/apache/myfaces/bindingCLV/ConverterImplTag.java
A         test-webapp/webapp/src/main/java/org/apache/myfaces/runtimeex
AU        test-webapp/webapp/src/main/java/org/apache/myfaces/runtimeex/HelloWorldThrowExBean.java
A         test-webapp/webapp/src/main/java/org/apache/myfaces/commandParams
AU        test-webapp/webapp/src/main/java/org/apache/myfaces/commandParams/CommandParamBean.java
A         test-webapp/webapp/src/main/java/org/apache/myfaces/servlet
AU        test-webapp/webapp/src/main/java/org/apache/myfaces/servlet/SourceCodeServlet.java
A         test-webapp/webapp/src/main/java/org/apache/myfaces/testcc
AU        test-webapp/webapp/src/main/java/org/apache/myfaces/testcc/InvokeOnComponentChangeStyleBean.java
A         test-webapp/webapp/src/main/java/org/apache/myfaces/blank
AU        test-webapp/webapp/src/main/java/org/apache/myfaces/blank/NumberBean.java
AU        test-webapp/webapp/src/main/java/org/apache/myfaces/blank/HelloWorldController.java
AU        test-webapp/webapp/src/main/java/org/apache/myfaces/blank/HelloWorldBacking.java
A         test-webapp/webapp/src/main/java/org/apache/myfaces/renderkit
AU        test-webapp/webapp/src/main/java/org/apache/myfaces/renderkit/CustomRenderKit.java
A         test-webapp/webapp/src/main/java/org/apache/myfaces/invoke
AU        test-webapp/webapp/src/main/java/org/apache/myfaces/invoke/InvokeOnComponentBean.java
A         test-webapp/webapp/src/main/java/org/apache/myfaces/viewparam
AU        test-webapp/webapp/src/main/java/org/apache/myfaces/viewparam/RequestViewParamBean.java
AU        test-webapp/webapp/src/main/java/org/apache/myfaces/viewparam/RequestViewParamBean2.java
A         test-webapp/webapp/src/test
A         test-webapp/webapp/src/test/resources
A         test-webapp/webapp/src/test/java
A         test-webapp/webapp/src/test/java/org
A         test-webapp/webapp/src/test/java/org/apache
A         test-webapp/webapp/src/test/java/org/apache/myfaces
A         test-webapp/webapp/src/test/java/org/apache/myfaces/test
AU        test-webapp/webapp/src/test/java/org/apache/myfaces/test/Constants.java
A         test-webapp/webapp/src/test/java/org/apache/myfaces/test/it
AU        test-webapp/webapp/src/test/java/org/apache/myfaces/test/it/HelloWorldTest.java
AU        test-webapp/webapp/src/test/java/org/apache/myfaces/test/it/WebappTest.java
AU        test-webapp/webapp/src/test/java/org/apache/myfaces/test/it/Ajax1Test.java
AU        test-webapp/webapp/src/test/java/org/apache/myfaces/test/it/AbstractHtmlUnitAjaxTestCase.java
AU        pom.xml
 U        .
At revision 1697518
no change for http://svn.apache.org/repos/asf/myfaces/current20 since the previous build
Parsing POMs
ERROR: Failed to parse POMs
java.io.IOException: remote file operation failed: <https://builds.apache.org/job/myfaces-current-2.0/ws/current20>
at hudson.remoting.Channel@410c7c27:solaris1
	at hudson.FilePath.act(FilePath.java:916)
	at hudson.FilePath.act(FilePath.java:893)
	at hudson.maven.MavenModuleSetBuild$MavenModuleSetBuildExecution.parsePoms(MavenModuleSetBuild.java:950)
	at hudson.maven.MavenModuleSetBuild$MavenModuleSetBuildExecution.doRun(MavenModuleSetBuild.java:677)
	at hudson.model.AbstractBuild$AbstractBuildExecution.run(AbstractBuild.java:529)
	at hudson.model.Run.execute(Run.java:1706)
	at hudson.maven.MavenModuleSetBuild.run(MavenModuleSetBuild.java:529)
	at hudson.model.ResourceController.execute(ResourceController.java:88)
	at hudson.model.Executor.run(Executor.java:232)
Caused by: hudson.remoting.ProxyException: hudson.maven.MavenModuleSetBuild$MavenExecutionException:
org.apache.maven.project.ProjectBuildingException: Some problems were encountered while processing
the POMs:
[FATAL] Non-readable POM <https://builds.apache.org/job/myfaces-current-2.0/ws/current20/shared/pom.xml>:
<https://builds.apache.org/job/myfaces-current-2.0/ws/current20/shared/pom.xml> (No
such file or directory) @ 

	at hudson.maven.MavenModuleSetBuild$PomParser.invoke(MavenModuleSetBuild.java:1354)
	at hudson.maven.MavenModuleSetBuild$PomParser.invoke(MavenModuleSetBuild.java:1088)
	at hudson.FilePath$FileCallableWrapper.call(FilePath.java:2474)
	at hudson.remoting.UserRequest.perform(UserRequest.java:118)
	at hudson.remoting.UserRequest.perform(UserRequest.java:48)
	at hudson.remoting.Request$2.run(Request.java:328)
	at hudson.remoting.InterceptingExecutorService$1.call(InterceptingExecutorService.java:72)
	at java.util.concurrent.FutureTask$Sync.innerRun(FutureTask.java:303)
	at java.util.concurrent.FutureTask.run(FutureTask.java:138)
	at java.util.concurrent.ThreadPoolExecutor$Worker.runTask(ThreadPoolExecutor.java:886)
	at java.util.concurrent.ThreadPoolExecutor$Worker.run(ThreadPoolExecutor.java:908)
	at java.lang.Thread.run(Thread.java:662)
Caused by: hudson.remoting.ProxyException: org.apache.maven.project.ProjectBuildingException:
Some problems were encountered while processing the POMs:
[FATAL] Non-readable POM <https://builds.apache.org/job/myfaces-current-2.0/ws/current20/shared/pom.xml>:
<https://builds.apache.org/job/myfaces-current-2.0/ws/current20/shared/pom.xml> (No
such file or directory) @ 

	at org.apache.maven.project.DefaultProjectBuilder.build(DefaultProjectBuilder.java:364)
	at hudson.maven.MavenEmbedder.buildProjects(MavenEmbedder.java:361)
	at hudson.maven.MavenEmbedder.readProjects(MavenEmbedder.java:331)
	at hudson.maven.MavenEmbedder.readProject(MavenEmbedder.java:322)
	at hudson.maven.MavenModuleSetBuild$PomParser.readChilds(MavenModuleSetBuild.java:1408)
	at hudson.maven.MavenModuleSetBuild$PomParser.invoke(MavenModuleSetBuild.java:1302)
	... 11 more

Mime
View raw message