myfaces-commits mailing list archives

Site index · List index
Message view « Date » · « Thread »
Top « Date » · « Thread »
From Apache Jenkins Server <jenk...@builds.apache.org>
Subject Build failed in Jenkins: myfaces-maven-achetypes #275
Date Sat, 15 Aug 2015 14:16:37 GMT
See <https://builds.apache.org/job/myfaces-maven-achetypes/275/>

------------------------------------------
[...truncated 1076 lines...]
[INFO] No sources to compile
[INFO] [surefire:test {execution: default-test}]
[INFO] Surefire report directory: <https://builds.apache.org/job/myfaces-maven-achetypes/ws/maven2-archetypes/myfaces-archetype-core-integration-test/target/surefire-reports>

-------------------------------------------------------
 T E S T S
-------------------------------------------------------

Results :

Tests run: 0, Failures: 0, Errors: 0, Skipped: 0

[JENKINS] Recording test results
[INFO] [jar:jar {execution: default-jar}]
[INFO] Building jar: <https://builds.apache.org/job/myfaces-maven-achetypes/ws/maven2-archetypes/myfaces-archetype-core-integration-test/target/myfaces-archetype-core-integration-test-1.0.5-SNAPSHOT.jar>
[INFO] [checkstyle:check {execution: verify-style}]
[INFO] 
[INFO] [install:install {execution: default-install}]
[INFO] Installing <https://builds.apache.org/job/myfaces-maven-achetypes/ws/maven2-archetypes/myfaces-archetype-core-integration-test/target/myfaces-archetype-core-integration-test-1.0.5-SNAPSHOT.jar>
to /home/jenkins/jenkins-slave/maven-repositories/1/org/apache/myfaces/buildtools/myfaces-archetype-core-integration-test/1.0.5-SNAPSHOT/myfaces-archetype-core-integration-test-1.0.5-SNAPSHOT.jar
[INFO] ------------------------------------------------------------------------
[INFO] Building MyFaces Extscript Archetype for JSF 2.0
[INFO]    task-segment: [install]
[INFO] ------------------------------------------------------------------------
[INFO] [remote-resources:process {execution: default}]
[debug] execute contextualize
[INFO] [resources:resources {execution: default-resources}]
[INFO] Using 'UTF-8' encoding to copy filtered resources.
[INFO] Copying 0 resource to META-INF
[INFO] Copying 12 resources
[INFO] Copying 3 resources
[INFO] [compiler:compile {execution: default-compile}]
[INFO] No sources to compile
[debug] execute contextualize
[INFO] [resources:testResources {execution: default-testResources}]
[INFO] Using 'UTF-8' encoding to copy filtered resources.
[INFO] skip non existing resourceDirectory <https://builds.apache.org/job/myfaces-maven-achetypes/ws/maven2-archetypes/myfaces-archetype-extscript-jsf20/src/test/resources>
[INFO] Copying 3 resources
[INFO] [compiler:testCompile {execution: default-testCompile}]
[INFO] No sources to compile
[INFO] [surefire:test {execution: default-test}]
[INFO] Surefire report directory: <https://builds.apache.org/job/myfaces-maven-achetypes/ws/maven2-archetypes/myfaces-archetype-extscript-jsf20/target/surefire-reports>

-------------------------------------------------------
 T E S T S
-------------------------------------------------------

Results :

Tests run: 0, Failures: 0, Errors: 0, Skipped: 0

[JENKINS] Recording test results
[INFO] [jar:jar {execution: default-jar}]
[INFO] Building jar: <https://builds.apache.org/job/myfaces-maven-achetypes/ws/maven2-archetypes/myfaces-archetype-extscript-jsf20/target/myfaces-archetype-extscript-jsf20-1.0.5-SNAPSHOT.jar>
[INFO] [checkstyle:check {execution: verify-style}]
[INFO] 
[INFO] [install:install {execution: default-install}]
[INFO] Installing <https://builds.apache.org/job/myfaces-maven-achetypes/ws/maven2-archetypes/myfaces-archetype-extscript-jsf20/target/myfaces-archetype-extscript-jsf20-1.0.5-SNAPSHOT.jar>
to /home/jenkins/jenkins-slave/maven-repositories/1/org/apache/myfaces/buildtools/myfaces-archetype-extscript-jsf20/1.0.5-SNAPSHOT/myfaces-archetype-extscript-jsf20-1.0.5-SNAPSHOT.jar
[INFO] 
[INFO] 
[INFO] ------------------------------------------------------------------------
[INFO] Reactor Summary:
[INFO] ------------------------------------------------------------------------
[INFO] Apache MyFaces Buildtools Maven2 Archetype Parent ..... SUCCESS [3.738s]
[INFO] MyFaces Basic Archetype ............................... SUCCESS [1.682s]
[INFO] MyFaces 2.0 Basic Archetype ........................... SUCCESS [0.634s]
[INFO] MyFaces 2.0 Basic Debug Archetype ..................... SUCCESS [0.680s]
[INFO] MyFaces 2.0 and OWB Basic Archetype ................... SUCCESS [0.650s]
[INFO] MyFaces Facelets Archetype ............................ SUCCESS [0.691s]
[INFO] MyFaces Portlet Archetype ............................. SUCCESS [0.644s]
[INFO] MyFaces Trinidad Archetype ............................ SUCCESS [0.659s]
[INFO] MyFaces Trinidad 2.0 Archetype ........................ SUCCESS [0.618s]
[INFO] JSF Component Library Archetype ....................... SUCCESS [0.713s]
[INFO] JSF Component Library Archetype For JSF 2.0 ........... SUCCESS [2.113s]
[INFO] MyFaces CODI Archetype for JSF 1.2 .................... SUCCESS [0.967s]
[INFO] MyFaces CODI Archetype for JSF 2.0 .................... SUCCESS [0.883s]
[INFO] MyFaces Core Integration Test Archetype ............... SUCCESS [0.630s]
[INFO] MyFaces Extscript Archetype for JSF 2.0 ............... SUCCESS [0.697s]
[INFO] ------------------------------------------------------------------------
[INFO] ------------------------------------------------------------------------
[INFO] BUILD SUCCESSFUL
[INFO] ------------------------------------------------------------------------
[INFO] Total time: 21 seconds
[INFO] Finished at: Sat Aug 15 14:16:28 UTC 2015
[INFO] Final Memory: 77M/815M
[INFO] ------------------------------------------------------------------------
[JENKINS] Archiving <https://builds.apache.org/job/myfaces-maven-achetypes/ws/maven2-archetypes/myfaces-archetype-helloworld-portlets/pom.xml>
to org.apache.myfaces.buildtools/myfaces-archetype-helloworld-portlets/1.0.5-SNAPSHOT/myfaces-archetype-helloworld-portlets-1.0.5-SNAPSHOT.pom
[JENKINS] Archiving <https://builds.apache.org/job/myfaces-maven-achetypes/ws/maven2-archetypes/myfaces-archetype-helloworld-portlets/target/myfaces-archetype-helloworld-portlets-1.0.5-SNAPSHOT.jar>
to org.apache.myfaces.buildtools/myfaces-archetype-helloworld-portlets/1.0.5-SNAPSHOT/myfaces-archetype-helloworld-portlets-1.0.5-SNAPSHOT.jar
Sending artifact delta relative to myfaces-maven-achetypes ? MyFaces Portlet Archetype #273
Archived 2 artifacts
Archive block size is 32768
Received 0 blocks and 30204 bytes
Compression is 0.0%
Took 43 ms
[JENKINS] Archiving <https://builds.apache.org/job/myfaces-maven-achetypes/ws/maven2-archetypes/myfaces-archetype-jsfcomponents/pom.xml>
to org.apache.myfaces.buildtools/myfaces-archetype-jsfcomponents/1.0.5-SNAPSHOT/myfaces-archetype-jsfcomponents-1.0.5-SNAPSHOT.pom
[JENKINS] Archiving <https://builds.apache.org/job/myfaces-maven-achetypes/ws/maven2-archetypes/myfaces-archetype-jsfcomponents/target/myfaces-archetype-jsfcomponents-1.0.5-SNAPSHOT.jar>
to org.apache.myfaces.buildtools/myfaces-archetype-jsfcomponents/1.0.5-SNAPSHOT/myfaces-archetype-jsfcomponents-1.0.5-SNAPSHOT.jar
Sending artifact delta relative to myfaces-maven-achetypes ? JSF Component Library Archetype
#273
Archived 2 artifacts
Archive block size is 32768
Received 0 blocks and 61206 bytes
Compression is 0.0%
Took 37 ms
[JENKINS] Archiving <https://builds.apache.org/job/myfaces-maven-achetypes/ws/maven2-archetypes/myfaces-archetype-codi-jsf20/pom.xml>
to org.apache.myfaces.buildtools/myfaces-archetype-codi-jsf20/1.0.5-SNAPSHOT/myfaces-archetype-codi-jsf20-1.0.5-SNAPSHOT.pom
[JENKINS] Archiving <https://builds.apache.org/job/myfaces-maven-achetypes/ws/maven2-archetypes/myfaces-archetype-codi-jsf20/target/myfaces-archetype-codi-jsf20-1.0.5-SNAPSHOT.jar>
to org.apache.myfaces.buildtools/myfaces-archetype-codi-jsf20/1.0.5-SNAPSHOT/myfaces-archetype-codi-jsf20-1.0.5-SNAPSHOT.jar
Sending artifact delta relative to myfaces-maven-achetypes ? MyFaces CODI Archetype for JSF
2.0 #273
Archived 2 artifacts
Archive block size is 32768
Received 0 blocks and 28247 bytes
Compression is 0.0%
Took 35 ms
[JENKINS] Archiving <https://builds.apache.org/job/myfaces-maven-achetypes/ws/maven2-archetypes/myfaces-archetype-helloworld20-debug/pom.xml>
to org.apache.myfaces.buildtools/myfaces-archetype-helloworld20-debug/1.0.5-SNAPSHOT/myfaces-archetype-helloworld20-debug-1.0.5-SNAPSHOT.pom
[JENKINS] Archiving <https://builds.apache.org/job/myfaces-maven-achetypes/ws/maven2-archetypes/myfaces-archetype-helloworld20-debug/target/myfaces-archetype-helloworld20-debug-1.0.5-SNAPSHOT.jar>
to org.apache.myfaces.buildtools/myfaces-archetype-helloworld20-debug/1.0.5-SNAPSHOT/myfaces-archetype-helloworld20-debug-1.0.5-SNAPSHOT.jar
Sending artifact delta relative to myfaces-maven-achetypes ? MyFaces 2.0 Basic Debug Archetype
#273
Archived 2 artifacts
Archive block size is 32768
Received 0 blocks and 29754 bytes
Compression is 0.0%
Took 40 ms
[JENKINS] Archiving <https://builds.apache.org/job/myfaces-maven-achetypes/ws/maven2-archetypes/myfaces-archetype-trinidad20/pom.xml>
to org.apache.myfaces.buildtools/myfaces-archetype-trinidad20/1.0.5-SNAPSHOT/myfaces-archetype-trinidad20-1.0.5-SNAPSHOT.pom
[JENKINS] Archiving <https://builds.apache.org/job/myfaces-maven-achetypes/ws/maven2-archetypes/myfaces-archetype-trinidad20/target/myfaces-archetype-trinidad20-1.0.5-SNAPSHOT.jar>
to org.apache.myfaces.buildtools/myfaces-archetype-trinidad20/1.0.5-SNAPSHOT/myfaces-archetype-trinidad20-1.0.5-SNAPSHOT.jar
Sending artifact delta relative to myfaces-maven-achetypes ? MyFaces Trinidad 2.0 Archetype
#273
Archived 2 artifacts
Archive block size is 32768
Received 0 blocks and 20408 bytes
Compression is 0.0%
Took 41 ms
[JENKINS] Archiving <https://builds.apache.org/job/myfaces-maven-achetypes/ws/maven2-archetypes/myfaces-archetype-helloworld-facelets/pom.xml>
to org.apache.myfaces.buildtools/myfaces-archetype-helloworld-facelets/1.0.5-SNAPSHOT/myfaces-archetype-helloworld-facelets-1.0.5-SNAPSHOT.pom
[JENKINS] Archiving <https://builds.apache.org/job/myfaces-maven-achetypes/ws/maven2-archetypes/myfaces-archetype-helloworld-facelets/target/myfaces-archetype-helloworld-facelets-1.0.5-SNAPSHOT.jar>
to org.apache.myfaces.buildtools/myfaces-archetype-helloworld-facelets/1.0.5-SNAPSHOT/myfaces-archetype-helloworld-facelets-1.0.5-SNAPSHOT.jar
Sending artifact delta relative to myfaces-maven-achetypes ? MyFaces Facelets Archetype #273
Archived 2 artifacts
Archive block size is 32768
Received 0 blocks and 26729 bytes
Compression is 0.0%
Took 16 ms
[JENKINS] Archiving /home/jenkins/jenkins-slave/maven-repositories/1/org/apache/myfaces/buildtools/myfaces-archetype-parent/1.0.5-SNAPSHOT/myfaces-archetype-parent-1.0.5-SNAPSHOT.pom
to org.apache.myfaces.buildtools/myfaces-archetype-parent/1.0.5-SNAPSHOT/myfaces-archetype-parent-1.0.5-SNAPSHOT.pom
[JENKINS] Archiving <https://builds.apache.org/job/myfaces-maven-achetypes/ws/maven2-archetypes/target/myfaces-archetype-parent-1.0.5-SNAPSHOT-site.xml>
to org.apache.myfaces.buildtools/myfaces-archetype-parent/1.0.5-SNAPSHOT/myfaces-archetype-parent-1.0.5-SNAPSHOT-site.xml
/x1/jenkins/jenkins-slave/maven-repositories/1/org/apache/myfaces/buildtools/myfaces-archetype-parent/1.0.5-SNAPSHOT/myfaces-archetype-parent-1.0.5-SNAPSHOT.pom
is not inside /x1/jenkins/jenkins-slave/workspace/myfaces-maven-achetypes/maven2-archetypes/;
will archive in a separate pass
Sending artifact delta relative to myfaces-maven-achetypes ? Apache MyFaces Buildtools Maven2
Archetype Parent #273
Archived 1 artifacts
Archive block size is 32768
Received 0 blocks and 2411 bytes
Compression is 0.0%
Took 43 ms
Sending artifact delta relative to myfaces-maven-achetypes ? Apache MyFaces Buildtools Maven2
Archetype Parent #273
Archived 1 artifacts
Archive block size is 32768
Received 0 blocks and 4879 bytes
Compression is 0.0%
Took 6 ms
[JENKINS] Archiving <https://builds.apache.org/job/myfaces-maven-achetypes/ws/maven2-archetypes/myfaces-archetype-helloworld20-owb/pom.xml>
to org.apache.myfaces.buildtools/myfaces-archetype-helloworld20-owb/1.0.5-SNAPSHOT/myfaces-archetype-helloworld20-owb-1.0.5-SNAPSHOT.pom
[JENKINS] Archiving <https://builds.apache.org/job/myfaces-maven-achetypes/ws/maven2-archetypes/myfaces-archetype-helloworld20-owb/target/myfaces-archetype-helloworld20-owb-1.0.5-SNAPSHOT.jar>
to org.apache.myfaces.buildtools/myfaces-archetype-helloworld20-owb/1.0.5-SNAPSHOT/myfaces-archetype-helloworld20-owb-1.0.5-SNAPSHOT.jar
Sending artifact delta relative to myfaces-maven-achetypes ? MyFaces 2.0 and OWB Basic Archetype
#273
Archived 2 artifacts
Archive block size is 32768
Received 0 blocks and 27723 bytes
Compression is 0.0%
Took 32 ms
[JENKINS] Archiving <https://builds.apache.org/job/myfaces-maven-achetypes/ws/maven2-archetypes/myfaces-archetype-jsfcomponents20/pom.xml>
to org.apache.myfaces.buildtools/myfaces-archetype-jsfcomponents20/1.0.5-SNAPSHOT/myfaces-archetype-jsfcomponents20-1.0.5-SNAPSHOT.pom
[JENKINS] Archiving <https://builds.apache.org/job/myfaces-maven-achetypes/ws/maven2-archetypes/myfaces-archetype-jsfcomponents20/target/myfaces-archetype-jsfcomponents20-1.0.5-SNAPSHOT.jar>
to org.apache.myfaces.buildtools/myfaces-archetype-jsfcomponents20/1.0.5-SNAPSHOT/myfaces-archetype-jsfcomponents20-1.0.5-SNAPSHOT.jar
Sending artifact delta relative to myfaces-maven-achetypes ? JSF Component Library Archetype
For JSF 2.0 #273
Archived 2 artifacts
Archive block size is 32768
Received 0 blocks and 74858 bytes
Compression is 0.0%
Took 60 ms
[JENKINS] Archiving <https://builds.apache.org/job/myfaces-maven-achetypes/ws/maven2-archetypes/myfaces-archetype-helloworld20/pom.xml>
to org.apache.myfaces.buildtools/myfaces-archetype-helloworld20/1.0.5-SNAPSHOT/myfaces-archetype-helloworld20-1.0.5-SNAPSHOT.pom
[JENKINS] Archiving <https://builds.apache.org/job/myfaces-maven-achetypes/ws/maven2-archetypes/myfaces-archetype-helloworld20/target/myfaces-archetype-helloworld20-1.0.5-SNAPSHOT.jar>
to org.apache.myfaces.buildtools/myfaces-archetype-helloworld20/1.0.5-SNAPSHOT/myfaces-archetype-helloworld20-1.0.5-SNAPSHOT.jar
Sending artifact delta relative to myfaces-maven-achetypes ? MyFaces 2.0 Basic Archetype #273
Archived 2 artifacts
Archive block size is 32768
Received 0 blocks and 25178 bytes
Compression is 0.0%
Took 36 ms
[JENKINS] Archiving <https://builds.apache.org/job/myfaces-maven-achetypes/ws/maven2-archetypes/myfaces-archetype-helloworld/pom.xml>
to org.apache.myfaces.buildtools/myfaces-archetype-helloworld/1.0.5-SNAPSHOT/myfaces-archetype-helloworld-1.0.5-SNAPSHOT.pom
[JENKINS] Archiving <https://builds.apache.org/job/myfaces-maven-achetypes/ws/maven2-archetypes/myfaces-archetype-helloworld/target/myfaces-archetype-helloworld-1.0.5-SNAPSHOT.jar>
to org.apache.myfaces.buildtools/myfaces-archetype-helloworld/1.0.5-SNAPSHOT/myfaces-archetype-helloworld-1.0.5-SNAPSHOT.jar
Sending artifact delta relative to myfaces-maven-achetypes ? MyFaces Basic Archetype #273
Archived 2 artifacts
Archive block size is 32768
Received 0 blocks and 25255 bytes
Compression is 0.0%
Took 13 ms
[JENKINS] Archiving <https://builds.apache.org/job/myfaces-maven-achetypes/ws/maven2-archetypes/myfaces-archetype-trinidad/pom.xml>
to org.apache.myfaces.buildtools/myfaces-archetype-trinidad/1.0.5-SNAPSHOT/myfaces-archetype-trinidad-1.0.5-SNAPSHOT.pom
[JENKINS] Archiving <https://builds.apache.org/job/myfaces-maven-achetypes/ws/maven2-archetypes/myfaces-archetype-trinidad/target/myfaces-archetype-trinidad-1.0.5-SNAPSHOT.jar>
to org.apache.myfaces.buildtools/myfaces-archetype-trinidad/1.0.5-SNAPSHOT/myfaces-archetype-trinidad-1.0.5-SNAPSHOT.jar
Sending artifact delta relative to myfaces-maven-achetypes ? MyFaces Trinidad Archetype #273
Archived 2 artifacts
Archive block size is 32768
Received 0 blocks and 20491 bytes
Compression is 0.0%
Took 15 ms
[JENKINS] Archiving <https://builds.apache.org/job/myfaces-maven-achetypes/ws/maven2-archetypes/myfaces-archetype-extscript-jsf20/pom.xml>
to org.apache.myfaces.buildtools/myfaces-archetype-extscript-jsf20/1.0.5-SNAPSHOT/myfaces-archetype-extscript-jsf20-1.0.5-SNAPSHOT.pom
[JENKINS] Archiving <https://builds.apache.org/job/myfaces-maven-achetypes/ws/maven2-archetypes/myfaces-archetype-extscript-jsf20/target/myfaces-archetype-extscript-jsf20-1.0.5-SNAPSHOT.jar>
to org.apache.myfaces.buildtools/myfaces-archetype-extscript-jsf20/1.0.5-SNAPSHOT/myfaces-archetype-extscript-jsf20-1.0.5-SNAPSHOT.jar
Sending artifact delta relative to myfaces-maven-achetypes ? MyFaces Extscript Archetype for
JSF 2.0 #273
Archived 2 artifacts
Archive block size is 32768
Received 0 blocks and 24583 bytes
Compression is 0.0%
Took 15 ms
[JENKINS] Archiving <https://builds.apache.org/job/myfaces-maven-achetypes/ws/maven2-archetypes/myfaces-archetype-core-integration-test/pom.xml>
to org.apache.myfaces.buildtools/myfaces-archetype-core-integration-test/1.0.5-SNAPSHOT/myfaces-archetype-core-integration-test-1.0.5-SNAPSHOT.pom
[JENKINS] Archiving <https://builds.apache.org/job/myfaces-maven-achetypes/ws/maven2-archetypes/myfaces-archetype-core-integration-test/target/myfaces-archetype-core-integration-test-1.0.5-SNAPSHOT.jar>
to org.apache.myfaces.buildtools/myfaces-archetype-core-integration-test/1.0.5-SNAPSHOT/myfaces-archetype-core-integration-test-1.0.5-SNAPSHOT.jar
Sending artifact delta relative to myfaces-maven-achetypes ? MyFaces Core Integration Test
Archetype #273
Archived 2 artifacts
Archive block size is 32768
Received 0 blocks and 22470 bytes
Compression is 0.0%
Took 15 ms
[JENKINS] Archiving <https://builds.apache.org/job/myfaces-maven-achetypes/ws/maven2-archetypes/myfaces-archetype-codi-jsf12/pom.xml>
to org.apache.myfaces.buildtools/myfaces-archetype-codi-jsf12/1.0.5-SNAPSHOT/myfaces-archetype-codi-jsf12-1.0.5-SNAPSHOT.pom
[JENKINS] Archiving <https://builds.apache.org/job/myfaces-maven-achetypes/ws/maven2-archetypes/myfaces-archetype-codi-jsf12/target/myfaces-archetype-codi-jsf12-1.0.5-SNAPSHOT.jar>
to org.apache.myfaces.buildtools/myfaces-archetype-codi-jsf12/1.0.5-SNAPSHOT/myfaces-archetype-codi-jsf12-1.0.5-SNAPSHOT.jar
Sending artifact delta relative to myfaces-maven-achetypes ? MyFaces CODI Archetype for JSF
1.2 #273
Archived 2 artifacts
Archive block size is 32768
Received 0 blocks and 26639 bytes
Compression is 0.0%
Took 17 ms
channel stopped
Maven RedeployPublisher use remote ubuntu3 maven settings from : /home/jenkins/.m2/settings.xml
[INFO] Deployment in https://repository.apache.org/content/repositories/snapshots (id=apache.snapshots.https,uniqueVersion=false)
Deploying the main artifact myfaces-archetype-codi-jsf12-1.0.5-SNAPSHOT.jar
ERROR: Error retrieving previous build number for artifact 'org.apache.myfaces.buildtools:myfaces-archetype-codi-jsf12:jar':
repository metadata for: 'snapshot org.apache.myfaces.buildtools:myfaces-archetype-codi-jsf12:1.0.5-SNAPSHOT'
could not be retrieved from repository: apache.snapshots.https due to an error: Failed to
transfer file: https://repository.apache.org/content/repositories/snapshots/org/apache/myfaces/buildtools/myfaces-archetype-codi-jsf12/1.0.5-SNAPSHOT/maven-metadata.xml.
Return code is: 502 , ReasonPhrase:Proxy Error.
org.apache.maven.artifact.deployer.ArtifactDeploymentException: Error retrieving previous
build number for artifact 'org.apache.myfaces.buildtools:myfaces-archetype-codi-jsf12:jar':
repository metadata for: 'snapshot org.apache.myfaces.buildtools:myfaces-archetype-codi-jsf12:1.0.5-SNAPSHOT'
could not be retrieved from repository: apache.snapshots.https due to an error: Failed to
transfer file: https://repository.apache.org/content/repositories/snapshots/org/apache/myfaces/buildtools/myfaces-archetype-codi-jsf12/1.0.5-SNAPSHOT/maven-metadata.xml.
Return code is: 502 , ReasonPhrase:Proxy Error.
	at hudson.maven.artifact.transform.SnapshotTransformation.transformForDeployment(SnapshotTransformation.java:110)
	at hudson.maven.artifact.transform.DefaultArtifactTransformationManager.transformForDeployment(DefaultArtifactTransformationManager.java:69)
	at hudson.maven.artifact.deployer.DefaultArtifactDeployer.deploy(DefaultArtifactDeployer.java:92)
	at hudson.maven.reporters.MavenArtifactRecord.deploy(MavenArtifactRecord.java:193)
	at hudson.maven.RedeployPublisher.perform(RedeployPublisher.java:176)
	at hudson.tasks.BuildStepMonitor$1.perform(BuildStepMonitor.java:20)
	at hudson.model.AbstractBuild$AbstractBuildExecution.perform(AbstractBuild.java:756)
	at hudson.model.AbstractBuild$AbstractBuildExecution.performAllBuildSteps(AbstractBuild.java:720)
	at hudson.maven.MavenModuleSetBuild$MavenModuleSetBuildExecution.post2(MavenModuleSetBuild.java:1037)
	at hudson.model.AbstractBuild$AbstractBuildExecution.post(AbstractBuild.java:669)
	at hudson.model.Run.execute(Run.java:1731)
	at hudson.maven.MavenModuleSetBuild.run(MavenModuleSetBuild.java:529)
	at hudson.model.ResourceController.execute(ResourceController.java:88)
	at hudson.model.Executor.run(Executor.java:232)
Caused by: org.apache.maven.artifact.repository.metadata.RepositoryMetadataResolutionException:
repository metadata for: 'snapshot org.apache.myfaces.buildtools:myfaces-archetype-codi-jsf12:1.0.5-SNAPSHOT'
could not be retrieved from repository: apache.snapshots.https due to an error: Failed to
transfer file: https://repository.apache.org/content/repositories/snapshots/org/apache/myfaces/buildtools/myfaces-archetype-codi-jsf12/1.0.5-SNAPSHOT/maven-metadata.xml.
Return code is: 502 , ReasonPhrase:Proxy Error.
	at org.apache.maven.artifact.repository.metadata.DefaultRepositoryMetadataManager.resolveAlways(DefaultRepositoryMetadataManager.java:397)
	at hudson.maven.artifact.transform.SnapshotTransformation.resolveLatestSnapshotBuildNumber(SnapshotTransformation.java:160)
	at hudson.maven.artifact.transform.SnapshotTransformation.transformForDeployment(SnapshotTransformation.java:104)
	... 13 more
Caused by: org.apache.maven.wagon.TransferFailedException: Failed to transfer file: https://repository.apache.org/content/repositories/snapshots/org/apache/myfaces/buildtools/myfaces-archetype-codi-jsf12/1.0.5-SNAPSHOT/maven-metadata.xml.
Return code is: 502 , ReasonPhrase:Proxy Error.
	at org.apache.maven.wagon.shared.http4.AbstractHttpClientWagon.fillInputData(AbstractHttpClientWagon.java:945)
	at org.apache.maven.wagon.StreamWagon.getInputStream(StreamWagon.java:116)
	at org.apache.maven.wagon.StreamWagon.getIfNewer(StreamWagon.java:88)
	at org.apache.maven.wagon.StreamWagon.get(StreamWagon.java:61)
	at org.apache.maven.repository.legacy.DefaultWagonManager.getRemoteFile(DefaultWagonManager.java:351)
	at org.apache.maven.repository.legacy.DefaultWagonManager.getArtifactMetadataFromDeploymentRepository(DefaultWagonManager.java:215)
	at org.apache.maven.artifact.repository.metadata.DefaultRepositoryMetadataManager.getArtifactMetadataFromDeploymentRepository(DefaultRepositoryMetadataManager.java:421)
	at org.apache.maven.artifact.repository.metadata.DefaultRepositoryMetadataManager.resolveAlways(DefaultRepositoryMetadataManager.java:393)
	... 15 more
[INFO] Deployment failed after 1 min 0 sec
Build step 'Deploy artifacts to Maven repository' changed build result to FAILURE

Mime
View raw message